{"text_format":"1","workbook":"xlsx","n_sheets":8,"sheets":["Painel","Dashboard","Cálculos","Lançamento","Data","Dados","GRAF COMERCIAL ","listas"],"not_rendered":{"charts":2,"images":1,"macros":1,"external_links":3,"defined_names":31,"comments":0,"pivot_tables":0},"unopened":[],"bounds":{"document_bytes":16777216,"sheet_cells":100000,"rows_first":2000,"rows_last":500,"rows_between":2000,"halvings":0,"cell_chars":16384,"cell_head_chars":4096},"cells_cut":0,"cells_raw":0,"read":"whole","date_system":"1900"}

{"sheet":"Painel","index":0,"n_rows":31,"n_cols":25,"rows_kept":31,"cut":false,"hidden":true,"merged":[[3,4,3,13],[5,4,5,5],[5,7,5,9],[5,11,5,13],[25,4,26,4],[27,4,28,4],[29,4,30,4],[11,4,13,4],[9,4,10,4],[14,4,21,4],[22,4,24,4]]}
[]
[null,null,null,null,null,null,null,null,null,null,null,null,null,null,null,null,null,null,null,null,null,1,null,{"$f":"listas!G2","v":9}]
[null,null,null,null,null,null,null,null,null,null,null,null,null,null,null,null,null,null,null,null,null,"Ano",null,"Mês"]
[null,null,null,null,null,null,null,null,null,null,null,null,null,null,null,null,null,null,null,null,null,2020,1,"Janeiro","JAN"]
[null,null,null,null,null,null,null,null,null,null,null,null,null,null,null,null,null,null,null,null,null,2021,2,"Fevereiro","FEV"]
[null,null,null,null,"PAINEL DE CONTROLE DE INDICADORES ",null,null,{"$f":"UPPER(VLOOKUP(listas!G2,listas!E3:G14,3,TRUE)& \" \"&VLOOKUP(listas!C2,listas!A3:B12,2,TRUE))","v":"SETEMBRO 2020"},null,null,null,{"$f":"IF(listas!G2=1,H6,\"ACUMULADO \"&listas!D2&\" JAN / \"&VLOOKUP(listas!G2,listas!E3:G14,2,TRUE)&\" \"&listas!D2)","v":"ACUMULADO 2020 JAN / SET 2020"},null,null,null,null,null,null,null,null,null,2022,3,"Março","MAR"]
[null,null,null,null,null,null,null,null,null,null,null,null,null,null,null,null,null,null,null,null,null,2023,4,"Abril","ABR"]
[null,null,null,null,"Processo","Indicador",null,"Meta","Realizado","Status",null,"Meta","Realizado","Status",null,null,null,null,null,null,null,2024,5,"Maio","MAI"]
[null,null,null,null,null,null,null,null,null,null,null,null,null,null,null,null,null,null,null,null,null,2025,6,"Junho","JUN"]
[null,null,null,null,"INDICADOR COMERCIAL ",{"$f":"Lançamento!B4","v":"SATISFAÇÃO DE CLIENTE NPS"},null,{"$f":"VLOOKUP(X2,Lançamento!B8:G19,3,0)","v":60},{"$f":"VLOOKUP(X2,Lançamento!B8:G19,4,0)","v":57},{"$f":"IF(I10=\"\",\"\",H10/I10)","v":1.0526315789473684},null,{"$f":"AVERAGEIFS(Lançamento!D8:D19,Lançamento!B8:B19,\"<=\"&X2)","v":60},{"$f":"AVERAGEIFS(Lançamento!E8:E19,Lançamento!B8:B19,\"<=\"&X2)","v":34.333333333333336},{"$f":"M10/L10","v":0.5722222222222223},null,null,null,null,null,null,null,2026,7,"Julho","JUL"]
[null,null,null,null,null,{"$f":"Lançamento!I4","v":"FATURAMENTO MENSAL "},null,{"$f":"VLOOKUP(X2,Lançamento!I7:N20,3,0)","v":7387825},{"$f":"VLOOKUP(X2,Lançamento!I7:N20,4,0)","v":7565275},{"$f":"IF(I11=\"\",\"\",H11/I11)","v":0.97654414413223578},null,{"$f":"AVERAGEIFS(Lançamento!K8:K19,Lançamento!I8:I19,\"<=\"&X2)","v":6824488.888888889},{"$f":"AVERAGEIFS(Lançamento!L8:L19,Lançamento!I8:I19,\"<=\"&X2)","v":6801486.5844444446},{"$f":"M11/L11","v":0.99662944656824115},null,null,null,null,null,null,null,null,8,"Agosto","AGO"]
[null,null,null,null,{"$f":"Lançamento!P2","v":"INDICADOR DA PRODUÇÃO"},{"$f":"Lançamento!P4","v":"EFICIÊNCIA DE MÃO DE OBRA "},null,{"$f":"VLOOKUP(X2,Lançamento!P8:T19,3,0)","v":0.82},{"$f":"VLOOKUP(X2,Lançamento!P8:T19,4,0)","v":0.91938260624690249},{"$f":"IF(H12=\"\",\"\",I12/H12)","v":1.1211983003011006},null,{"$f":"AVERAGEIFS(Lançamento!R8:R19,Lançamento!P8:P19,\"<=\"&X2)","v":0.78222222222222226},{"$f":"AVERAGEIFS(Lançamento!S8:S19,Lançamento!P8:P19,\"<=\"&X2)","v":0.83924832258593085},{"$f":"M12/L12","v":1.0729026851240593},null,null,null,null,null,null,null,2026,7,"Julho","JUL"]
[null,null,null,null,null,{"$f":"Lançamento!W4","v":"REJEIÇÃO INTERNA "},null,{"$f":"VLOOKUP(X2,Lançamento!W8:AA19,3,0)","v":3.5000000000000003E-2},{"$f":"VLOOKUP(X2,Lançamento!W8:AA19,4)","v":5.2500000000000005E-2},1.5,null,{"$f":"AVERAGEIFS(Lançamento!Y8:Y19,Lançamento!W8:W19,\"<=\"&X2)","v":4.2222222222222237E-2},{"$f":"AVERAGEIFS(Lançamento!Z8:Z19,Lançamento!W8:W19,\"<=\"&X2)","v":4.2888888888888893E-2},{"$f":"M13/L13","v":1.0157894736842104},null,null,null,null,null,null,null,null,8,"Agosto","AGO"]
[null,null,null,null,null,{"$f":"Lançamento!AD4","v":"HORAS DE RETRABALHO "},null,{"$f":"VLOOKUP(X2,Lançamento!AD8:AH19,3,0)","v":500},{"$f":"VLOOKUP(X2,Lançamento!AD8:AH19,4,0)","v":691},1.3819999999999999,null,{"$f":"AVERAGEIFS(Lançamento!AF8:AF19,Lançamento!AD8:AD19,\"<=\"&X2)","v":533.33333333333337},{"$f":"AVERAGEIFS(Lançamento!AG8:AG19,Lançamento!AD8:AD19,\"<=\"&X2)","v":770.67888888888888},{"$f":"M14/L14","v":1.4450229166666666}]
[null,null,null,null,{"$f":"Lançamento!B21","v":"INDICADOR DE PROCESSO"},{"$f":"Lançamento!B23","v":"OEE SOPRO"},null,{"$f":"VLOOKUP(X2,Lançamento!B27:F38,3,0)","v":0.504817764},{"$f":"VLOOKUP(X2,Lançamento!B27:F38,4,0)","v":0.90600000000000003},1.7947070499682338,null,{"$f":"AVERAGEIFS(Lançamento!E27:E38,Lançamento!B27:B38,\"<=\"&X2)","v":0.92322222222222239},{"$f":"AVERAGEIFS(Lançamento!Y27:Y38,Lançamento!AD8:AD19,\"<=\"&X2)","v":0.64640157177777768},{"$f":"IF(L15=\"\",\"\",M15/L15)","v":0.70015815934528802}]
[null,null,null,null,null,{"$f":"Lançamento!I23","v":"OEE INJEÇÃO"},null,{"$f":"VLOOKUP(X2,Lançamento!I27:M389,3,0)","v":0.68800735199999996},{"$f":"VLOOKUP(X2,Lançamento!I27:M389,4,0)","v":0.97799999999999998},1.4214964377299271,null,{"$f":"AVERAGEIFS(Lançamento!L27:L38,Lançamento!B27:B38,\"<=\"&X2)","v":0.97966666666666691},{"$f":"AVERAGEIFS(Lançamento!L27:L38,Lançamento!AD8:AD19,\"<=\"&X2)","v":0.97966666666666691},1]
[null,null,null,null,null,{"$f":"Lançamento!P23","v":"OEE PET"},null,{"$f":"VLOOKUP(X2,Lançamento!P27:T38,3,0)","v":0.74},{"$f":"VLOOKUP(X2,Lançamento!P27:T38,4,0)","v":0.79561145999999994},1.0751506216216216,null,{"$f":"AVERAGEIFS(Lançamento!S27:S38,Lançamento!B27:B38,\"<=\"&X2)","v":0.74689103622222219},{"$f":"AVERAGEIFS(Lançamento!S27:S38,Lançamento!AD8:AD19,\"<=\"&X2)","v":0.74689103622222219},1]
[null,null,null,null,null,{"$f":"Lançamento!W23","v":"OEE DECORAÇÃO"},null,{"$f":"VLOOKUP(X2,Lançamento!W27:AA38,3,0)","v":0.72784614399999992},{"$f":"VLOOKUP(X2,Lançamento!W27:AA38,4,0)","v":0.97599999999999998},1.3409427363813857,null,{"$f":"AVERAGEIFS(Lançamento!Z27:Z38,Lançamento!B27:B38,\"<=\"&X2)","v":0.97211111111111093},{"$f":"AVERAGEIFS(Lançamento!Y27:Y38,Lançamento!AD8:AD19,\"<=\"&X2)","v":0.64640157177777768},0.66494618196365307,null,null,null,null,null,null,null,2026,7,"Julho","JUL"]
[null,null,null,null,null,{"$f":"Lançamento!AD23","v":"REFUGO SOPRO"},null,{"$f":"VLOOKUP(X2,Lançamento!AD27:AH38,3,0)","v":0.06},{"$f":"VLOOKUP(X2,Lançamento!AD27:AH38,4,0)","v":9.4170537096582116E-2},1.5695089516097021,null,{"$f":"AVERAGEIFS(Lançamento!AG27:AG38,Lançamento!B27:B38,\"<=\"&X2)","v":7.5076818379316235E-2},{"$f":"AVERAGEIFS(Lançamento!AF27:AF38,Lançamento!AD8:AD19,\"<=\"&X2)","v":6.355555555555556E-2},0.84654034264543632,null,null,null,null,null,null,null,null,8,"Agosto","AGO"]
[null,null,null,null,null,{"$f":"Lançamento!AK23","v":"REFUGO INJEÇÃO"},null,{"$f":"VLOOKUP(X2,Lançamento!AK27:AO38,3,0)","v":2.3E-2},{"$f":"VLOOKUP(X2,Lançamento!AK27:AO38,4,0)","v":2.1757290400972053E-2},0.94596914786835018,null,{"$f":"AVERAGEIFS(Lançamento!AU27:AU38,Lançamento!B27:B38,\"<=\"&X2)","v":2.7232429516227862E-2},{"$f":"AVERAGEIFS(Lançamento!AM27:AM38,Lançamento!AD8:AD19,\"<=\"&X2)","v":2.7111111111111107E-2},0.99554507595275477]
[null,null,null,null,null,{"$f":"Lançamento!AR23","v":"REFUGO PET"},null,{"$f":"VLOOKUP(X2,Lançamento!AR27:AV38,3,0)","v":2.5000000000000001E-2},{"$f":"VLOOKUP(X2,Lançamento!AR27:AV38,4,0)","v":3.0099036502451656E-2},1.2039614600980661,null,{"$f":"AVERAGEIFS(Lançamento!AU27:AU38,Lançamento!B27:B38,\"<=\"&X2)","v":2.7232429516227862E-2},{"$f":"AVERAGEIFS(Lançamento!AT27:AT38,Lançamento!AD8:AD19,\"<=\"&X2)","v":2.6555555555555554E-2},0.97514456210126399]
[null,null,null,null,null,{"$f":"Lançamento!AY23","v":"REFUGO DECORAÇÃO"},null,{"$f":"VLOOKUP(X2,Lançamento!AY27:BC38,3,0)","v":0.03},{"$f":"VLOOKUP(X2,Lançamento!AY27:BC38,4,0)","v":2.8320546253952656E-2},0.94401820846508855,null,{"$f":"AVERAGEIFS(Lançamento!BB27:BB38,Lançamento!B27:B38,\"<=\"&X2)","v":2.7579997749217391E-2},{"$f":"AVERAGEIFS(Lançamento!BA27:BA38,Lançamento!AD8:AD19,\"<=\"&X2)","v":3.0000000000000002E-2},1.0877448313370977]
[null,null,null,null,{"$f":"Lançamento!AK2","v":"INDICADOR DA QUALIDADE"},{"$f":"Lançamento!AK4","v":"RNC DE CLIENTE "},null,{"$f":"VLOOKUP(X2,Lançamento!AK8:AO19,3,0)","v":2},{"$f":"VLOOKUP(X2,Lançamento!AK8:AO19,4,0)","v":2},1,null,{"$f":"AVERAGEIFS(Lançamento!AN8:AN19,Lançamento!AK8:AK19,\"<=\"&X2)","v":4},{"$f":"AVERAGEIFS(Lançamento!AM8:AM19,Lançamento!AD8:AD19,\"<=\"&X2)","v":2.4444444444444446},0.61111111111111116,null,null,null,null,null,null,null,2026,7,"Julho","JUL"]
[null,null,null,null,null,{"$f":"Lançamento!AR4","v":"CUSTO NÃO QUALIDADE"},null,{"$f":"VLOOKUP(X2,Lançamento!AR8:AW20,3,0)","v":5.0000000000000001E-3},{"$f":"VLOOKUP(X2,Lançamento!AR8:AW20,4,0)","v":4.1000000000000003E-3},0.82000000000000006,null,{"$f":"AVERAGEIFS(Lançamento!AT8:AT19,Lançamento!AK8:AK19,\"<=\"&X2)","v":9.4444444444444463E-3},{"$f":"AVERAGEIFS(Lançamento!AU8:AU19,Lançamento!AD8:AD19,\"<=\"&X2)","v":1.1900000000000001E-2},1.2599999999999998,null,null,null,null,null,null,null,null,8,"Agosto","AGO"]
[null,null,null,null,null,{"$f":"Lançamento!AY4","v":"CERTIFICAÇÃO ISO 9001"},null,{"$f":"VLOOKUP(X2,Lançamento!AY8:BC19,3,0)","v":1},{"$f":"VLOOKUP(X2,Lançamento!AY8:BC19,4,0)","v":1},1,null,{"$f":"AVERAGEIFS(Lançamento!BB8:BB19,Lançamento!AK8:AK19,\"<=\"&X2)","v":0.91111111111111098},{"$f":"AVERAGEIFS(Lançamento!BA8:BA19,Lançamento!AD8:AD19,\"<=\"&X2)","v":1},1.0975609756097562]
[null,null,null,null,{"$f":"Lançamento!B40","v":"INDICADOR DO PCP"},{"$f":"Lançamento!B42","v":"OTIF"},null,{"$f":"VLOOKUP(X2,Lançamento!B46:F57,3,0)","v":0.95},{"$f":"VLOOKUP(X2,Lançamento!B46:F57,4,0)","v":0.95342465753424654},1.0036049026676279,null,{"$f":"AVERAGEIFS(Lançamento!D46:D57,Lançamento!B46:B57,\"<=\"&X2)","v":0.80444444444444452},{"$f":"AVERAGEIFS(Lançamento!E46:E57,Lançamento!AD8:AD19,\"<=\"&X2)","v":0.776730466155514},0.96554892201652287,null,null,null,null,null,null,null,2026,7,"Julho","JUL"]
[null,null,null,null,null,{"$f":"Lançamento!I42","v":"TAXA DE REPROGRAMAÇÃO "},null,{"$f":"VLOOKUP(X2,Lançamento!I46:M57,3,0)","v":0.2},{"$f":"VLOOKUP(X2,Lançamento!I46:M57,4,0)","v":0.104},0.51999999999999991,null,{"$f":"AVERAGEIFS(Lançamento!K46:K57,Lançamento!B46:B57,\"<=\"&X2)","v":0.28888888888888897},{"$f":"AVERAGEIFS(Lançamento!L46:L57,Lançamento!AD8:AD19,\"<=\"&X2)","v":0.18533333333333335},0.64153846153846139,null,null,null,null,null,null,null,null,8,"Agosto","AGO"]
[null,null,null,null,{"$f":"Lançamento!P40","v":"INDICADOR DE DESENVOLVIMENTO"},{"$f":"Lançamento!P42","v":"PROJETOS ENCERRADOS X CRONOGRAMA "},null,{"$f":"VLOOKUP(X2,Lançamento!P46:T57,3,0)","v":0.85},{"$f":"VLOOKUP(X2,Lançamento!P46:T57,4,0)","v":1},1.1764705882352942,null,{"$f":"AVERAGEIFS(Lançamento!R46:R57,Lançamento!AD8:AD19,\"<=\"&X2)","v":0.84999999999999987},{"$f":"AVERAGEIFS(Lançamento!S46:S57,Lançamento!B46:B57,\"<=\"&X2)","v":0.95757575757575752},1.126559714795009,null,null,null,null,null,null,null,2026,7,"Julho","JUL"]
[null,null,null,null,null,{"$f":"Lançamento!W42","v":"EXECUÇÃO DE TESTES "},null,{"$f":"VLOOKUP(X2,Lançamento!W46:AA57,3,0)","v":0.85},{"$f":"VLOOKUP(X2,Lançamento!W46:AA57,4,0)","v":0.9452054794520548},1.1120064464141821,null,{"$f":"AVERAGEIFS(Lançamento!Y46:Y57,Lançamento!B46:B57,\"<=\"&X2)","v":0.84999999999999987},{"$f":"AVERAGEIFS(Lançamento!S46:S57,Lançamento!AD8:AD19,\"<=\"&X2)","v":0.95757575757575752},1.126559714795009,null,null,null,null,null,null,null,null,8,"Agosto","AGO"]
[null,null,null,null,{"$f":"Lançamento!AD40","v":"INDICADORES DE RH"},{"$f":"Lançamento!AD42","v":"ABSENTEÍSMO "},null,{"$f":"VLOOKUP(X2,Lançamento!AD46:AH57,3,0)","v":0.02},{"$f":"VLOOKUP(X2,Lançamento!AD46:AH57,4,0)","v":3.7655078391274709E-2},1.8827539195637355,null,{"$f":"AVERAGEIFS(Lançamento!AF46:AF57,Lançamento!B46:B57,\"<=\"&X2)","v":0.02},{"$f":"AVERAGEIFS(Lançamento!AG46:AG57,Lançamento!AD8:AD19,\"<=\"&X2)","v":2.2721778283003514E-2},1.1360889141501758,null,null,null,null,null,null,null,2026,7,"Julho","JUL"]
[null,null,null,null,null,{"$f":"Lançamento!AK42","v":"TREINAMENTO "},null,{"$f":"VLOOKUP(X2,Lançamento!AK46:AO57,3,0)","v":0.5},{"$f":"VLOOKUP(X2,Lançamento!AK46:AO57,4,0)","v":0.57088414634146345},1.1417682926829269,null,{"$f":"AVERAGEIFS(Lançamento!AM46:AM57,Lançamento!B46:B57,\"<=\"&X2)","v":0.5},{"$f":"AVERAGEIFS(Lançamento!AN46:AN57,Lançamento!AD8:AD19,\"<=\"&X2)","v":0.62008637865172922},1.2401727573034584,null,null,null,null,null,null,null,null,8,"Agosto","AGO"]

{"sheet":"Dashboard","index":1,"n_rows":17,"n_cols":3,"rows_kept":17,"cut":false,"hidden":true,"merged":[]}
["Seleção de Indicador","EFICIÊNCIA DE MÃO DE OBRA ","Meta"]
["JAN",{"$f":"Cálculos!B2","v":0.73464406827734263},{"$f":"Cálculos!C2","v":70}]
["FEV",{"$f":"Cálculos!B3","v":0.77387242928497535},{"$f":"Cálculos!C3","v":71}]
["MAR",{"$f":"Cálculos!B4","v":0.842204436142444},{"$f":"Cálculos!C4","v":72}]
["ABR",{"$f":"Cálculos!B5","v":0.86017741548789262},{"$f":"Cálculos!C5","v":73}]
["MAI",{"$f":"Cálculos!B6","v":0.9057103007107522},{"$f":"Cálculos!C6","v":74}]
["JUN"]
["JUL"]
["AGO"]
["SET"]
["OUT"]
["NOV"]
["DEZ"]
[]
[]
[]
["Média",{"$f":"Cálculos!B13","v":1},{"$f":"Cálculos!C13","v":72}]

{"sheet":"Cálculos","index":2,"n_rows":13,"n_cols":3,"rows_kept":13,"cut":false,"hidden":true,"merged":[]}
["Mês ",{"$f":"Dashboard!B1","v":"EFICIÊNCIA DE MÃO DE OBRA "},"Meta "]
["JAN",{"$f":"INDEX(Data!$A$2:$E$7,MATCH(Cálculos!A2,Data!$A$2:$A$7,0),MATCH(Cálculos!$B$1,Data!$A$2:$E$2,0))","v":0.73464406827734263},{"$f":"INDEX(Data!$A$16:$E$21,MATCH(Cálculos!A2,Data!$A$16:$A$21,0),MATCH(Cálculos!$B$1,Data!$A$16:$E$16,0))","v":70}]
["FEV",{"$f":"INDEX(Data!$A$2:$E$7,MATCH(Cálculos!A3,Data!$A$2:$A$7,0),MATCH(Cálculos!$B$1,Data!$A$2:$E$2,0))","v":0.77387242928497535},{"$f":"INDEX(Data!$A$16:$E$21,MATCH(Cálculos!A3,Data!$A$16:$A$21,0),MATCH(Cálculos!$B$1,Data!$A$16:$E$16,0))","v":71}]
["MAR",{"$f":"INDEX(Data!$A$2:$E$7,MATCH(Cálculos!A4,Data!$A$2:$A$7,0),MATCH(Cálculos!$B$1,Data!$A$2:$E$2,0))","v":0.842204436142444},{"$f":"INDEX(Data!$A$16:$E$21,MATCH(Cálculos!A4,Data!$A$16:$A$21,0),MATCH(Cálculos!$B$1,Data!$A$16:$E$16,0))","v":72}]
["ABR",{"$f":"INDEX(Data!$A$2:$E$7,MATCH(Cálculos!A5,Data!$A$2:$A$7,0),MATCH(Cálculos!$B$1,Data!$A$2:$E$2,0))","v":0.86017741548789262},{"$f":"INDEX(Data!$A$16:$E$21,MATCH(Cálculos!A5,Data!$A$16:$A$21,0),MATCH(Cálculos!$B$1,Data!$A$16:$E$16,0))","v":73}]
["MAI",{"$f":"INDEX(Data!$A$2:$E$7,MATCH(Cálculos!A6,Data!$A$2:$A$7,0),MATCH(Cálculos!$B$1,Data!$A$2:$E$2,0))","v":0.9057103007107522},{"$f":"INDEX(Data!$A$16:$E$21,MATCH(Cálculos!A6,Data!$A$16:$A$21,0),MATCH(Cálculos!$B$1,Data!$A$16:$E$16,0))","v":74}]
["JUN"]
["JUL"]
["AGO"]
["SET"]
["OUT"]
["NOV"]
["DEZ",{"$f":"ROUND(AVERAGE(B2:B6),0)","v":1},{"$f":"ROUND(AVERAGE(C2:C6),0)","v":72}]

{"sheet":"Lançamento","index":3,"n_rows":57,"n_cols":56,"rows_kept":57,"cut":false,"hidden":true,"merged":[[24,1,24,3],[24,8,24,10],[3,15,3,20],[4,15,4,20],[5,15,5,17],[4,8,4,13],[5,8,5,10],[23,1,23,6],[24,15,24,17],[1,1,1,13],[3,8,3,13],[20,1,20,55],[22,22,22,27],[3,1,3,6],[4,1,4,6],[5,1,5,3],[1,15,1,34],[22,1,22,6],[22,8,22,13],[22,15,22,20],[3,22,3,27],[4,22,4,27],[5,22,5,24],[3,29,3,34],[4,29,4,34],[5,29,5,31],[23,15,23,20],[23,22,23,27],[23,29,23,34],[23,8,23,13],[24,43,24,45],[24,50,24,52],[24,22,24,24],[24,29,24,31],[22,36,22,41],[22,43,22,48],[22,29,22,34],[5,36,5,38],[5,43,5,45],[5,50,5,52],[39,1,39,13],[1,36,1,55],[3,36,3,41],[3,43,3,48],[3,50,3,55],[4,36,4,41],[4,43,4,48],[4,50,4,55],[22,50,22,55],[23,36,23,41],[23,43,23,48],[23,50,23,55],[24,36,24,38],[43,1,43,3],[43,8,43,10],[41,36,41,41],[42,1,42,6],[42,8,42,13],[42,15,42,20],[42,22,42,27],[42,29,42,34],[42,36,42,41],[41,1,41,6],[41,8,41,13],[43,36,43,38],[39,29,39,41],[41,29,41,34],[43,29,43,31],[39,15,39,27],[41,15,41,20],[41,22,41,27],[43,15,43,17],[43,22,43,24]]}
[]
[null,"INDICADOR COMERCIAL ",null,null,null,null,null,null,null,null,null,null,null,null,null,"INDICADOR DA PRODUÇÃO",null,null,null,null,null,null,null,null,null,null,null,null,null,null,null,null,null,null,null,null,"INDICADOR DA QUALIDADE"]
[]
[null,"SATISFAÇÃO DE CLIENTE NPS",null,null,null,null,null,null,"FATURAMENTO MENSAL ",null,null,null,null,null,null,"EFICIÊNCIA DE MÃO DE OBRA ",null,null,null,null,null,null,"REJEIÇÃO INTERNA ",null,null,null,null,null,null,"HORAS DE RETRABALHO ",null,null,null,null,null,null,"RNC DE CLIENTE ",null,null,null,null,null,null,"CUSTO NÃO QUALIDADE",null,null,null,null,null,null,"CERTIFICAÇÃO ISO 9001"]
[]
[null,"Mês Selecionado",null,null,{"$f":"listas!G2","v":9},"Status Mês",{"$f":"VLOOKUP($E$6,$B$8:$G$19,6,FALSE)","v":0.95},null,"Mês Selecionado",null,null,{"$f":"E6","v":9},"Status Mês",{"$f":"VLOOKUP($E$6,$I$8:$N$19,6,FALSE)","v":1.0240192478841879},null,"Mês Selecionado",null,null,{"$f":"E6","v":9},"Status Mês",{"$f":"VLOOKUP($E$6,$P$8:$U$19,6,FALSE)","v":1.1211983003011006},null,"Mês Selecionado",null,null,{"$f":"L6","v":9},"Status Mês",{"$f":"VLOOKUP(Z6,W8:AB19,6,FALSE)","v":1.5},null,"Mês Selecionado",null,null,{"$f":"Z6","v":9},"Status Mês",{"$f":"VLOOKUP(AG6,AD8:AI19,6,FALSE)","v":1.3819999999999999},null,"Mês Selecionado",null,null,{"$f":"Z6","v":9},"Status Mês",{"$f":"VLOOKUP(AN6,AK8:AP19,6,FALSE)","v":1},null,"Mês Selecionado",null,null,{"$f":"E6","v":9},"Status Mês",{"$f":"VLOOKUP(AU6,AR8:AW19,6,FALSE)","v":0.82000000000000006},null,"Mês Selecionado",null,null,{"$f":"Z6","v":9},"Status Mês",{"$f":"VLOOKUP(BB6,AY8:BD19,6,FALSE)","v":1}]
[null,null,null,"Meta","Realizado","Média","Status",null,null,null,"Meta","Realizado","Média","Status",null,null,null,"Meta","Realizado","Média","Status",null,null,null,"Meta","Realizado","Média","Status",null,null,null,"Meta","Realizado","Média","Status",null,null,null,"Meta","Realizado","Média","Status",null,null,null,"Meta","Realizado","Média","Status",null,null,null,"Meta","Realizado","Média","Status"]
[null,1,"JAN",{"$f":"IF('[3]Base Dados'!F$363=\"\",\"\",'[3]Base Dados'!F$363)","v":60},{"$f":"IF('[3]Base Dados'!F$362=\"\",\"\",'[3]Base Dados'!F$362)","v":23},{"$f":"AVERAGE(E8:E19)","v":34.333333333333336},{"$f":"IF(E8=\"\",\"\",E8/D8)","v":0.38333333333333336},null,1,"JAN",{"$f":"IF('[3]Base Dados'!F$371=\"\",\"\",'[3]Base Dados'!F$371)","v":5969034},{"$f":"IF('[3]Base Dados'!F$369=\"\",\"\",'[3]Base Dados'!F$369)","v":5920749},{"$f":"AVERAGE(L8:L19)","v":6801486.5844444446},{"$f":"IF(L8=\"\",\"\",L8/K8)","v":0.99191075138791307},null,1,"JAN",0.9,0.73464406827734263,{"$f":"AVERAGE(S8:S19)","v":0.83924832258593085},{"$f":"IF(S8=\"\",\"\",S8/R8)","v":0.81627118697482515},null,1,"JAN",{"$f":"IF('[3]Base Dados'!F$66=\"\",\"\",'[3]Base Dados'!F$66)","v":0.05},{"$f":"IF('[3]Base Dados'!F$63=\"\",\"\",'[3]Base Dados'!F$65)","v":3.3250000000000002E-2},{"$f":"AVERAGE(Z8:Z19)","v":4.2888888888888893E-2},{"$f":"IF(Z8=\"\",\"\",Z8/Y8)","v":0.66500000000000004},null,1,"JAN",{"$f":"IF('[3]Base Dados'!F$47=\"\",\"\",'[3]Base Dados'!F$47)","v":600},{"$f":"IF('[3]Base Dados'!F$46=\"\",\"\",'[3]Base Dados'!F$46)","v":521},{"$f":"AVERAGE(AG8:AG19)","v":770.67888888888888},{"$f":"IF(AG8=\"\",\"\",AG8/AF8)","v":0.86833333333333329},null,1,"JAN",{"$f":"IF('[3]Base Dados'!G$76=\"\",\"\",'[3]Base Dados'!G$76)","v":3},{"$f":"IF('[3]Base Dados'!G$75=\"\",\"\",'[3]Base Dados'!G$75)","v":2},{"$f":"AVERAGE(AN8:AN19)","v":3.8},{"$f":"IF(AN8=\"\",\"\",AN8/AM8)","v":0.66666666666666663},null,1,"JAN",{"$f":"IF('[3]Base Dados'!F$55=\"\",\"\",'[3]Base Dados'!F$55)","v":1.4999999999999999E-2},{"$f":"IF('[3]Base Dados'!F$54=\"\",\"\",'[3]Base Dados'!F$54)","v":2.9999999999999997E-4},{"$f":"AVERAGE(AU8:AU19)","v":1.1900000000000001E-2},{"$f":"IF(AU8=\"\",\"\",AU8/AT8)","v":0.02},null,1,"JAN",1,0.7,{"$f":"AVERAGE(BB8:BB19)","v":0.93333333333333324},{"$f":"IF(BB8=\"\",\"\",BB8/BA8)","v":0.7}]
[null,2,"FEV",{"$f":"IF('[3]Base Dados'!G$363=\"\",\"\",'[3]Base Dados'!G$363)","v":60},{"$f":"IF('[3]Base Dados'!G$362=\"\",\"\",'[3]Base Dados'!G$362)","v":23},{"$f":"F8","v":34.333333333333336},0.38333333333333336,null,2,"FEV",{"$f":"IF('[3]Base Dados'!G$371=\"\",\"\",'[3]Base Dados'!G$371)","v":7134119},{"$f":"IF('[3]Base Dados'!G$369=\"\",\"\",'[3]Base Dados'!G$369)","v":6728756},{"$f":"M8","v":6801486.5844444446},0.94317966941678433,null,2,"FEV",0.7,0.77387242928497535,{"$f":"T8","v":0.83924832258593085},1.1055320418356791,null,2,"FEV",{"$f":"IF('[3]Base Dados'!G$66=\"\",\"\",'[3]Base Dados'!G$66)","v":0.05},{"$f":"IF('[3]Base Dados'!G$63=\"\",\"\",'[3]Base Dados'!G$65)","v":3.5499999999999997E-2},{"$f":"AA8","v":4.2888888888888893E-2},0.70999999999999985,null,2,"FEV",{"$f":"IF('[3]Base Dados'!G$47=\"\",\"\",'[3]Base Dados'!G$47)","v":600},{"$f":"IF('[3]Base Dados'!G$46=\"\",\"\",'[3]Base Dados'!G$46)","v":1006.21},{"$f":"AH8","v":770.67888888888888},1.6770166666666668,null,2,"FEV",{"$f":"IF('[3]Base Dados'!H$76=\"\",\"\",'[3]Base Dados'!H$76)","v":3},{"$f":"IF('[3]Base Dados'!H$75=\"\",\"\",'[3]Base Dados'!H$75)","v":2},{"$f":"AO8","v":3.8},0.66666666666666663,null,2,"FEV",{"$f":"IF('[3]Base Dados'!G$55=\"\",\"\",'[3]Base Dados'!G$55)","v":1.4999999999999999E-2},{"$f":"IF('[3]Base Dados'!G$54=\"\",\"\",'[3]Base Dados'!G$54)","v":3.8999999999999998E-3},{"$f":"AV8","v":1.1900000000000001E-2},0.26,null,2,"FEV",1,0.8,{"$f":"BC8","v":0.93333333333333324},0.8]
[null,3,"MAR",{"$f":"IF('[3]Base Dados'!H$363=\"\",\"\",'[3]Base Dados'!H$363)","v":60},{"$f":"IF('[3]Base Dados'!H$362=\"\",\"\",'[3]Base Dados'!H$362)","v":23},{"$f":"F9","v":34.333333333333336},0.38333333333333336,null,3,"MAR",{"$f":"IF('[3]Base Dados'!H$371=\"\",\"\",'[3]Base Dados'!H$371)","v":7102330},{"$f":"IF('[3]Base Dados'!H$369=\"\",\"\",'[3]Base Dados'!H$369)","v":6056838},{"$f":"M9","v":6801486.5844444446},0.85279591345375394,null,3,"MAR",0.7,0.842204436142444,{"$f":"T9","v":0.83924832258593085},1.2031491944892059,null,3,"MAR",{"$f":"IF('[3]Base Dados'!H$66=\"\",\"\",'[3]Base Dados'!H$66)","v":0.05},{"$f":"IF('[3]Base Dados'!H$63=\"\",\"\",'[3]Base Dados'!H$65)","v":2.5999999999999999E-2},{"$f":"AA9","v":4.2888888888888893E-2},0.51999999999999991,null,3,"MAR",{"$f":"IF('[3]Base Dados'!H$47=\"\",\"\",'[3]Base Dados'!H$47)","v":600},{"$f":"IF('[3]Base Dados'!H$46=\"\",\"\",'[3]Base Dados'!H$46)","v":789.62},{"$f":"AH9","v":770.67888888888888},1.3160333333333334,null,3,"MAR",{"$f":"IF('[3]Base Dados'!I$76=\"\",\"\",'[3]Base Dados'!I$76)","v":3},{"$f":"IF('[3]Base Dados'!I$75=\"\",\"\",'[3]Base Dados'!I$75)","v":6},{"$f":"AO9","v":3.8},2,null,3,"MAR",{"$f":"IF('[3]Base Dados'!H$55=\"\",\"\",'[3]Base Dados'!H$55)","v":1.4999999999999999E-2},{"$f":"IF('[3]Base Dados'!H$54=\"\",\"\",'[3]Base Dados'!H$54)","v":4.3E-3},{"$f":"AV9","v":1.1900000000000001E-2},0.28666666666666668,null,3,"MAR",1,0.9,{"$f":"BC9","v":0.93333333333333324},0.9]
[null,4,"ABR",{"$f":"IF('[3]Base Dados'!I$363=\"\",\"\",'[3]Base Dados'!I$363)","v":60},{"$f":"IF('[3]Base Dados'!I$362=\"\",\"\",'[3]Base Dados'!I$362)","v":23},34.333333333333336,0.38333333333333336,null,4,"ABR",{"$f":"IF('[3]Base Dados'!I$371=\"\",\"\",'[3]Base Dados'!I$371)","v":6681373},{"$f":"IF('[3]Base Dados'!I$369=\"\",\"\",'[3]Base Dados'!I$369)","v":7056727},6801486.5844444446,1.056179171556505,null,4,"ABR",0.7,0.86017741548789262,0.83924832258593085,1.228824879268418,null,4,"ABR",{"$f":"IF('[3]Base Dados'!I$66=\"\",\"\",'[3]Base Dados'!I$66)","v":4.4999999999999998E-2},{"$f":"IF('[3]Base Dados'!I$63=\"\",\"\",'[3]Base Dados'!I$65)","v":2.75E-2},4.2888888888888893E-2,0.61111111111111116,null,4,"ABR",{"$f":"IF('[3]Base Dados'!I$47=\"\",\"\",'[3]Base Dados'!I$47)","v":500},{"$f":"IF('[3]Base Dados'!I$46=\"\",\"\",'[3]Base Dados'!I$46)","v":148.72},770.67888888888888,0.29743999999999998,null,4,"ABR",{"$f":"IF('[3]Base Dados'!J$76=\"\",\"\",'[3]Base Dados'!J$76)","v":3},{"$f":"IF('[3]Base Dados'!J$75=\"\",\"\",'[3]Base Dados'!J$75)","v":3},3.8,1,null,4,"ABR",{"$f":"IF('[3]Base Dados'!I$55=\"\",\"\",'[3]Base Dados'!I$55)","v":1.4999999999999999E-2},{"$f":"IF('[3]Base Dados'!I$54=\"\",\"\",'[3]Base Dados'!I$54)","v":3.0999999999999999E-3},1.1900000000000001E-2,0.20666666666666667,null,4,"ABR",1,0.9,0.93333333333333324,0.9]
[null,5,"MAI",{"$f":"IF('[3]Base Dados'!J$363=\"\",\"\",'[3]Base Dados'!J$363)","v":60},{"$f":"IF('[3]Base Dados'!J$362=\"\",\"\",'[3]Base Dados'!J$362)","v":23},34.333333333333336,0.38333333333333336,null,5,"MAI",{"$f":"IF('[3]Base Dados'!J$371=\"\",\"\",'[3]Base Dados'!J$371)","v":6417033},{"$f":"IF('[3]Base Dados'!J$369=\"\",\"\",'[3]Base Dados'!J$369)","v":6779006.2599999998},6801486.5844444446,1.0564081967476247,null,5,"MAI",0.8,0.9057103007107522,0.83924832258593085,1.1321378758884402,null,5,"MAI",{"$f":"IF('[3]Base Dados'!J$66=\"\",\"\",'[3]Base Dados'!J$66)","v":0.04},{"$f":"IF('[3]Base Dados'!J$63=\"\",\"\",'[3]Base Dados'!J$65)","v":3.4500000000000003E-2},4.2888888888888893E-2,0.86250000000000004,null,5,"MAI",{"$f":"IF('[3]Base Dados'!J$47=\"\",\"\",'[3]Base Dados'!J$47)","v":500},{"$f":"IF('[3]Base Dados'!J$46=\"\",\"\",'[3]Base Dados'!J$46)","v":519.55999999999995},770.67888888888888,1.0391199999999998,null,5,"MAI",{"$f":"IF('[3]Base Dados'!K$76=\"\",\"\",'[3]Base Dados'!K$76)","v":2},{"$f":"IF('[3]Base Dados'!K$75=\"\",\"\",'[3]Base Dados'!K$75)","v":5},3.8,2.5,null,5,"MAI",{"$f":"IF('[3]Base Dados'!J$55=\"\",\"\",'[3]Base Dados'!J$55)","v":5.0000000000000001E-3},{"$f":"IF('[3]Base Dados'!J$54=\"\",\"\",'[3]Base Dados'!J$54)","v":4.4999999999999997E-3},1.1900000000000001E-2,0.89999999999999991,null,5,"MAI",1,0.95,0.93333333333333324,0.95]
[null,6,"JUN",{"$f":"IF('[3]Base Dados'!K$363=\"\",\"\",'[3]Base Dados'!K$363)","v":60},{"$f":"IF('[3]Base Dados'!K$362=\"\",\"\",'[3]Base Dados'!K$362)","v":23},34.333333333333336,0.38333333333333336,null,6,"JUN",{"$f":"IF('[3]Base Dados'!K$371=\"\",\"\",'[3]Base Dados'!K$371)","v":6420195},{"$f":"IF('[3]Base Dados'!K$369=\"\",\"\",'[3]Base Dados'!K$369)","v":6700902},6801486.5844444446,1.0437225037557269,null,6,"JUN",0.8,0.90045835855746781,0.83924832258593085,1.1255729481968346,null,6,"JUN",{"$f":"IF('[3]Base Dados'!K$66=\"\",\"\",'[3]Base Dados'!K$66)","v":0.04},{"$f":"IF('[3]Base Dados'!K$63=\"\",\"\",'[3]Base Dados'!K$65)","v":3.8000000000000006E-2},4.2888888888888893E-2,0.95000000000000018,null,6,"JUN",{"$f":"IF('[3]Base Dados'!K$47=\"\",\"\",'[3]Base Dados'!K$47)","v":500},{"$f":"IF('[3]Base Dados'!K$46=\"\",\"\",'[3]Base Dados'!K$46)","v":1192},770.67888888888888,2.3839999999999999,null,6,"JUN",{"$f":"IF('[3]Base Dados'!L$76=\"\",\"\",'[3]Base Dados'!L$76)","v":2},{"$f":"IF('[3]Base Dados'!L$75=\"\",\"\",'[3]Base Dados'!L$75)","v":9},3.8,4.5,null,6,"JUN",{"$f":"IF('[3]Base Dados'!K$55=\"\",\"\",'[3]Base Dados'!K$55)","v":5.0000000000000001E-3},{"$f":"IF('[3]Base Dados'!K$54=\"\",\"\",'[3]Base Dados'!K$54)","v":5.67E-2},1.1900000000000001E-2,11.34,null,6,"JUN",1,0.95,0.93333333333333324,0.95]
[null,7,"JUL",{"$f":"IF('[3]Base Dados'!L$363=\"\",\"\",'[3]Base Dados'!L$363)","v":60},{"$f":"IF('[3]Base Dados'!L$362=\"\",\"\",'[3]Base Dados'!L$362)","v":57},34.333333333333336,0.95,null,7,"JUL",{"$f":"IF('[3]Base Dados'!L$371=\"\",\"\",'[3]Base Dados'!L$371)","v":7124833},{"$f":"IF('[3]Base Dados'!L$369=\"\",\"\",'[3]Base Dados'!L$369)","v":7395049},6801486.5844444446,1.0379259415624198,null,7,"JUL",0.8,0.85267267742129005,0.83924832258593085,1.0658408467766125,null,7,"JUL",{"$f":"IF('[3]Base Dados'!L$66=\"\",\"\",'[3]Base Dados'!L$66)","v":3.5000000000000003E-2},{"$f":"IF('[3]Base Dados'!L$63=\"\",\"\",'[3]Base Dados'!L$65)","v":7.8000000000000014E-2},4.2888888888888893E-2,2.2285714285714286,null,7,"JUL",{"$f":"IF('[3]Base Dados'!L$47=\"\",\"\",'[3]Base Dados'!L$47)","v":500},{"$f":"IF('[3]Base Dados'!L$46=\"\",\"\",'[3]Base Dados'!L$46)","v":1445},770.67888888888888,2.89,null,7,"JUL",{"$f":"IF('[3]Base Dados'!M$76=\"\",\"\",'[3]Base Dados'!M$76)","v":2},{"$f":"IF('[3]Base Dados'!M$75=\"\",\"\",'[3]Base Dados'!M$75)","v":5},3.8,2.5,null,7,"JUL",{"$f":"IF('[3]Base Dados'!L$55=\"\",\"\",'[3]Base Dados'!L$55)","v":5.0000000000000001E-3},{"$f":"IF('[3]Base Dados'!L$54=\"\",\"\",'[3]Base Dados'!L$54)","v":2.9100000000000001E-2},1.1900000000000001E-2,5.82,null,7,"JUL",1,1,0.93333333333333324,1]
[null,8,"AGO",{"$f":"IF('[3]Base Dados'!M$363=\"\",\"\",'[3]Base Dados'!M$363)","v":60},{"$f":"IF('[3]Base Dados'!M$362=\"\",\"\",'[3]Base Dados'!M$362)","v":57},34.333333333333336,0.95,null,8,"AGO",{"$f":"IF('[3]Base Dados'!M$371=\"\",\"\",'[3]Base Dados'!M$371)","v":7183658},{"$f":"IF('[3]Base Dados'!M$369=\"\",\"\",'[3]Base Dados'!M$369)","v":7010077},6801486.5844444446,0.97583668376194965,null,8,"AGO",0.82,0.76411261114431106,0.83924832258593085,0.93184464773696474,null,8,"AGO",{"$f":"IF('[3]Base Dados'!M$66=\"\",\"\",'[3]Base Dados'!M$66)","v":3.5000000000000003E-2},{"$f":"IF('[3]Base Dados'!M$63=\"\",\"\",'[3]Base Dados'!M$65)","v":6.0750000000000005E-2},4.2888888888888893E-2,1.7357142857142858,null,8,"AGO",{"$f":"IF('[3]Base Dados'!M$47=\"\",\"\",'[3]Base Dados'!M$47)","v":500},{"$f":"IF('[3]Base Dados'!M$46=\"\",\"\",'[3]Base Dados'!M$46)","v":623},770.67888888888888,1.246,null,8,"AGO",{"$f":"IF('[3]Base Dados'!N$76=\"\",\"\",'[3]Base Dados'!N$76)","v":2},{"$f":"IF('[3]Base Dados'!N$75=\"\",\"\",'[3]Base Dados'!N$75)","v":2},3.8,1,null,8,"AGO",{"$f":"IF('[3]Base Dados'!M$55=\"\",\"\",'[3]Base Dados'!M$55)","v":5.0000000000000001E-3},{"$f":"IF('[3]Base Dados'!M$54=\"\",\"\",'[3]Base Dados'!M$54)","v":1.1000000000000001E-3},1.1900000000000001E-2,0.22,null,8,"AGO",1,1,0.93333333333333324,1]
[null,9,"SET",{"$f":"IF('[3]Base Dados'!N$363=\"\",\"\",'[3]Base Dados'!N$363)","v":60},{"$f":"IF('[3]Base Dados'!N$362=\"\",\"\",'[3]Base Dados'!N$362)","v":57},34.333333333333336,0.95,null,9,"SET",{"$f":"IF('[3]Base Dados'!N$371=\"\",\"\",'[3]Base Dados'!N$371)","v":7387825},{"$f":"IF('[3]Base Dados'!N$369=\"\",\"\",'[3]Base Dados'!N$369)","v":7565275},6801486.5844444446,1.0240192478841879,null,9,"SET",0.82,0.91938260624690249,0.83924832258593085,1.1211983003011006,null,9,"SET",{"$f":"IF('[3]Base Dados'!N$66=\"\",\"\",'[3]Base Dados'!N$66)","v":3.5000000000000003E-2},{"$f":"IF('[3]Base Dados'!N$63=\"\",\"\",'[3]Base Dados'!N$65)","v":5.2500000000000005E-2},4.2888888888888893E-2,1.5,null,9,"SET",{"$f":"IF('[3]Base Dados'!N$47=\"\",\"\",'[3]Base Dados'!N$47)","v":500},{"$f":"IF('[3]Base Dados'!N$46=\"\",\"\",'[3]Base Dados'!N$46)","v":691},770.67888888888888,1.3819999999999999,null,9,"SET",{"$f":"IF('[3]Base Dados'!O$76=\"\",\"\",'[3]Base Dados'!O$76)","v":2},{"$f":"IF('[3]Base Dados'!O$75=\"\",\"\",'[3]Base Dados'!O$75)","v":2},3.8,1,null,9,"SET",{"$f":"IF('[3]Base Dados'!N$55=\"\",\"\",'[3]Base Dados'!N$55)","v":5.0000000000000001E-3},{"$f":"IF('[3]Base Dados'!N$54=\"\",\"\",'[3]Base Dados'!N$54)","v":4.1000000000000003E-3},1.1900000000000001E-2,0.82000000000000006,null,9,"SET",1,1,0.93333333333333324,1]
[null,10,"OUT",{"$f":"IF('[3]Base Dados'!O$363=\"\",\"\",'[3]Base Dados'!O$363)","v":60},{"$f":"IF('[3]Base Dados'!O$362=\"\",\"\",'[3]Base Dados'!O$362)","v":""},34.333333333333336,"",null,10,"OUT",{"$f":"IF('[3]Base Dados'!O$371=\"\",\"\",'[3]Base Dados'!O$371)","v":7309759},{"$f":"IF('[3]Base Dados'!O$369=\"\",\"\",'[3]Base Dados'!O$369)","v":""},6801486.5844444446,"",null,10,"OUT",0.82,"",0.83924832258593085,"",null,10,"OUT",{"$f":"IF('[3]Base Dados'!O$66=\"\",\"\",'[3]Base Dados'!O$66)","v":0.03},{"$f":"IF('[3]Base Dados'!O$63=\"\",\"\",'[3]Base Dados'!O$65)","v":""},4.2888888888888893E-2,"",null,10,"OUT",{"$f":"IF('[3]Base Dados'!O$47=\"\",\"\",'[3]Base Dados'!O$47)","v":500},{"$f":"IF('[3]Base Dados'!O$46=\"\",\"\",'[3]Base Dados'!O$46)","v":""},770.67888888888888,"",null,10,"OUT",{"$f":"IF('[3]Base Dados'!P$76=\"\",\"\",'[3]Base Dados'!P$76)","v":2},{"$f":"IF('[3]Base Dados'!P$75=\"\",\"\",'[3]Base Dados'!P$75)","v":""},3.8,"",null,10,"OUT",{"$f":"IF('[3]Base Dados'!O$55=\"\",\"\",'[3]Base Dados'!O$55)","v":5.0000000000000001E-3},{"$f":"IF('[3]Base Dados'!O$54=\"\",\"\",'[3]Base Dados'!O$54)","v":""},1.1900000000000001E-2,"",null,10,"OUT",1,1,0.93333333333333324,1]
[null,11,"NOV",{"$f":"IF('[3]Base Dados'!P$363=\"\",\"\",'[3]Base Dados'!P$363)","v":60},{"$f":"IF('[3]Base Dados'!P$362=\"\",\"\",'[3]Base Dados'!P$362)","v":""},34.333333333333336,"",null,11,"NOV",{"$f":"IF('[3]Base Dados'!P$371=\"\",\"\",'[3]Base Dados'!P$371)","v":7411696},{"$f":"IF('[3]Base Dados'!P$369=\"\",\"\",'[3]Base Dados'!P$369)","v":""},6801486.5844444446,"",null,11,"NOV",0.85,"",0.83924832258593085,"",null,11,"NOV",{"$f":"IF('[3]Base Dados'!P$66=\"\",\"\",'[3]Base Dados'!P$66)","v":0.03},{"$f":"IF('[3]Base Dados'!P$63=\"\",\"\",'[3]Base Dados'!P$65)","v":""},4.2888888888888893E-2,"",null,11,"NOV",{"$f":"IF('[3]Base Dados'!P$47=\"\",\"\",'[3]Base Dados'!P$47)","v":500},{"$f":"IF('[3]Base Dados'!P$46=\"\",\"\",'[3]Base Dados'!P$46)","v":""},770.67888888888888,"",null,11,"NOV",{"$f":"IF('[3]Base Dados'!Q$76=\"\",\"\",'[3]Base Dados'!Q$76)","v":2},{"$f":"IF('[3]Base Dados'!Q$75=\"\",\"\",'[3]Base Dados'!Q$75)","v":""},3.8,"",null,11,"NOV",{"$f":"IF('[3]Base Dados'!P$55=\"\",\"\",'[3]Base Dados'!P$55)","v":5.0000000000000001E-3},{"$f":"IF('[3]Base Dados'!P$54=\"\",\"\",'[3]Base Dados'!P$54)","v":""},1.1900000000000001E-2,"",null,11,"NOV",1,1,0.93333333333333324,1]
[null,12,"DEZ",{"$f":"IF('[3]Base Dados'!Q$363=\"\",\"\",'[3]Base Dados'!Q$363)","v":60},{"$f":"IF('[3]Base Dados'!Q$362=\"\",\"\",'[3]Base Dados'!Q$362)","v":""},34.333333333333336,"",null,12,"DEZ",{"$f":"IF('[3]Base Dados'!Q$371=\"\",\"\",'[3]Base Dados'!Q$371)","v":3884849},{"$f":"IF('[3]Base Dados'!Q$369=\"\",\"\",'[3]Base Dados'!Q$369)","v":""},6801486.5844444446,"",null,12,"DEZ",0.85,"",0.83924832258593085,"",null,12,"DEZ",{"$f":"IF('[3]Base Dados'!Q$66=\"\",\"\",'[3]Base Dados'!Q$66)","v":0.03},{"$f":"IF('[3]Base Dados'!Q$63=\"\",\"\",'[3]Base Dados'!Q$65)","v":""},4.2888888888888893E-2,"",null,12,"DEZ",{"$f":"IF('[3]Base Dados'!Q$47=\"\",\"\",'[3]Base Dados'!Q$47)","v":500},{"$f":"IF('[3]Base Dados'!Q$46=\"\",\"\",'[3]Base Dados'!Q$46)","v":""},770.67888888888888,"",null,12,"DEZ",{"$f":"IF('[3]Base Dados'!R$76=\"\",\"\",'[3]Base Dados'!R$76)","v":2},{"$f":"IF('[3]Base Dados'!R$75=\"\",\"\",'[3]Base Dados'!R$75)","v":2},3.8,1,null,12,"DEZ",{"$f":"IF('[3]Base Dados'!Q$55=\"\",\"\",'[3]Base Dados'!Q$55)","v":5.0000000000000001E-3},{"$f":"IF('[3]Base Dados'!Q$54=\"\",\"\",'[3]Base Dados'!Q$54)","v":""},1.1900000000000001E-2,"",null,12,"DEZ",1,1,0.93333333333333324,1]
[]
[null,"INDICADOR DE PROCESSO"]
[]
[null,"OEE SOPRO",null,null,null,null,null,null,"OEE INJEÇÃO",null,null,null,null,null,null,"OEE PET",null,null,null,null,null,null,"OEE DECORAÇÃO",null,null,null,null,null,null,"REFUGO SOPRO",null,null,null,null,null,null,"REFUGO INJEÇÃO",null,null,null,null,null,null,"REFUGO PET",null,null,null,null,null,null,"REFUGO DECORAÇÃO"]
[]
[null,"Mês Selecionado",null,null,{"$f":"E6","v":9},"Status Mês",{"$f":"VLOOKUP(E25,B27:G38,6,FALSE)","v":1.7947070499682338},null,"Mês Selecionado",null,null,{"$f":"E25","v":9},"Status Mês",{"$f":"VLOOKUP(L25,I27:N38,6,FALSE)","v":1.4214964377299271},null,"Mês Selecionado",null,null,{"$f":"E25","v":9},"Status Mês",{"$f":"VLOOKUP(S25,P27:U38,6,FALSE)","v":1.0751506216216216},null,"Mês Selecionado",null,null,{"$f":"L25","v":9},"Status Mês",{"$f":"VLOOKUP(Z25,W27:AB38,6,FALSE)","v":1.3409427363813857},null,"Mês Selecionado",null,null,{"$f":"Z6","v":9},"Status Mês",{"$f":"VLOOKUP(AG25,AD27:AI38,6,FALSE)","v":1.5695089516097021},null,"Mês Selecionado",null,null,{"$f":"Z25","v":9},"Status Mês",{"$f":"VLOOKUP(AN25,AK27:AP38,6,FALSE)","v":0.94596914786835018},null,"Mês Selecionado",null,null,{"$f":"AG25","v":9},"Status Mês",{"$f":"VLOOKUP(AU25,AR27:AW38,6,FALSE)","v":1.2039614600980661},null,"Mês Selecionado",null,null,{"$f":"AL25","v":0},"Status Mês",{"$f":"VLOOKUP(BB25,AY27:BD38,6,FALSE)","v":{"$error":"#N/A"}}]
[null,null,null,"Meta","Realizado","Média","Status",null,null,null,"Meta","Realizado","Média","Status",null,null,null,"Meta","Realizado","Média","Status",null,null,null,"Meta","Realizado","Média","Status",null,null,null,"Meta","Realizado","Média","Status",null,null,null,"Meta","Realizado","Média","Status",null,null,null,"Meta","Realizado","Média","Status",null,null,null,"Meta","Realizado","Média","Status"]
[null,1,"JAN",{"$f":"IF('[3]Base Dados'!E$94=\"\",\"\",'[3]Base Dados'!E$94)","v":0.61408757999999997},{"$f":"IF('[3]Base Dados'!E$90=\"\",\"\",'[3]Base Dados'!E$93)","v":0.92900000000000005},{"$f":"AVERAGE(E27:E38)","v":0.76891666666666669},{"$f":"IF(E27=\"\",\"\",E27/D27)","v":1.5128135306042179},null,1,"JAN",{"$f":"IF('[3]Base Dados'!E$100=\"\",\"\",'[3]Base Dados'!E$100)","v":0.64728224000000001},{"$f":"IF('[3]Base Dados'!E$98=\"\",\"\",'[3]Base Dados'!E$99)","v":0.96799999999999997},{"$f":"AVERAGE(L27:L38)","v":0.97980000000000023},{"$f":"IF(L27=\"\",\"\",L27/K27)","v":1.4954836394089848},null,1,"JAN",0.7,0.69401103799999997,{"$f":"AVERAGE(S27:S38)","v":0.75047713260000004},{"$f":"IF(S27=\"\",\"\",S27/R27)","v":0.99144434000000004},null,1,"JAN",{"$f":"IF('[3]Base Dados'!F$106=\"\",\"\",'[3]Base Dados'!F$106)","v":0.51563397},{"$f":"IF('[3]Base Dados'!F$103=\"\",\"\",'[3]Base Dados'!F$105)","v":0.96899999999999997},{"$f":"AVERAGE(Z27:Z38)","v":0.97211111111111093},{"$f":"IF(Z27=\"\",\"\",Z27/Y27)","v":1.8792400353297127},null,1,"JAN",{"$f":"IF('[3]Base Dados'!E$34=\"\",\"\",'[3]Base Dados'!E$34)","v":0.04},{"$f":"IF('[3]Base Dados'!E$33=\"\",\"\",'[3]Base Dados'!E$33)","v":8.0528874531815106E-2},{"$f":"AVERAGE(AG27:AG38)","v":7.5718596534416788E-2},{"$f":"IF(AG27=\"\",\"\",AG27/AF27)","v":2.0132218632953776},null,1,"JAN",{"$f":"IF('[3]Base Dados'!E$39=\"\",\"\",'[3]Base Dados'!E$39)","v":2.5000000000000001E-2},{"$f":"IF('[3]Base Dados'!E$38=\"\",\"\",'[3]Base Dados'!E$38)","v":3.4632778233532849E-2},{"$f":"AVERAGE(AN27:AN38)","v":2.3407556917663584E-2},{"$f":"IF(AN27=\"\",\"\",AN27/AM27)","v":1.3853111293413138},null,1,"JAN",{"$f":"IF('[3]Base Dados'!E$29=\"\",\"\",'[3]Base Dados'!E$29)","v":0.01},{"$f":"IF('[3]Base Dados'!E$28=\"\",\"\",'[3]Base Dados'!E$28)","v":2.4886857044871362E-2},{"$f":"AVERAGE(AU27:AU38)","v":2.6930162737478208E-2},{"$f":"IF(AU27=\"\",\"\",AU27/AT27)","v":2.488685704487136},null,1,"JAN",{"$f":"IF('[3]Base Dados'!E$44=\"\",\"\",'[3]Base Dados'!E$44)","v":0.03},{"$f":"'[3]Base Dados'!E$43","v":2.5657113794739093E-2},{"$f":"AVERAGE(BB27:BB38)","v":2.7269680237428283E-2},{"$f":"IF(BB27=\"\",\"\",BB27/BA27)","v":0.85523712649130312}]
[null,2,"FEV",{"$f":"IF('[3]Base Dados'!F$94=\"\",\"\",'[3]Base Dados'!F$94)","v":0.53724278999999997},{"$f":"IF('[3]Base Dados'!F$90=\"\",\"\",'[3]Base Dados'!F$93)","v":0.91700000000000004},{"$f":"F27","v":0.76891666666666669},1.7068632973185178,null,2,"FEV",{"$f":"IF('[3]Base Dados'!F$100=\"\",\"\",'[3]Base Dados'!F$100)","v":0.60956783999999997},{"$f":"IF('[3]Base Dados'!F$98=\"\",\"\",'[3]Base Dados'!F$99)","v":0.97799999999999998},{"$f":"M27","v":0.97980000000000023},1.6044153510460788,null,2,"FEV",0.7,0.71205220800000002,{"$f":"T27","v":0.75047713260000004},1.01721744,null,2,"FEV",{"$f":"IF('[3]Base Dados'!G$106=\"\",\"\",'[3]Base Dados'!G$106)","v":0.53750619999999993},{"$f":"IF('[3]Base Dados'!G$103=\"\",\"\",'[3]Base Dados'!G$105)","v":0.96799999999999997},{"$f":"AA27","v":0.97211111111111093},1.800909459276935,null,2,"FEV",{"$f":"IF('[3]Base Dados'!F$34=\"\",\"\",'[3]Base Dados'!F$34)","v":7.4999999999999997E-2},{"$f":"IF('[3]Base Dados'!F$33=\"\",\"\",'[3]Base Dados'!F$33)","v":8.3581188844346746E-2},{"$f":"AH27","v":7.5718596534416788E-2},1.1144158512579567,null,2,"FEV",{"$f":"IF('[3]Base Dados'!F$39=\"\",\"\",'[3]Base Dados'!F$39)","v":0.03},{"$f":"IF('[3]Base Dados'!F$38=\"\",\"\",'[3]Base Dados'!F$38)","v":2.1240827824348576E-2},{"$f":"AO27","v":2.3407556917663584E-2},0.70802759414495253,null,2,"FEV",{"$f":"IF('[3]Base Dados'!F$29=\"\",\"\",'[3]Base Dados'!F$29)","v":0.03},{"$f":"IF('[3]Base Dados'!F$28=\"\",\"\",'[3]Base Dados'!F$28)","v":2.836950210480476E-2},{"$f":"AV27","v":2.6930162737478208E-2},0.94565007016015867,null,2,"FEV",{"$f":"IF('[3]Base Dados'!F$44=\"\",\"\",'[3]Base Dados'!F$44)","v":0.03},{"$f":"'[3]Base Dados'!F$43","v":3.0621555377583761E-2},{"$f":"BC27","v":2.7269680237428283E-2},1.0207185125861253]
[null,3,"MAR",{"$f":"IF('[3]Base Dados'!G$94=\"\",\"\",'[3]Base Dados'!G$94)","v":0.5980691159999999},{"$f":"IF('[3]Base Dados'!G$90=\"\",\"\",'[3]Base Dados'!G$93)","v":0.82199999999999995},{"$f":"F28","v":0.76891666666666669},1.3744230859096895,null,3,"MAR",{"$f":"IF('[3]Base Dados'!G$100=\"\",\"\",'[3]Base Dados'!G$100)","v":0.59440920000000008},{"$f":"IF('[3]Base Dados'!G$98=\"\",\"\",'[3]Base Dados'!G$99)","v":0.98},{"$f":"M28","v":0.97980000000000023},1.6486958815576875,null,3,"MAR",0.7,0.68766053999999999,{"$f":"T28","v":0.75047713260000004},0.98237220000000003,null,3,"MAR",{"$f":"IF('[3]Base Dados'!H$106=\"\",\"\",'[3]Base Dados'!H$106)","v":0.50111033599999999},{"$f":"IF('[3]Base Dados'!H$103=\"\",\"\",'[3]Base Dados'!H$105)","v":0.96399999999999997},{"$f":"AA28","v":0.97211111111111093},1.9237280310258857,null,3,"MAR",{"$f":"IF('[3]Base Dados'!G$34=\"\",\"\",'[3]Base Dados'!G$34)","v":7.4999999999999997E-2},{"$f":"IF('[3]Base Dados'!G$33=\"\",\"\",'[3]Base Dados'!G$33)","v":8.2171679862793418E-2},{"$f":"AH28","v":7.5718596534416788E-2},1.095622398170579,null,3,"MAR",{"$f":"IF('[3]Base Dados'!G$39=\"\",\"\",'[3]Base Dados'!G$39)","v":0.03},{"$f":"IF('[3]Base Dados'!G$38=\"\",\"\",'[3]Base Dados'!G$38)","v":2.6040004432887648E-2},{"$f":"AO28","v":2.3407556917663584E-2},0.86800014776292167,null,3,"MAR",{"$f":"IF('[3]Base Dados'!G$29=\"\",\"\",'[3]Base Dados'!G$29)","v":0.03},{"$f":"IF('[3]Base Dados'!G$28=\"\",\"\",'[3]Base Dados'!G$28)","v":3.1814904128532134E-2},{"$f":"AV28","v":2.6930162737478208E-2},1.0604968042844045,null,3,"MAR",{"$f":"IF('[3]Base Dados'!G$44=\"\",\"\",'[3]Base Dados'!G$44)","v":0.03},{"$f":"'[3]Base Dados'!G$43","v":3.1807503045503116E-2},{"$f":"BC28","v":2.7269680237428283E-2},1.0602501015167707]
[null,4,"ABR",{"$f":"IF('[3]Base Dados'!H$94=\"\",\"\",'[3]Base Dados'!H$94)","v":0.62634455999999994},{"$f":"IF('[3]Base Dados'!H$90=\"\",\"\",'[3]Base Dados'!H$93)","v":0.94},0.76891666666666669,1.5007713964978,null,4,"ABR",{"$f":"IF('[3]Base Dados'!H$100=\"\",\"\",'[3]Base Dados'!H$100)","v":0.69918681599999999},{"$f":"IF('[3]Base Dados'!H$98=\"\",\"\",'[3]Base Dados'!H$99)","v":0.97199999999999998},0.97980000000000023,1.3901863961920014,null,4,"ABR",0.7,0.7738216,0.75047713260000004,1.1054594285714285,null,4,"ABR",{"$f":"IF('[3]Base Dados'!I$106=\"\",\"\",'[3]Base Dados'!I$106)","v":0.65684214399999996},{"$f":"IF('[3]Base Dados'!I$103=\"\",\"\",'[3]Base Dados'!I$105)","v":0.97599999999999998},0.97211111111111093,1.4858973482675923,null,4,"ABR",{"$f":"IF('[3]Base Dados'!H$34=\"\",\"\",'[3]Base Dados'!H$34)","v":6.5000000000000002E-2},{"$f":"IF('[3]Base Dados'!H$33=\"\",\"\",'[3]Base Dados'!H$33)","v":6.0168624015808178E-2},7.5718596534416788E-2,0.92567113870474116,null,4,"ABR",{"$f":"IF('[3]Base Dados'!H$39=\"\",\"\",'[3]Base Dados'!H$39)","v":0.03},{"$f":"IF('[3]Base Dados'!H$38=\"\",\"\",'[3]Base Dados'!H$38)","v":2.8207264055136527E-2},2.3407556917663584E-2,0.94024213517121757,null,4,"ABR",{"$f":"IF('[3]Base Dados'!H$29=\"\",\"\",'[3]Base Dados'!H$29)","v":0.03},{"$f":"IF('[3]Base Dados'!H$28=\"\",\"\",'[3]Base Dados'!H$28)","v":2.4343215555389628E-2},2.6930162737478208E-2,0.8114405185129876,null,4,"ABR",{"$f":"IF('[3]Base Dados'!H$44=\"\",\"\",'[3]Base Dados'!H$44)","v":0.03},{"$f":"'[3]Base Dados'!H$43","v":3.5551562272665781E-2},2.7269680237428283E-2,1.1850520757555261]
[null,5,"MAI",{"$f":"IF('[3]Base Dados'!I$94=\"\",\"\",'[3]Base Dados'!I$94)","v":0.67903628399999993},{"$f":"IF('[3]Base Dados'!I$90=\"\",\"\",'[3]Base Dados'!I$93)","v":0.94799999999999995},0.76891666666666669,1.3960962357057198,null,5,"MAI",{"$f":"IF('[3]Base Dados'!I$100=\"\",\"\",'[3]Base Dados'!I$100)","v":0.69880859999999989},{"$f":"IF('[3]Base Dados'!I$98=\"\",\"\",'[3]Base Dados'!I$99)","v":0.97299999999999998},0.97980000000000023,1.3923698134224451,null,5,"MAI",0.7,0.80777087999999997,0.75047713260000004,1.1539584000000001,null,5,"MAI",{"$f":"IF('[3]Base Dados'!J$106=\"\",\"\",'[3]Base Dados'!J$106)","v":0.69829199999999991},{"$f":"IF('[3]Base Dados'!J$103=\"\",\"\",'[3]Base Dados'!J$105)","v":0.97799999999999998},0.97211111111111093,1.400560224089636,null,5,"MAI",{"$f":"IF('[3]Base Dados'!I$34=\"\",\"\",'[3]Base Dados'!I$34)","v":6.5000000000000002E-2},{"$f":"IF('[3]Base Dados'!I$33=\"\",\"\",'[3]Base Dados'!I$33)","v":5.1939948570564214E-2},7.5718596534416788E-2,0.79907613185483406,null,5,"MAI",{"$f":"IF('[3]Base Dados'!I$39=\"\",\"\",'[3]Base Dados'!I$39)","v":0.03},{"$f":"IF('[3]Base Dados'!I$38=\"\",\"\",'[3]Base Dados'!I$38)","v":2.6498512115629872E-2},2.3407556917663584E-2,0.8832837371876624,null,5,"MAI",{"$f":"IF('[3]Base Dados'!I$29=\"\",\"\",'[3]Base Dados'!I$29)","v":0.03},{"$f":"IF('[3]Base Dados'!I$28=\"\",\"\",'[3]Base Dados'!I$28)","v":2.0084836307388096E-2},2.6930162737478208E-2,0.66949454357960325,null,5,"MAI",{"$f":"IF('[3]Base Dados'!I$44=\"\",\"\",'[3]Base Dados'!I$44)","v":0.03},{"$f":"'[3]Base Dados'!I$43","v":2.3760550948875969E-2},2.7269680237428283E-2,0.79201836496253231]
[null,6,"JUN",{"$f":"IF('[3]Base Dados'!J$94=\"\",\"\",'[3]Base Dados'!J$94)","v":0.64089164799999998},{"$f":"IF('[3]Base Dados'!J$90=\"\",\"\",'[3]Base Dados'!J$93)","v":0.998},0.76891666666666669,1.557205501295595,null,6,"JUN",{"$f":"IF('[3]Base Dados'!J$100=\"\",\"\",'[3]Base Dados'!J$100)","v":0.72424460800000001},{"$f":"IF('[3]Base Dados'!J$98=\"\",\"\",'[3]Base Dados'!J$99)","v":0.998},0.97980000000000023,1.3779874768498104,null,6,"JUN",0.7,0.77045385600000005,0.75047713260000004,1.1006483657142858,null,6,"JUN",{"$f":"IF('[3]Base Dados'!K$106=\"\",\"\",'[3]Base Dados'!K$106)","v":0.76026923999999996},{"$f":"IF('[3]Base Dados'!K$103=\"\",\"\",'[3]Base Dados'!K$105)","v":0.97199999999999998},0.97211111111111093,1.2784944449416367,null,6,"JUN",{"$f":"IF('[3]Base Dados'!J$34=\"\",\"\",'[3]Base Dados'!J$34)","v":6.5000000000000002E-2},{"$f":"IF('[3]Base Dados'!J$33=\"\",\"\",'[3]Base Dados'!J$33)","v":7.2554415811858897E-2},7.5718596534416788E-2,1.1162217817209061,null,6,"JUN",{"$f":"IF('[3]Base Dados'!J$39=\"\",\"\",'[3]Base Dados'!J$39)","v":0.03},{"$f":"IF('[3]Base Dados'!J$38=\"\",\"\",'[3]Base Dados'!J$38)","v":2.6755852842809364E-2},2.3407556917663584E-2,0.89186176142697882,null,6,"JUN",{"$f":"IF('[3]Base Dados'!J$29=\"\",\"\",'[3]Base Dados'!J$29)","v":0.03},{"$f":"IF('[3]Base Dados'!J$28=\"\",\"\",'[3]Base Dados'!J$28)","v":2.7676409399406569E-2},2.6930162737478208E-2,0.92254697998021906,null,6,"JUN",{"$f":"IF('[3]Base Dados'!J$44=\"\",\"\",'[3]Base Dados'!J$44)","v":0.03},{"$f":"'[3]Base Dados'!J$43","v":2.2229866860002025E-2},2.7269680237428283E-2,0.74099556200006755]
[null,7,"JUL",{"$f":"IF('[3]Base Dados'!K$94=\"\",\"\",'[3]Base Dados'!K$94)","v":0.68204417399999995},{"$f":"IF('[3]Base Dados'!K$90=\"\",\"\",'[3]Base Dados'!K$93)","v":0.93700000000000006},0.76891666666666669,1.3738113097642266,null,7,"JUL",{"$f":"IF('[3]Base Dados'!K$100=\"\",\"\",'[3]Base Dados'!K$100)","v":0.78894165999999988},{"$f":"IF('[3]Base Dados'!K$98=\"\",\"\",'[3]Base Dados'!K$99)","v":0.98499999999999999},0.97980000000000023,1.2485080329006839,null,7,"JUL",0.72,0.72912830400000006,0.75047713260000004,1.0126782000000001,null,7,"JUL",{"$f":"IF('[3]Base Dados'!L$106=\"\",\"\",'[3]Base Dados'!L$106)","v":0.68483887999999993},{"$f":"IF('[3]Base Dados'!L$103=\"\",\"\",'[3]Base Dados'!L$105)","v":0.97399999999999998},0.97211111111111093,1.4222323358743885,null,7,"JUL",{"$f":"IF('[3]Base Dados'!K$34=\"\",\"\",'[3]Base Dados'!K$34)","v":6.5000000000000002E-2},{"$f":"IF('[3]Base Dados'!K$33=\"\",\"\",'[3]Base Dados'!K$33)","v":6.2702785723885032E-2},7.5718596534416788E-2,0.96465824190592353,null,7,"JUL",{"$f":"IF('[3]Base Dados'!K$39=\"\",\"\",'[3]Base Dados'!K$39)","v":2.3E-2},{"$f":"IF('[3]Base Dados'!K$38=\"\",\"\",'[3]Base Dados'!K$38)","v":1.5301672877190201E-2},2.3407556917663584E-2,0.66529012509522611,null,7,"JUL",{"$f":"IF('[3]Base Dados'!K$29=\"\",\"\",'[3]Base Dados'!K$29)","v":2.7E-2},{"$f":"IF('[3]Base Dados'!K$28=\"\",\"\",'[3]Base Dados'!K$28)","v":2.8239956605005924E-2},2.6930162737478208E-2,1.0459243187039231,null,7,"JUL",{"$f":"IF('[3]Base Dados'!K$44=\"\",\"\",'[3]Base Dados'!K$44)","v":0.03},{"$f":"'[3]Base Dados'!K$43","v":2.4570369538357856E-2},2.7269680237428283E-2,0.81901231794526186]
[null,8,"AGO",{"$f":"IF('[3]Base Dados'!L$94=\"\",\"\",'[3]Base Dados'!L$94)","v":0.59633582400000007},{"$f":"IF('[3]Base Dados'!L$90=\"\",\"\",'[3]Base Dados'!L$93)","v":0.91200000000000003},0.76891666666666669,1.5293396158604751,null,8,"AGO",{"$f":"IF('[3]Base Dados'!L$100=\"\",\"\",'[3]Base Dados'!L$100)","v":0.67671864000000004},{"$f":"IF('[3]Base Dados'!L$98=\"\",\"\",'[3]Base Dados'!L$99)","v":0.98499999999999999},0.97980000000000023,1.4555532266703928,null,8,"AGO",0.72,0.75150943999999997,0.75047713260000004,1.0437631111111112,null,8,"AGO",{"$f":"IF('[3]Base Dados'!M$106=\"\",\"\",'[3]Base Dados'!M$106)","v":0.735275232},{"$f":"IF('[3]Base Dados'!M$103=\"\",\"\",'[3]Base Dados'!M$105)","v":0.97199999999999998},0.97211111111111093,1.3219539536998848,null,8,"AGO",{"$f":"IF('[3]Base Dados'!L$34=\"\",\"\",'[3]Base Dados'!L$34)","v":6.2E-2},{"$f":"IF('[3]Base Dados'!L$33=\"\",\"\",'[3]Base Dados'!L$33)","v":8.7873310956192441E-2},7.5718596534416788E-2,1.4173114670353619,null,8,"AGO",{"$f":"IF('[3]Base Dados'!L$39=\"\",\"\",'[3]Base Dados'!L$39)","v":2.3E-2},{"$f":"IF('[3]Base Dados'!L$38=\"\",\"\",'[3]Base Dados'!L$38)","v":1.4810562571756601E-2},2.3407556917663584E-2,0.64393750311985221,null,8,"AGO",{"$f":"IF('[3]Base Dados'!L$29=\"\",\"\",'[3]Base Dados'!L$29)","v":2.7E-2},{"$f":"IF('[3]Base Dados'!L$28=\"\",\"\",'[3]Base Dados'!L$28)","v":2.9577147998200631E-2},2.6930162737478208E-2,1.0954499258592827,null,8,"AGO",{"$f":"IF('[3]Base Dados'!L$44=\"\",\"\",'[3]Base Dados'!L$44)","v":0.03},{"$f":"'[3]Base Dados'!L$43","v":2.5700911651276213E-2},2.7269680237428283E-2,0.85669705504254046]
[null,9,"SET",{"$f":"IF('[3]Base Dados'!M$94=\"\",\"\",'[3]Base Dados'!M$94)","v":0.504817764},{"$f":"IF('[3]Base Dados'!M$90=\"\",\"\",'[3]Base Dados'!M$93)","v":0.90600000000000003},0.76891666666666669,1.7947070499682338,null,9,"SET",{"$f":"IF('[3]Base Dados'!M$100=\"\",\"\",'[3]Base Dados'!M$100)","v":0.68800735199999996},{"$f":"IF('[3]Base Dados'!M$98=\"\",\"\",'[3]Base Dados'!M$99)","v":0.97799999999999998},0.97980000000000023,1.4214964377299271,null,9,"SET",0.74,0.79561145999999994,0.75047713260000004,1.0751506216216216,null,9,"SET",{"$f":"IF('[3]Base Dados'!N$106=\"\",\"\",'[3]Base Dados'!N$106)","v":0.72784614399999992},{"$f":"IF('[3]Base Dados'!N$103=\"\",\"\",'[3]Base Dados'!N$105)","v":0.97599999999999998},0.97211111111111093,1.3409427363813857,null,9,"SET",{"$f":"IF('[3]Base Dados'!M$34=\"\",\"\",'[3]Base Dados'!M$34)","v":0.06},{"$f":"IF('[3]Base Dados'!M$33=\"\",\"\",'[3]Base Dados'!M$33)","v":9.4170537096582116E-2},7.5718596534416788E-2,1.5695089516097021,null,9,"SET",{"$f":"IF('[3]Base Dados'!M$39=\"\",\"\",'[3]Base Dados'!M$39)","v":2.3E-2},{"$f":"IF('[3]Base Dados'!M$38=\"\",\"\",'[3]Base Dados'!M$38)","v":2.1757290400972053E-2},2.3407556917663584E-2,0.94596914786835018,null,9,"SET",{"$f":"IF('[3]Base Dados'!M$29=\"\",\"\",'[3]Base Dados'!M$29)","v":2.5000000000000001E-2},{"$f":"IF('[3]Base Dados'!M$28=\"\",\"\",'[3]Base Dados'!M$28)","v":3.0099036502451656E-2},2.6930162737478208E-2,1.2039614600980661,null,9,"SET",{"$f":"IF('[3]Base Dados'!M$44=\"\",\"\",'[3]Base Dados'!M$44)","v":0.03},{"$f":"'[3]Base Dados'!M$43","v":2.8320546253952656E-2},2.7269680237428283E-2,0.94401820846508855]
[null,10,"OUT",{"$f":"IF('[3]Base Dados'!N$94=\"\",\"\",'[3]Base Dados'!N$94)","v":0.52322419799999997},{"$f":"IF('[3]Base Dados'!N$90=\"\",\"\",'[3]Base Dados'!N$93)","v":0.91800000000000004},0.76891666666666669,1.7545060100603376,null,10,"OUT",{"$f":"IF('[3]Base Dados'!N$100=\"\",\"\",'[3]Base Dados'!N$100)","v":0.656812854},{"$f":"IF('[3]Base Dados'!N$98=\"\",\"\",'[3]Base Dados'!N$99)","v":0.98099999999999998},0.97980000000000023,1.4935761290688747,null,10,"OUT",0.74,0.782752,0.75047713260000004,1.057772972972973,null,10,"OUT",{"$f":"IF('[3]Base Dados'!O$106=\"\",\"\",'[3]Base Dados'!O$106)","v":0},{"$f":"IF('[3]Base Dados'!O$103=\"\",\"\",'[3]Base Dados'!O$105)","v":""},0.97211111111111093,"",null,10,"OUT",{"$f":"IF('[3]Base Dados'!N$34=\"\",\"\",'[3]Base Dados'!N$34)","v":5.8000000000000003E-2},{"$f":"IF('[3]Base Dados'!N$33=\"\",\"\",'[3]Base Dados'!N$33)","v":8.1494599930321682E-2},7.5718596534416788E-2,1.4050793091434772,null,10,"OUT",{"$f":"IF('[3]Base Dados'!N$39=\"\",\"\",'[3]Base Dados'!N$39)","v":2.3E-2},{"$f":"IF('[3]Base Dados'!N$38=\"\",\"\",'[3]Base Dados'!N$38)","v":1.8830803822372118E-2},2.3407556917663584E-2,0.81873060097270078,null,10,"OUT",{"$f":"IF('[3]Base Dados'!N$29=\"\",\"\",'[3]Base Dados'!N$29)","v":2.5000000000000001E-2},{"$f":"IF('[3]Base Dados'!N$28=\"\",\"\",'[3]Base Dados'!N$28)","v":2.4209761728731339E-2},2.6930162737478208E-2,0.96839046914925353,null,10,"OUT",{"$f":"IF('[3]Base Dados'!N$44=\"\",\"\",'[3]Base Dados'!N$44)","v":0.03},{"$f":"'[3]Base Dados'!N$43","v":2.4476822631326348E-2},2.7269680237428283E-2,0.81589408771087824]
[null,11,"NOV",{"$f":"IF('[3]Base Dados'!O$94=\"\",\"\",'[3]Base Dados'!O$94)","v":0},{"$f":"IF('[3]Base Dados'!O$90=\"\",\"\",'[3]Base Dados'!O$93)","v":0},0.76891666666666669,{"$error":"#DIV/0!"},null,11,"NOV",{"$f":"IF('[3]Base Dados'!O$100=\"\",\"\",'[3]Base Dados'!O$100)","v":0},{"$f":"IF('[3]Base Dados'!O$98=\"\",\"\",'[3]Base Dados'!O$99)","v":""},0.97980000000000023,"",null,11,"NOV",0.76,"",0.75047713260000004,"",null,11,"NOV",{"$f":"IF('[3]Base Dados'!P$106=\"\",\"\",'[3]Base Dados'!P$106)","v":0},{"$f":"IF('[3]Base Dados'!P$103=\"\",\"\",'[3]Base Dados'!P$105)","v":""},0.97211111111111093,"",null,11,"NOV",{"$f":"IF('[3]Base Dados'!O$34=\"\",\"\",'[3]Base Dados'!O$34)","v":5.8000000000000003E-2},{"$f":"IF('[3]Base Dados'!O$33=\"\",\"\",'[3]Base Dados'!O$33)","v":""},7.5718596534416788E-2,"",null,11,"NOV",{"$f":"IF('[3]Base Dados'!O$39=\"\",\"\",'[3]Base Dados'!O$39)","v":2.3E-2},{"$f":"IF('[3]Base Dados'!O$38=\"\",\"\",'[3]Base Dados'!O$38)","v":""},2.3407556917663584E-2,"",null,11,"NOV",{"$f":"IF('[3]Base Dados'!O$29=\"\",\"\",'[3]Base Dados'!O$29)","v":2.3E-2},{"$f":"IF('[3]Base Dados'!O$28=\"\",\"\",'[3]Base Dados'!O$28)","v":""},2.6930162737478208E-2,"",null,11,"NOV",{"$f":"IF('[3]Base Dados'!O$44=\"\",\"\",'[3]Base Dados'!O$44)","v":0.03},{"$f":"'[3]Base Dados'!O$43","v":""},2.7269680237428283E-2,""]
[null,12,"DEZ",{"$f":"IF('[3]Base Dados'!P$94=\"\",\"\",'[3]Base Dados'!P$94)","v":0},{"$f":"IF('[3]Base Dados'!P$90=\"\",\"\",'[3]Base Dados'!P$93)","v":0},0.76891666666666669,{"$error":"#DIV/0!"},null,12,"DEZ",{"$f":"IF('[3]Base Dados'!P$100=\"\",\"\",'[3]Base Dados'!P$100)","v":0},{"$f":"IF('[3]Base Dados'!P$98=\"\",\"\",'[3]Base Dados'!P$99)","v":""},0.97980000000000023,"",null,12,"DEZ",0.77,"",0.75047713260000004,"",null,12,"DEZ",{"$f":"IF('[3]Base Dados'!Q$106=\"\",\"\",'[3]Base Dados'!Q$106)","v":0},{"$f":"IF('[3]Base Dados'!Q$103=\"\",\"\",'[3]Base Dados'!Q$105)","v":""},0.97211111111111093,"",null,12,"DEZ",{"$f":"IF('[3]Base Dados'!P$34=\"\",\"\",'[3]Base Dados'!P$34)","v":5.8000000000000003E-2},{"$f":"IF('[3]Base Dados'!P$33=\"\",\"\",'[3]Base Dados'!P$33)","v":""},7.5718596534416788E-2,"",null,12,"DEZ",{"$f":"IF('[3]Base Dados'!P$39=\"\",\"\",'[3]Base Dados'!P$39)","v":2.3E-2},{"$f":"IF('[3]Base Dados'!P$38=\"\",\"\",'[3]Base Dados'!P$38)","v":""},2.3407556917663584E-2,"",null,12,"DEZ",{"$f":"IF('[3]Base Dados'!P$29=\"\",\"\",'[3]Base Dados'!P$29)","v":2.3E-2},{"$f":"IF('[3]Base Dados'!P$28=\"\",\"\",'[3]Base Dados'!P$28)","v":""},2.6930162737478208E-2,"",null,12,"DEZ",{"$f":"IF('[3]Base Dados'!P$44=\"\",\"\",'[3]Base Dados'!P$44)","v":0.03},{"$f":"'[3]Base Dados'!P$43","v":""},2.7269680237428283E-2,""]
[]
[null,"INDICADOR DO PCP",null,null,null,null,null,null,null,null,null,null,null,null,null,"INDICADOR DE DESENVOLVIMENTO",null,null,null,null,null,null,null,null,null,null,null,null,null,"INDICADORES DE RH"]
[]
[null,"OTIF",null,null,null,null,null,null,"TAXA DE REPROGRAMAÇÃO ",null,null,null,null,null,null,"PROJETOS ENCERRADOS X CRONOGRAMA ",null,null,null,null,null,null,"EXECUÇÃO DE TESTES ",null,null,null,null,null,null,"ABSENTEÍSMO ",null,null,null,null,null,null,"TREINAMENTO "]
[]
[null,"Mês Selecionado",null,null,{"$f":"E6","v":9},"Status Mês",{"$f":"VLOOKUP($E$6,$B$8:$G$19,6,FALSE)","v":0.95},null,"Mês Selecionado",null,null,{"$f":"E44","v":9},"Status Mês",{"$f":"VLOOKUP(L44,I46:N57,6,FALSE)","v":0.51999999999999991},null,"Mês Selecionado",null,null,{"$f":"E6","v":9},"Status Mês",{"$f":"VLOOKUP($E$6,$B$8:$G$19,6,FALSE)","v":0.95},null,"Mês Selecionado",null,null,{"$f":"S44","v":9},"Status Mês",{"$f":"VLOOKUP(Z44,W46:AB57,6,FALSE)","v":1.1120064464141821},null,"Mês Selecionado",null,null,{"$f":"E6","v":9},"Status Mês",{"$f":"VLOOKUP($E$6,$B$8:$G$19,6,FALSE)","v":0.95},null,"Mês Selecionado",null,null,{"$f":"AG44","v":9},"Status Mês",{"$f":"VLOOKUP(AN44,AK46:AP57,6,FALSE)","v":1.1417682926829269}]
[null,null,null,"Meta","Realizado","Média","Status",null,null,null,"Meta","Realizado","Média","Status",null,null,null,"Meta","Realizado","Média","Status",null,null,null,"Meta","Realizado","Média","Status",null,null,null,"Meta","Realizado","Média","Status",null,null,null,"Meta","Realizado","Média","Status"]
[null,1,"JAN",{"$f":"IF('[3]Base Dados'!F$199=\"\",\"\",'[3]Base Dados'!F$199)","v":0.5},{"$f":"IF('[3]Base Dados'!F$198=\"\",\"\",'[3]Base Dados'!F$198)","v":0.36778115501519759},{"$f":"AVERAGE(E46:E57)","v":0.776730466155514},{"$f":"IF(E46=\"\",\"\",E46/D46)","v":0.73556231003039518},null,1,"JAN",{"$f":"IF('[3]Base Dados'!F$240=\"\",\"\",'[3]Base Dados'!F$240)","v":0.5},{"$f":"IF('[3]Base Dados'!F$239=\"\",\"\",'[3]Base Dados'!F$239)","v":0.28299999999999997},{"$f":"AVERAGE(L46:L57)","v":0.18533333333333335},{"$f":"IF(L46=\"\",\"\",L46/K46)","v":0.56599999999999995},null,1,"JAN",{"$f":"IF('[3]Base Dados'!F$345=\"\",\"\",'[3]Base Dados'!F$345)","v":0.85},{"$f":"IF('[3]Base Dados'!F$344=\"\",\"\",'[3]Base Dados'!F$344)","v":0.81818181818181823},{"$f":"AVERAGE(S46:S57)","v":0.95757575757575752},{"$f":"IF(S46=\"\",\"\",S46/R46)","v":0.96256684491978617},null,1,"JAN",0.85,0.94339622641509435,{"$f":"AVERAGE(Z46:Z57)","v":0.74330668780078613},{"$f":"IF(Z46=\"\",\"\",Z46/Y46)","v":1.1098779134295227},null,1,"JAN",0.02,5.5753968253968254E-3,{"$f":"AVERAGE(AG46:AG57)","v":2.2721778283003514E-2},{"$f":"IF(AG46=\"\",\"\",AG46/AF46)","v":0.27876984126984128},null,1,"JAN",0.5,2.4230769230769229,{"$f":"AVERAGE(AN46:AN57)","v":0.62008637865172922},{"$f":"IF(AN46=\"\",\"\",AN46/AM46)","v":4.8461538461538458}]
[null,2,"FEV",{"$f":"IF('[3]Base Dados'!G$199=\"\",\"\",'[3]Base Dados'!G$199)","v":0.6},{"$f":"IF('[3]Base Dados'!G$198=\"\",\"\",'[3]Base Dados'!G$198)","v":0.42577030812324929},{"$f":"F46","v":0.776730466155514},0.70961718020541553,null,2,"FEV",{"$f":"IF('[3]Base Dados'!G$240=\"\",\"\",'[3]Base Dados'!G$240)","v":0.4},{"$f":"IF('[3]Base Dados'!G$239=\"\",\"\",'[3]Base Dados'!G$239)","v":0.25700000000000001},{"$f":"M46","v":0.18533333333333335},0.64249999999999996,null,2,"FEV",{"$f":"IF('[3]Base Dados'!G$345=\"\",\"\",'[3]Base Dados'!G$345)","v":0.85},{"$f":"IF('[3]Base Dados'!G$344=\"\",\"\",'[3]Base Dados'!G$344)","v":0.9},{"$f":"T46","v":0.95757575757575752},1.0588235294117647,null,2,"FEV",0.85,0.61111111111111116,{"$f":"AA46","v":0.74330668780078613},0.71895424836601318,null,2,"FEV",0.02,8.8795289855072464E-3,{"$f":"AH46","v":2.2721778283003514E-2},0.44397644927536228,null,2,"FEV",0.5,0.93625352112676052,{"$f":"AO46","v":0.62008637865172922},1.872507042253521]
[null,3,"MAR",{"$f":"IF('[3]Base Dados'!H$199=\"\",\"\",'[3]Base Dados'!H$199)","v":0.7},{"$f":"IF('[3]Base Dados'!H$198=\"\",\"\",'[3]Base Dados'!H$198)","v":0.78947368421052633},{"$f":"F47","v":0.776730466155514},1.1278195488721805,null,3,"MAR",{"$f":"IF('[3]Base Dados'!H$240=\"\",\"\",'[3]Base Dados'!H$240)","v":0.3},{"$f":"IF('[3]Base Dados'!H$239=\"\",\"\",'[3]Base Dados'!H$239)","v":0.27100000000000002},{"$f":"M47","v":0.18533333333333335},0.90333333333333343,null,3,"MAR",{"$f":"IF('[3]Base Dados'!H$345=\"\",\"\",'[3]Base Dados'!H$345)","v":0.85},{"$f":"IF('[3]Base Dados'!H$344=\"\",\"\",'[3]Base Dados'!H$344)","v":1},{"$f":"T47","v":0.95757575757575752},1.1764705882352942,null,3,"MAR",0.85,0.36274509803921567,{"$f":"AA47","v":0.74330668780078613},0.42675893886966548,null,3,"MAR",0.02,1.5478145528044466E-2,{"$f":"AH47","v":2.2721778283003514E-2},0.77390727640222334,null,3,"MAR",0.5,0.39208823529411763,{"$f":"AO47","v":0.62008637865172922},0.78417647058823525]
[null,4,"ABR",{"$f":"IF('[3]Base Dados'!I$199=\"\",\"\",'[3]Base Dados'!I$199)","v":0.8},{"$f":"IF('[3]Base Dados'!I$198=\"\",\"\",'[3]Base Dados'!I$198)","v":0.80246913580246915},0.776730466155514,1.0030864197530864,null,4,"ABR",{"$f":"IF('[3]Base Dados'!I$240=\"\",\"\",'[3]Base Dados'!I$240)","v":0.3},{"$f":"IF('[3]Base Dados'!I$239=\"\",\"\",'[3]Base Dados'!I$239)","v":0.21099999999999999},0.18533333333333335,0.70333333333333337,null,4,"ABR",{"$f":"IF('[3]Base Dados'!I$345=\"\",\"\",'[3]Base Dados'!I$345)","v":0.85},{"$f":"IF('[3]Base Dados'!I$344=\"\",\"\",'[3]Base Dados'!I$344)","v":1},0.95757575757575752,1.1764705882352942,null,4,"ABR",0.85,0.42307692307692307,0.74330668780078613,0.49773755656108598,null,4,"ABR",0.02,2.4016525539470091E-2,2.2721778283003514E-2,1.2008262769735045,null,4,"ABR",0.5,5.2552552552552556E-3,0.62008637865172922,1.0510510510510511E-2]
[null,5,"MAI",{"$f":"IF('[3]Base Dados'!J$199=\"\",\"\",'[3]Base Dados'!J$199)","v":0.9},{"$f":"IF('[3]Base Dados'!J$198=\"\",\"\",'[3]Base Dados'!J$198)","v":0.79922779922779918},0.776730466155514,0.88803088803088792,null,5,"MAI",{"$f":"IF('[3]Base Dados'!J$240=\"\",\"\",'[3]Base Dados'!J$240)","v":0.3},{"$f":"IF('[3]Base Dados'!J$239=\"\",\"\",'[3]Base Dados'!J$239)","v":0.19},0.18533333333333335,0.63333333333333341,null,5,"MAI",{"$f":"IF('[3]Base Dados'!J$345=\"\",\"\",'[3]Base Dados'!J$345)","v":0.85},{"$f":"IF('[3]Base Dados'!J$344=\"\",\"\",'[3]Base Dados'!J$344)","v":0.9},0.95757575757575752,1.0588235294117647,null,5,"MAI",0.85,0.83098591549295775,0.74330668780078613,0.97763048881524439,null,5,"MAI",0.02,1.6262935729847494E-2,2.2721778283003514E-2,0.81314678649237471,null,5,"MAI",0.5,0.38142011834319522,0.62008637865172922,0.76284023668639045]
[null,6,"JUN",{"$f":"IF('[3]Base Dados'!K$199=\"\",\"\",'[3]Base Dados'!K$199)","v":0.91},{"$f":"IF('[3]Base Dados'!K$198=\"\",\"\",'[3]Base Dados'!K$198)","v":0.94076655052264813},0.776730466155514,1.0338093961787342,null,6,"JUN",{"$f":"IF('[3]Base Dados'!K$240=\"\",\"\",'[3]Base Dados'!K$240)","v":0.2},{"$f":"IF('[3]Base Dados'!K$239=\"\",\"\",'[3]Base Dados'!K$239)","v":7.0999999999999994E-2},0.18533333333333335,0.35499999999999993,null,6,"JUN",{"$f":"IF('[3]Base Dados'!K$345=\"\",\"\",'[3]Base Dados'!K$345)","v":0.85},{"$f":"IF('[3]Base Dados'!K$344=\"\",\"\",'[3]Base Dados'!K$344)","v":1},0.95757575757575752,1.1764705882352942,null,6,"JUN",0.85,0.89230769230769236,0.74330668780078613,1.0497737556561086,null,6,"JUN",0.02,1.696696157036218E-2,2.2721778283003514E-2,0.84834807851810901,null,6,"JUN",0.5,0.26923076923076922,0.62008637865172922,0.53846153846153844]
[null,7,"JUL",{"$f":"IF('[3]Base Dados'!L$199=\"\",\"\",'[3]Base Dados'!L$199)","v":0.93},{"$f":"IF('[3]Base Dados'!L$198=\"\",\"\",'[3]Base Dados'!L$198)","v":0.93498452012383904},0.776730466155514,1.0053596990578915,null,7,"JUL",{"$f":"IF('[3]Base Dados'!L$240=\"\",\"\",'[3]Base Dados'!L$240)","v":0.2},{"$f":"IF('[3]Base Dados'!L$239=\"\",\"\",'[3]Base Dados'!L$239)","v":0.14899999999999999},0.18533333333333335,0.74499999999999988,null,7,"JUL",{"$f":"IF('[3]Base Dados'!L$345=\"\",\"\",'[3]Base Dados'!L$345)","v":0.85},{"$f":"IF('[3]Base Dados'!L$344=\"\",\"\",'[3]Base Dados'!L$344)","v":1},0.95757575757575752,1.1764705882352942,null,7,"JUL",0.85,0.87323943661971826,0.74330668780078613,1.0273405136702567,null,7,"JUL",0.02,2.7978767123287673E-2,2.2721778283003514E-2,1.3989383561643836,null,7,"JUL",0.5,0.36253776435045315,0.62008637865172922,0.7250755287009063]
[null,8,"AGO",{"$f":"IF('[3]Base Dados'!M$199=\"\",\"\",'[3]Base Dados'!M$199)","v":0.95},{"$f":"IF('[3]Base Dados'!M$198=\"\",\"\",'[3]Base Dados'!M$198)","v":0.97667638483965014},0.776730466155514,1.0280804050943686,null,8,"AGO",{"$f":"IF('[3]Base Dados'!M$240=\"\",\"\",'[3]Base Dados'!M$240)","v":0.2},{"$f":"IF('[3]Base Dados'!M$239=\"\",\"\",'[3]Base Dados'!M$239)","v":0.13200000000000001},0.18533333333333335,0.66,null,8,"AGO",{"$f":"IF('[3]Base Dados'!M$345=\"\",\"\",'[3]Base Dados'!M$345)","v":0.85},{"$f":"IF('[3]Base Dados'!M$344=\"\",\"\",'[3]Base Dados'!M$344)","v":1},0.95757575757575752,1.1764705882352942,null,8,"AGO",0.85,0.80769230769230771,0.74330668780078613,0.95022624434389147,null,8,"AGO",0.02,5.1682664853840925E-2,2.2721778283003514E-2,2.584133242692046,null,8,"AGO",0.5,0.24003067484662577,0.62008637865172922,0.48006134969325154]
[null,9,"SET",{"$f":"IF('[3]Base Dados'!N$199=\"\",\"\",'[3]Base Dados'!N$199)","v":0.95},{"$f":"IF('[3]Base Dados'!N$198=\"\",\"\",'[3]Base Dados'!N$198)","v":0.95342465753424654},0.776730466155514,1.0036049026676279,null,9,"SET",{"$f":"IF('[3]Base Dados'!N$240=\"\",\"\",'[3]Base Dados'!N$240)","v":0.2},{"$f":"IF('[3]Base Dados'!N$239=\"\",\"\",'[3]Base Dados'!N$239)","v":0.104},0.18533333333333335,0.51999999999999991,null,9,"SET",{"$f":"IF('[3]Base Dados'!N$345=\"\",\"\",'[3]Base Dados'!N$345)","v":0.85},{"$f":"IF('[3]Base Dados'!N$344=\"\",\"\",'[3]Base Dados'!N$344)","v":1},0.95757575757575752,1.1764705882352942,null,9,"SET",0.85,0.9452054794520548,0.74330668780078613,1.1120064464141821,null,9,"SET",0.02,3.7655078391274709E-2,2.2721778283003514E-2,1.8827539195637355,null,9,"SET",0.5,0.57088414634146345,0.62008637865172922,1.1417682926829269]
[null,10,"OUT",{"$f":"IF('[3]Base Dados'!O$199=\"\",\"\",'[3]Base Dados'!O$199)","v":0.95},{"$f":"IF('[3]Base Dados'!O$198=\"\",\"\",'[3]Base Dados'!O$198)","v":""},0.776730466155514,"",null,10,"OUT",{"$f":"IF('[3]Base Dados'!O$240=\"\",\"\",'[3]Base Dados'!O$240)","v":""},{"$f":"IF('[3]Base Dados'!O$239=\"\",\"\",'[3]Base Dados'!O$239)","v":""},0.18533333333333335,"",null,10,"OUT",{"$f":"IF('[3]Base Dados'!O$345=\"\",\"\",'[3]Base Dados'!O$345)","v":0.85},{"$f":"IF('[3]Base Dados'!O$344=\"\",\"\",'[3]Base Dados'!O$344)","v":""},0.95757575757575752,"",null,10,"OUT",0.85,"",0.74330668780078613,"",null,10,"OUT",0.02,"",2.2721778283003514E-2,"",null,10,"OUT",0.5,"",0.62008637865172922,""]
[null,11,"NOV",{"$f":"IF('[3]Base Dados'!P$199=\"\",\"\",'[3]Base Dados'!P$199)","v":0.95},{"$f":"IF('[3]Base Dados'!P$198=\"\",\"\",'[3]Base Dados'!P$198)","v":""},0.776730466155514,"",null,11,"NOV",{"$f":"IF('[3]Base Dados'!P$240=\"\",\"\",'[3]Base Dados'!P$240)","v":""},{"$f":"IF('[3]Base Dados'!P$239=\"\",\"\",'[3]Base Dados'!P$239)","v":""},0.18533333333333335,"",null,11,"NOV",{"$f":"IF('[3]Base Dados'!P$345=\"\",\"\",'[3]Base Dados'!P$345)","v":0.85},{"$f":"IF('[3]Base Dados'!P$344=\"\",\"\",'[3]Base Dados'!P$344)","v":""},0.95757575757575752,"",null,11,"NOV",0.85,"",0.74330668780078613,"",null,11,"NOV",0.02,"",2.2721778283003514E-2,"",null,11,"NOV",0.5,"",0.62008637865172922,""]
[null,12,"DEZ",{"$f":"IF('[3]Base Dados'!Q$199=\"\",\"\",'[3]Base Dados'!Q$199)","v":0.95},{"$f":"IF('[3]Base Dados'!Q$198=\"\",\"\",'[3]Base Dados'!Q$198)","v":""},0.776730466155514,"",null,12,"DEZ",{"$f":"IF('[3]Base Dados'!Q$240=\"\",\"\",'[3]Base Dados'!Q$240)","v":""},{"$f":"IF('[3]Base Dados'!Q$239=\"\",\"\",'[3]Base Dados'!Q$239)","v":""},0.18533333333333335,"",null,12,"DEZ",{"$f":"IF('[3]Base Dados'!Q$345=\"\",\"\",'[3]Base Dados'!Q$345)","v":0.85},{"$f":"IF('[3]Base Dados'!Q$344=\"\",\"\",'[3]Base Dados'!Q$344)","v":""},0.95757575757575752,"",null,12,"DEZ",0.85,"",0.74330668780078613,"",null,12,"DEZ",0.02,"",2.2721778283003514E-2,"",null,12,"DEZ",0.5,"",0.62008637865172922,""]

{"sheet":"Data","index":4,"n_rows":28,"n_cols":23,"rows_kept":28,"cut":false,"hidden":true,"merged":[[0,0,0,4],[14,0,14,4]]}
["Realizado "]
["Mês ","SATISFAÇÃO DE CLIENTE NPS","FATURAMENTO MENSAL ","EFICIÊNCIA DE MÃO DE OBRA ","REJEIÇÃO INTERNA ","HORAS DE RETRABALHO ","OEE SOPRO","OEE INJEÇÃO","OEE PET","OEE DECORAÇÃO","REFUGO SOPRO","REFUGO INJEÇÃO","REFUGO PET","REFUGO DECORAÇÃO","RNC DE CLIENTE ","CUSTO NÃO QUALIDADE","CERTIFICAÇÃO ISO 9001","OTIF","TAXA DE REPROGRAMAÇÃO ","PROJETOS ENCERRADOS X CRONOGRAMA ","EXECUÇÃO DE TESTES ","ABSENTEÍSMO ","TREINAMENTO "]
["JAN",{"$f":"Lançamento!E8","v":23},{"$f":"Lançamento!L8","v":5920749},{"$f":"Lançamento!S8","v":0.73464406827734263},{"$f":"Lançamento!Z8","v":3.3250000000000002E-2},{"$f":"Lançamento!AG8","v":521},{"$f":"Lançamento!E27","v":0.92900000000000005},{"$f":"Lançamento!L27","v":0.96799999999999997},{"$f":"Lançamento!S27","v":0.69401103799999997},{"$f":"Lançamento!Z27","v":0.96899999999999997},{"$f":"Lançamento!AG27","v":8.0528874531815106E-2},{"$f":"Lançamento!AN27","v":3.4632778233532849E-2},{"$f":"Lançamento!AU27","v":2.4886857044871362E-2},{"$f":"Lançamento!BB27","v":2.5657113794739093E-2},{"$f":"Lançamento!AN8","v":2},{"$f":"Lançamento!AU8","v":2.9999999999999997E-4},{"$f":"Lançamento!BB8","v":0.7},{"$f":"Lançamento!E46","v":0.36778115501519759},{"$f":"Lançamento!L46","v":0.28299999999999997},{"$f":"Lançamento!S46","v":0.81818181818181823},{"$f":"Lançamento!Z46","v":0.94339622641509435},{"$f":"Lançamento!AG46","v":5.5753968253968254E-3},{"$f":"Lançamento!AN46","v":2.4230769230769229}]
["FEV",{"$f":"Lançamento!E9","v":23},{"$f":"Lançamento!L9","v":6728756},{"$f":"Lançamento!S9","v":0.77387242928497535},{"$f":"Lançamento!Z9","v":3.5499999999999997E-2},{"$f":"Lançamento!AG9","v":1006.21},{"$f":"Lançamento!E28","v":0.91700000000000004},{"$f":"Lançamento!L28","v":0.97799999999999998},{"$f":"Lançamento!S28","v":0.71205220800000002},{"$f":"Lançamento!Z28","v":0.96799999999999997},{"$f":"Lançamento!AG28","v":8.3581188844346746E-2},{"$f":"Lançamento!AN28","v":2.1240827824348576E-2},{"$f":"Lançamento!AU28","v":2.836950210480476E-2},{"$f":"Lançamento!BB28","v":3.0621555377583761E-2},{"$f":"Lançamento!AN9","v":2},{"$f":"Lançamento!AU9","v":3.8999999999999998E-3},{"$f":"Lançamento!BB9","v":0.8},{"$f":"Lançamento!E47","v":0.42577030812324929},{"$f":"Lançamento!L47","v":0.25700000000000001},{"$f":"Lançamento!S47","v":0.9},{"$f":"Lançamento!Z47","v":0.61111111111111116},{"$f":"Lançamento!AG47","v":8.8795289855072464E-3},{"$f":"Lançamento!AN47","v":0.93625352112676052}]
["MAR",{"$f":"Lançamento!E10","v":23},{"$f":"Lançamento!L10","v":6056838},{"$f":"Lançamento!S10","v":0.842204436142444},{"$f":"Lançamento!Z10","v":2.5999999999999999E-2},{"$f":"Lançamento!AG10","v":789.62},{"$f":"Lançamento!E29","v":0.82199999999999995},{"$f":"Lançamento!L29","v":0.98},{"$f":"Lançamento!S29","v":0.68766053999999999},{"$f":"Lançamento!Z29","v":0.96399999999999997},{"$f":"Lançamento!AG29","v":8.2171679862793418E-2},{"$f":"Lançamento!AN29","v":2.6040004432887648E-2},{"$f":"Lançamento!AU29","v":3.1814904128532134E-2},{"$f":"Lançamento!BB29","v":3.1807503045503116E-2},{"$f":"Lançamento!AN10","v":6},{"$f":"Lançamento!AU10","v":4.3E-3},{"$f":"Lançamento!BB10","v":0.9},{"$f":"Lançamento!E48","v":0.78947368421052633},{"$f":"Lançamento!L48","v":0.27100000000000002},{"$f":"Lançamento!S48","v":1},{"$f":"Lançamento!Z48","v":0.36274509803921567},{"$f":"Lançamento!AG48","v":1.5478145528044466E-2},{"$f":"Lançamento!AN48","v":0.39208823529411763}]
["ABR",{"$f":"Lançamento!E11","v":23},{"$f":"Lançamento!L11","v":7056727},{"$f":"Lançamento!S11","v":0.86017741548789262},{"$f":"Lançamento!Z11","v":2.75E-2},{"$f":"Lançamento!AG11","v":148.72},{"$f":"Lançamento!E30","v":0.94},{"$f":"Lançamento!L30","v":0.97199999999999998},{"$f":"Lançamento!S30","v":0.7738216},{"$f":"Lançamento!Z30","v":0.97599999999999998},{"$f":"Lançamento!AG30","v":6.0168624015808178E-2},{"$f":"Lançamento!AN30","v":2.8207264055136527E-2},{"$f":"Lançamento!AU30","v":2.4343215555389628E-2},{"$f":"Lançamento!BB30","v":3.5551562272665781E-2},{"$f":"Lançamento!AN11","v":3},{"$f":"Lançamento!AU11","v":3.0999999999999999E-3},{"$f":"Lançamento!BB11","v":0.9},{"$f":"Lançamento!E49","v":0.80246913580246915},{"$f":"Lançamento!L49","v":0.21099999999999999},{"$f":"Lançamento!S49","v":1},{"$f":"Lançamento!Z49","v":0.42307692307692307},{"$f":"Lançamento!AG49","v":2.4016525539470091E-2},{"$f":"Lançamento!AN49","v":5.2552552552552556E-3}]
["MAI",{"$f":"Lançamento!E12","v":23},{"$f":"Lançamento!L12","v":6779006.2599999998},{"$f":"Lançamento!S12","v":0.9057103007107522},{"$f":"Lançamento!Z12","v":3.4500000000000003E-2},{"$f":"Lançamento!AG12","v":519.55999999999995},{"$f":"Lançamento!E31","v":0.94799999999999995},{"$f":"Lançamento!L31","v":0.97299999999999998},{"$f":"Lançamento!S31","v":0.80777087999999997},{"$f":"Lançamento!Z31","v":0.97799999999999998},{"$f":"Lançamento!AG31","v":5.1939948570564214E-2},{"$f":"Lançamento!AN31","v":2.6498512115629872E-2},{"$f":"Lançamento!AU31","v":2.0084836307388096E-2},{"$f":"Lançamento!BB31","v":2.3760550948875969E-2},{"$f":"Lançamento!AN12","v":5},{"$f":"Lançamento!AU12","v":4.4999999999999997E-3},{"$f":"Lançamento!BB12","v":0.95},{"$f":"Lançamento!E50","v":0.79922779922779918},{"$f":"Lançamento!L50","v":0.19},{"$f":"Lançamento!S50","v":0.9},{"$f":"Lançamento!Z50","v":0.83098591549295775},{"$f":"Lançamento!AG50","v":1.6262935729847494E-2},{"$f":"Lançamento!AN50","v":0.38142011834319522}]
["JUN",{"$f":"Lançamento!E13","v":23},{"$f":"Lançamento!L13","v":6700902},{"$f":"Lançamento!S13","v":0.90045835855746781},{"$f":"Lançamento!Z13","v":3.8000000000000006E-2},{"$f":"Lançamento!AG13","v":1192},{"$f":"Lançamento!E32","v":0.998},{"$f":"Lançamento!L32","v":0.998},{"$f":"Lançamento!S32","v":0.77045385600000005},{"$f":"Lançamento!Z32","v":0.97199999999999998},{"$f":"Lançamento!AG32","v":7.2554415811858897E-2},{"$f":"Lançamento!AN32","v":2.6755852842809364E-2},{"$f":"Lançamento!AU32","v":2.7676409399406569E-2},{"$f":"Lançamento!BB32","v":2.2229866860002025E-2},{"$f":"Lançamento!AN13","v":9},{"$f":"Lançamento!AU13","v":5.67E-2},{"$f":"Lançamento!BB13","v":0.95},{"$f":"Lançamento!E51","v":0.94076655052264813},{"$f":"Lançamento!L51","v":7.0999999999999994E-2},{"$f":"Lançamento!S51","v":1},{"$f":"Lançamento!Z51","v":0.89230769230769236},{"$f":"Lançamento!AG51","v":1.696696157036218E-2},{"$f":"Lançamento!AN51","v":0.26923076923076922}]
["JUL",{"$f":"Lançamento!E14","v":57},{"$f":"Lançamento!L14","v":7395049},{"$f":"Lançamento!S14","v":0.85267267742129005},{"$f":"Lançamento!Z14","v":7.8000000000000014E-2},{"$f":"Lançamento!AG14","v":1445},{"$f":"Lançamento!E33","v":0.93700000000000006},{"$f":"Lançamento!L33","v":0.98499999999999999},{"$f":"Lançamento!S33","v":0.72912830400000006},{"$f":"Lançamento!Z33","v":0.97399999999999998},{"$f":"Lançamento!AG33","v":6.2702785723885032E-2},{"$f":"Lançamento!AN33","v":1.5301672877190201E-2},{"$f":"Lançamento!AU33","v":2.8239956605005924E-2},{"$f":"Lançamento!BB33","v":2.4570369538357856E-2},{"$f":"Lançamento!AN14","v":5},{"$f":"Lançamento!AU14","v":2.9100000000000001E-2},{"$f":"Lançamento!BB14","v":1},{"$f":"Lançamento!E52","v":0.93498452012383904},{"$f":"Lançamento!L52","v":0.14899999999999999},{"$f":"Lançamento!S52","v":1},{"$f":"Lançamento!Z52","v":0.87323943661971826},{"$f":"Lançamento!AG52","v":2.7978767123287673E-2},{"$f":"Lançamento!AN52","v":0.36253776435045315}]
["AGO",{"$f":"Lançamento!E15","v":57},{"$f":"Lançamento!L15","v":7010077},{"$f":"Lançamento!S15","v":0.76411261114431106},{"$f":"Lançamento!Z15","v":6.0750000000000005E-2},{"$f":"Lançamento!AG15","v":623},{"$f":"Lançamento!E34","v":0.91200000000000003},{"$f":"Lançamento!L34","v":0.98499999999999999},{"$f":"Lançamento!S34","v":0.75150943999999997},{"$f":"Lançamento!Z34","v":0.97199999999999998},{"$f":"Lançamento!AG34","v":8.7873310956192441E-2},{"$f":"Lançamento!AN34","v":1.4810562571756601E-2},{"$f":"Lançamento!AU34","v":2.9577147998200631E-2},{"$f":"Lançamento!BB34","v":2.5700911651276213E-2},{"$f":"Lançamento!AN15","v":2},{"$f":"Lançamento!AU15","v":1.1000000000000001E-3},{"$f":"Lançamento!BB15","v":1},{"$f":"Lançamento!E53","v":0.97667638483965014},{"$f":"Lançamento!L53","v":0.13200000000000001},{"$f":"Lançamento!S53","v":1},{"$f":"Lançamento!Z53","v":0.80769230769230771},{"$f":"Lançamento!AG53","v":5.1682664853840925E-2},{"$f":"Lançamento!AN53","v":0.24003067484662577}]
["SET",{"$f":"Lançamento!E16","v":57},{"$f":"Lançamento!L16","v":7565275},{"$f":"Lançamento!S16","v":0.91938260624690249},{"$f":"Lançamento!Z16","v":5.2500000000000005E-2},{"$f":"Lançamento!AG16","v":691},{"$f":"Lançamento!E35","v":0.90600000000000003},{"$f":"Lançamento!L35","v":0.97799999999999998},{"$f":"Lançamento!S35","v":0.79561145999999994},{"$f":"Lançamento!Z35","v":0.97599999999999998},{"$f":"Lançamento!AG35","v":9.4170537096582116E-2},{"$f":"Lançamento!AN35","v":2.1757290400972053E-2},{"$f":"Lançamento!AU35","v":3.0099036502451656E-2},{"$f":"Lançamento!BB35","v":2.8320546253952656E-2},{"$f":"Lançamento!AN16","v":2},{"$f":"Lançamento!AU16","v":4.1000000000000003E-3},{"$f":"Lançamento!BB16","v":1},{"$f":"Lançamento!E54","v":0.95342465753424654},{"$f":"Lançamento!L54","v":0.104},{"$f":"Lançamento!S54","v":1},{"$f":"Lançamento!Z54","v":0.9452054794520548},{"$f":"Lançamento!AG54","v":3.7655078391274709E-2},{"$f":"Lançamento!AN54","v":0.57088414634146345}]
["OUT",{"$f":"Lançamento!E17","v":""},{"$f":"Lançamento!L17","v":""},{"$f":"Lançamento!S17","v":""},{"$f":"Lançamento!Z17","v":""},{"$f":"Lançamento!AG17","v":""},{"$f":"Lançamento!E36","v":0.91800000000000004},{"$f":"Lançamento!L36","v":0.98099999999999998},{"$f":"Lançamento!S36","v":0.782752},{"$f":"Lançamento!Z36","v":""},{"$f":"Lançamento!AG36","v":8.1494599930321682E-2},{"$f":"Lançamento!AN36","v":1.8830803822372118E-2},{"$f":"Lançamento!AU36","v":2.4209761728731339E-2},{"$f":"Lançamento!BB36","v":2.4476822631326348E-2},{"$f":"Lançamento!AN17","v":""},{"$f":"Lançamento!AU17","v":""},{"$f":"Lançamento!BB17","v":1},{"$f":"Lançamento!E55","v":""},{"$f":"Lançamento!L55","v":""},{"$f":"Lançamento!S55","v":""},{"$f":"Lançamento!Z55","v":""},{"$f":"Lançamento!AG55","v":""},{"$f":"Lançamento!AN55","v":""}]
["NOV",{"$f":"Lançamento!E18","v":""},{"$f":"Lançamento!L18","v":""},{"$f":"Lançamento!S18","v":""},{"$f":"Lançamento!Z18","v":""},{"$f":"Lançamento!AG18","v":""},{"$f":"Lançamento!E37","v":0},{"$f":"Lançamento!L37","v":""},{"$f":"Lançamento!S37","v":""},{"$f":"Lançamento!Z37","v":""},{"$f":"Lançamento!AG37","v":""},{"$f":"Lançamento!AN37","v":""},{"$f":"Lançamento!AU37","v":""},{"$f":"Lançamento!BB37","v":""},{"$f":"Lançamento!AN18","v":""},{"$f":"Lançamento!AU18","v":""},{"$f":"Lançamento!BB18","v":1},{"$f":"Lançamento!E56","v":""},{"$f":"Lançamento!L56","v":""},{"$f":"Lançamento!S56","v":""},{"$f":"Lançamento!Z56","v":""},{"$f":"Lançamento!AG56","v":""},{"$f":"Lançamento!AN56","v":""}]
["DEZ",{"$f":"Lançamento!E19","v":""},{"$f":"Lançamento!L19","v":""},{"$f":"Lançamento!S19","v":""},{"$f":"Lançamento!Z19","v":""},{"$f":"Lançamento!AG19","v":""},{"$f":"Lançamento!E38","v":0},{"$f":"Lançamento!L38","v":""},{"$f":"Lançamento!S38","v":""},{"$f":"Lançamento!Z38","v":""},{"$f":"Lançamento!AG38","v":""},{"$f":"Lançamento!AN38","v":""},{"$f":"Lançamento!AU38","v":""},{"$f":"Lançamento!BB38","v":""},{"$f":"Lançamento!AN19","v":2},{"$f":"Lançamento!AU19","v":""},{"$f":"Lançamento!BB19","v":1},{"$f":"Lançamento!E57","v":""},{"$f":"Lançamento!L57","v":""},{"$f":"Lançamento!S57","v":""},{"$f":"Lançamento!Z57","v":""},{"$f":"Lançamento!AG57","v":""},{"$f":"Lançamento!AN57","v":""}]
["Meta"]
[null,"SATISFAÇÃO DE CLIENTE NPS","FATURAMENTO MENSAL ","EFICIÊNCIA DE MÃO DE OBRA ","REJEIÇÃO INTERNA ","HORAS DE RETRABALHO ","OEE SOPRO","OEE INJEÇÃO","OEE PET","OEE DECORAÇÃO","REFUGO SOPRO","REFUGO INJEÇÃO","REFUGO PET","REFUGO DECORAÇÃO","RNC DE CLIENTE ","CUSTO NÃO QUALIDADE","CERTIFICAÇÃO ISO 9001","OTIF","TAXA DE REPROGRAMAÇÃO ","PROJETOS ENCERRADOS X CRONOGRAMA ","EXECUÇÃO DE TESTES ","ABSENTEÍSMO ","TREINAMENTO "]
["JAN",{"$f":"Lançamento!D8","v":60},{"$f":"Lançamento!K8","v":5969034},70,{"$f":"Lançamento!Y8","v":0.05},{"$f":"Lançamento!AF8","v":600},{"$f":"Lançamento!D27","v":0.61408757999999997},{"$f":"Lançamento!K27","v":0.64728224000000001},{"$f":"Lançamento!R27","v":0.7},{"$f":"Lançamento!Y27","v":0.51563397},{"$f":"Lançamento!AF27","v":0.04},{"$f":"Lançamento!AM27","v":2.5000000000000001E-2},{"$f":"Lançamento!AT27","v":0.01},{"$f":"Lançamento!BA27","v":0.03},{"$f":"Lançamento!AM8","v":3},{"$f":"Lançamento!AT8","v":1.4999999999999999E-2},{"$f":"Lançamento!BA8","v":1},{"$f":"Lançamento!D46","v":0.5},{"$f":"Lançamento!K46","v":0.5},{"$f":"Lançamento!R46","v":0.85},{"$f":"Lançamento!Y46","v":0.85},{"$f":"Lançamento!AF46","v":0.02},{"$f":"Lançamento!AM46","v":0.5}]
["FEV",{"$f":"Lançamento!D9","v":60},{"$f":"Lançamento!K9","v":7134119},71,{"$f":"Lançamento!Y9","v":0.05},{"$f":"Lançamento!AF9","v":600},{"$f":"Lançamento!D28","v":0.53724278999999997},{"$f":"Lançamento!K28","v":0.60956783999999997},{"$f":"Lançamento!R28","v":0.7},{"$f":"Lançamento!Y28","v":0.53750619999999993},{"$f":"Lançamento!AF28","v":7.4999999999999997E-2},{"$f":"Lançamento!AM28","v":0.03},{"$f":"Lançamento!AT28","v":0.03},{"$f":"Lançamento!BA28","v":0.03},{"$f":"Lançamento!AM9","v":3},{"$f":"Lançamento!AT9","v":1.4999999999999999E-2},{"$f":"Lançamento!BA9","v":1},{"$f":"Lançamento!D47","v":0.6},{"$f":"Lançamento!K47","v":0.4},{"$f":"Lançamento!R47","v":0.85},{"$f":"Lançamento!Y47","v":0.85},{"$f":"Lançamento!AF47","v":0.02},{"$f":"Lançamento!AM47","v":0.5}]
["MAR",{"$f":"Lançamento!D10","v":60},{"$f":"Lançamento!K10","v":7102330},72,{"$f":"Lançamento!Y10","v":0.05},{"$f":"Lançamento!AF10","v":600},{"$f":"Lançamento!D29","v":0.5980691159999999},{"$f":"Lançamento!K29","v":0.59440920000000008},{"$f":"Lançamento!R29","v":0.7},{"$f":"Lançamento!Y29","v":0.50111033599999999},{"$f":"Lançamento!AF29","v":7.4999999999999997E-2},{"$f":"Lançamento!AM29","v":0.03},{"$f":"Lançamento!AT29","v":0.03},{"$f":"Lançamento!BA29","v":0.03},{"$f":"Lançamento!AM10","v":3},{"$f":"Lançamento!AT10","v":1.4999999999999999E-2},{"$f":"Lançamento!BA10","v":1},{"$f":"Lançamento!D48","v":0.7},{"$f":"Lançamento!K48","v":0.3},{"$f":"Lançamento!R48","v":0.85},{"$f":"Lançamento!Y48","v":0.85},{"$f":"Lançamento!AF48","v":0.02},{"$f":"Lançamento!AM48","v":0.5}]
["ABR",{"$f":"Lançamento!D11","v":60},{"$f":"Lançamento!K11","v":6681373},73,{"$f":"Lançamento!Y11","v":4.4999999999999998E-2},{"$f":"Lançamento!AF11","v":500},{"$f":"Lançamento!D30","v":0.62634455999999994},{"$f":"Lançamento!K30","v":0.69918681599999999},{"$f":"Lançamento!R30","v":0.7},{"$f":"Lançamento!Y30","v":0.65684214399999996},{"$f":"Lançamento!AF30","v":6.5000000000000002E-2},{"$f":"Lançamento!AM30","v":0.03},{"$f":"Lançamento!AT30","v":0.03},{"$f":"Lançamento!BA30","v":0.03},{"$f":"Lançamento!AM11","v":3},{"$f":"Lançamento!AT11","v":1.4999999999999999E-2},{"$f":"Lançamento!BA11","v":1},{"$f":"Lançamento!D49","v":0.8},{"$f":"Lançamento!K49","v":0.3},{"$f":"Lançamento!R49","v":0.85},{"$f":"Lançamento!Y49","v":0.85},{"$f":"Lançamento!AF49","v":0.02},{"$f":"Lançamento!AM49","v":0.5}]
["MAI",{"$f":"Lançamento!D12","v":60},{"$f":"Lançamento!K12","v":6417033},74,{"$f":"Lançamento!Y12","v":0.04},{"$f":"Lançamento!AF12","v":500},{"$f":"Lançamento!D31","v":0.67903628399999993},{"$f":"Lançamento!K31","v":0.69880859999999989},{"$f":"Lançamento!R31","v":0.7},{"$f":"Lançamento!Y31","v":0.69829199999999991},{"$f":"Lançamento!AF31","v":6.5000000000000002E-2},{"$f":"Lançamento!AM31","v":0.03},{"$f":"Lançamento!AT31","v":0.03},{"$f":"Lançamento!BA31","v":0.03},{"$f":"Lançamento!AM12","v":2},{"$f":"Lançamento!AT12","v":5.0000000000000001E-3},{"$f":"Lançamento!BA12","v":1},{"$f":"Lançamento!D50","v":0.9},{"$f":"Lançamento!K50","v":0.3},{"$f":"Lançamento!R50","v":0.85},{"$f":"Lançamento!Y50","v":0.85},{"$f":"Lançamento!AF50","v":0.02},{"$f":"Lançamento!AM50","v":0.5}]
["JUN",{"$f":"Lançamento!D13","v":60},{"$f":"Lançamento!K13","v":6420195},75,{"$f":"Lançamento!Y13","v":0.04},{"$f":"Lançamento!AF13","v":500},{"$f":"Lançamento!D32","v":0.64089164799999998},{"$f":"Lançamento!K32","v":0.72424460800000001},{"$f":"Lançamento!R32","v":0.7},{"$f":"Lançamento!Y32","v":0.76026923999999996},{"$f":"Lançamento!AF32","v":6.5000000000000002E-2},{"$f":"Lançamento!AM32","v":0.03},{"$f":"Lançamento!AT32","v":0.03},{"$f":"Lançamento!BA32","v":0.03},{"$f":"Lançamento!AM13","v":2},{"$f":"Lançamento!AT13","v":5.0000000000000001E-3},{"$f":"Lançamento!BA13","v":1},{"$f":"Lançamento!D51","v":0.91},{"$f":"Lançamento!K51","v":0.2},{"$f":"Lançamento!R51","v":0.85},{"$f":"Lançamento!Y51","v":0.85},{"$f":"Lançamento!AF51","v":0.02},{"$f":"Lançamento!AM51","v":0.5}]
["JUL",{"$f":"Lançamento!D14","v":60},{"$f":"Lançamento!K14","v":7124833},76,{"$f":"Lançamento!Y14","v":3.5000000000000003E-2},{"$f":"Lançamento!AF14","v":500},{"$f":"Lançamento!D33","v":0.68204417399999995},{"$f":"Lançamento!K33","v":0.78894165999999988},{"$f":"Lançamento!R33","v":0.72},{"$f":"Lançamento!Y33","v":0.68483887999999993},{"$f":"Lançamento!AF33","v":6.5000000000000002E-2},{"$f":"Lançamento!AM33","v":2.3E-2},{"$f":"Lançamento!AT33","v":2.7E-2},{"$f":"Lançamento!BA33","v":0.03},{"$f":"Lançamento!AM14","v":2},{"$f":"Lançamento!AT14","v":5.0000000000000001E-3},{"$f":"Lançamento!BA14","v":1},{"$f":"Lançamento!D52","v":0.93},{"$f":"Lançamento!K52","v":0.2},{"$f":"Lançamento!R52","v":0.85},{"$f":"Lançamento!Y52","v":0.85},{"$f":"Lançamento!AF52","v":0.02},{"$f":"Lançamento!AM52","v":0.5}]
["AGO",{"$f":"Lançamento!D15","v":60},{"$f":"Lançamento!K15","v":7183658},77,{"$f":"Lançamento!Y15","v":3.5000000000000003E-2},{"$f":"Lançamento!AF15","v":500},{"$f":"Lançamento!D34","v":0.59633582400000007},{"$f":"Lançamento!K34","v":0.67671864000000004},{"$f":"Lançamento!R34","v":0.72},{"$f":"Lançamento!Y34","v":0.735275232},{"$f":"Lançamento!AF34","v":6.2E-2},{"$f":"Lançamento!AM34","v":2.3E-2},{"$f":"Lançamento!AT34","v":2.7E-2},{"$f":"Lançamento!BA34","v":0.03},{"$f":"Lançamento!AM15","v":2},{"$f":"Lançamento!AT15","v":5.0000000000000001E-3},{"$f":"Lançamento!BA15","v":1},{"$f":"Lançamento!D53","v":0.95},{"$f":"Lançamento!K53","v":0.2},{"$f":"Lançamento!R53","v":0.85},{"$f":"Lançamento!Y53","v":0.85},{"$f":"Lançamento!AF53","v":0.02},{"$f":"Lançamento!AM53","v":0.5}]
["SET",{"$f":"Lançamento!D16","v":60},{"$f":"Lançamento!K16","v":7387825},78,{"$f":"Lançamento!Y16","v":3.5000000000000003E-2},{"$f":"Lançamento!AF16","v":500},{"$f":"Lançamento!D35","v":0.504817764},{"$f":"Lançamento!K35","v":0.68800735199999996},{"$f":"Lançamento!R35","v":0.74},{"$f":"Lançamento!Y35","v":0.72784614399999992},{"$f":"Lançamento!AF35","v":0.06},{"$f":"Lançamento!AM35","v":2.3E-2},{"$f":"Lançamento!AT35","v":2.5000000000000001E-2},{"$f":"Lançamento!BA35","v":0.03},{"$f":"Lançamento!AM16","v":2},{"$f":"Lançamento!AT16","v":5.0000000000000001E-3},{"$f":"Lançamento!BA16","v":1},{"$f":"Lançamento!D54","v":0.95},{"$f":"Lançamento!K54","v":0.2},{"$f":"Lançamento!R54","v":0.85},{"$f":"Lançamento!Y54","v":0.85},{"$f":"Lançamento!AF54","v":0.02},{"$f":"Lançamento!AM54","v":0.5}]
["OUT",{"$f":"Lançamento!D17","v":60},{"$f":"Lançamento!K17","v":7309759},79,{"$f":"Lançamento!Y17","v":0.03},{"$f":"Lançamento!AF17","v":500},{"$f":"Lançamento!D36","v":0.52322419799999997},{"$f":"Lançamento!K36","v":0.656812854},{"$f":"Lançamento!R36","v":0.74},{"$f":"Lançamento!Y36","v":0},{"$f":"Lançamento!AF36","v":5.8000000000000003E-2},{"$f":"Lançamento!AM36","v":2.3E-2},{"$f":"Lançamento!AT36","v":2.5000000000000001E-2},{"$f":"Lançamento!BA36","v":0.03},{"$f":"Lançamento!AM17","v":2},{"$f":"Lançamento!AT17","v":5.0000000000000001E-3},{"$f":"Lançamento!BA17","v":1},{"$f":"Lançamento!D55","v":0.95},{"$f":"Lançamento!K55","v":""},{"$f":"Lançamento!R55","v":0.85},{"$f":"Lançamento!Y55","v":0.85},{"$f":"Lançamento!AF55","v":0.02},{"$f":"Lançamento!AM55","v":0.5}]
["NOV",{"$f":"Lançamento!D18","v":60},{"$f":"Lançamento!K18","v":7411696},80,{"$f":"Lançamento!Y18","v":0.03},{"$f":"Lançamento!AF18","v":500},{"$f":"Lançamento!D37","v":0},{"$f":"Lançamento!K37","v":0},{"$f":"Lançamento!R37","v":0.76},{"$f":"Lançamento!Y37","v":0},{"$f":"Lançamento!AF37","v":5.8000000000000003E-2},{"$f":"Lançamento!AM37","v":2.3E-2},{"$f":"Lançamento!AT37","v":2.3E-2},{"$f":"Lançamento!BA37","v":0.03},{"$f":"Lançamento!AM18","v":2},{"$f":"Lançamento!AT18","v":5.0000000000000001E-3},{"$f":"Lançamento!BA18","v":1},{"$f":"Lançamento!D56","v":0.95},{"$f":"Lançamento!K56","v":""},{"$f":"Lançamento!R56","v":0.85},{"$f":"Lançamento!Y56","v":0.85},{"$f":"Lançamento!AF56","v":0.02},{"$f":"Lançamento!AM56","v":0.5}]
["DEZ",{"$f":"Lançamento!D19","v":60},{"$f":"Lançamento!K19","v":3884849},81,{"$f":"Lançamento!Y19","v":0.03},{"$f":"Lançamento!AF19","v":500},{"$f":"Lançamento!D38","v":0},{"$f":"Lançamento!K38","v":0},{"$f":"Lançamento!R38","v":0.77},{"$f":"Lançamento!Y38","v":0},{"$f":"Lançamento!AF38","v":5.8000000000000003E-2},{"$f":"Lançamento!AM38","v":2.3E-2},{"$f":"Lançamento!AT38","v":2.3E-2},{"$f":"Lançamento!BA38","v":0.03},{"$f":"Lançamento!AM19","v":2},{"$f":"Lançamento!AT19","v":5.0000000000000001E-3},{"$f":"Lançamento!BA19","v":1},{"$f":"Lançamento!D57","v":0.95},{"$f":"Lançamento!K57","v":""},{"$f":"Lançamento!R57","v":0.85},{"$f":"Lançamento!Y57","v":0.85},{"$f":"Lançamento!AF57","v":0.02},{"$f":"Lançamento!AM57","v":0.5}]

{"sheet":"Dados","index":5,"n_rows":52,"n_cols":14,"rows_kept":52,"cut":false,"hidden":true,"merged":[]}
[null,"Indicador ","JAN","FEV","MAR","ABR","MAI","JUN","JUL","AGO","SET","OUT","NOV","DEZ"]
["META ","Meta ",{"$f":"IF('[3]Base Dados'!F$363=\"\",\"\",'[3]Base Dados'!F$363)","v":60},{"$f":"IF('[3]Base Dados'!G$363=\"\",\"\",'[3]Base Dados'!G$363)","v":60},{"$f":"IF('[3]Base Dados'!H$363=\"\",\"\",'[3]Base Dados'!H$363)","v":60},{"$f":"IF('[3]Base Dados'!I$363=\"\",\"\",'[3]Base Dados'!I$363)","v":60},{"$f":"IF('[3]Base Dados'!J$363=\"\",\"\",'[3]Base Dados'!J$363)","v":60},{"$f":"IF('[3]Base Dados'!K$363=\"\",\"\",'[3]Base Dados'!K$363)","v":60},{"$f":"IF('[3]Base Dados'!L$363=\"\",\"\",'[3]Base Dados'!L$363)","v":60},{"$f":"IF('[3]Base Dados'!M$363=\"\",\"\",'[3]Base Dados'!M$363)","v":60},{"$f":"IF('[3]Base Dados'!N$363=\"\",\"\",'[3]Base Dados'!N$363)","v":60},{"$f":"IF('[3]Base Dados'!O$363=\"\",\"\",'[3]Base Dados'!O$363)","v":60},{"$f":"IF('[3]Base Dados'!P$363=\"\",\"\",'[3]Base Dados'!P$363)","v":60},{"$f":"IF('[3]Base Dados'!Q$363=\"\",\"\",'[3]Base Dados'!Q$363)","v":60}]
["SATISFAÇÃO DE CLIENTE NPS","Satisfação de cliente NPS",{"$f":"IF('[3]Base Dados'!F$362=\"\",\"\",'[3]Base Dados'!F$362)","v":23},{"$f":"IF('[3]Base Dados'!G$362=\"\",\"\",'[3]Base Dados'!G$362)","v":23},{"$f":"IF('[3]Base Dados'!H$362=\"\",\"\",'[3]Base Dados'!H$362)","v":23},{"$f":"IF('[3]Base Dados'!I$362=\"\",\"\",'[3]Base Dados'!I$362)","v":23},{"$f":"IF('[3]Base Dados'!J$362=\"\",\"\",'[3]Base Dados'!J$362)","v":23},{"$f":"IF('[3]Base Dados'!K$362=\"\",\"\",'[3]Base Dados'!K$362)","v":23},{"$f":"IF('[3]Base Dados'!L$362=\"\",\"\",'[3]Base Dados'!L$362)","v":57},{"$f":"IF('[3]Base Dados'!M$362=\"\",\"\",'[3]Base Dados'!M$362)","v":57},{"$f":"IF('[3]Base Dados'!N$362=\"\",\"\",'[3]Base Dados'!N$362)","v":57},{"$f":"IF('[3]Base Dados'!O$362=\"\",\"\",'[3]Base Dados'!O$362)","v":""},{"$f":"IF('[3]Base Dados'!P$362=\"\",\"\",'[3]Base Dados'!P$362)","v":""},{"$f":"IF('[3]Base Dados'!Q$362=\"\",\"\",'[3]Base Dados'!Q$362)","v":""}]
["META ","Meta ",{"$f":"IF('[3]Base Dados'!F$371=\"\",\"\",'[3]Base Dados'!F$371)","v":5969034},{"$f":"IF('[3]Base Dados'!G$371=\"\",\"\",'[3]Base Dados'!G$371)","v":7134119},{"$f":"IF('[3]Base Dados'!H$371=\"\",\"\",'[3]Base Dados'!H$371)","v":7102330},{"$f":"IF('[3]Base Dados'!I$371=\"\",\"\",'[3]Base Dados'!I$371)","v":6681373},{"$f":"IF('[3]Base Dados'!J$371=\"\",\"\",'[3]Base Dados'!J$371)","v":6417033},{"$f":"IF('[3]Base Dados'!K$371=\"\",\"\",'[3]Base Dados'!K$371)","v":6420195},{"$f":"IF('[3]Base Dados'!L$371=\"\",\"\",'[3]Base Dados'!L$371)","v":7124833},{"$f":"IF('[3]Base Dados'!M$371=\"\",\"\",'[3]Base Dados'!M$371)","v":7183658},{"$f":"IF('[3]Base Dados'!N$371=\"\",\"\",'[3]Base Dados'!N$371)","v":7387825},{"$f":"IF('[3]Base Dados'!O$371=\"\",\"\",'[3]Base Dados'!O$371)","v":7309759},{"$f":"IF('[3]Base Dados'!P$371=\"\",\"\",'[3]Base Dados'!P$371)","v":7411696},{"$f":"IF('[3]Base Dados'!Q$371=\"\",\"\",'[3]Base Dados'!Q$371)","v":3884849}]
["FATURAMENTO MENSAL ","Faturamento mensal ",{"$f":"IF('[3]Base Dados'!F$369=\"\",\"\",'[3]Base Dados'!F$369)","v":5920749},{"$f":"IF('[3]Base Dados'!G$369=\"\",\"\",'[3]Base Dados'!G$369)","v":6728756},{"$f":"IF('[3]Base Dados'!H$369=\"\",\"\",'[3]Base Dados'!H$369)","v":6056838},{"$f":"IF('[3]Base Dados'!I$369=\"\",\"\",'[3]Base Dados'!I$369)","v":7056727},{"$f":"IF('[3]Base Dados'!J$369=\"\",\"\",'[3]Base Dados'!J$369)","v":6779006.2599999998},{"$f":"IF('[3]Base Dados'!K$369=\"\",\"\",'[3]Base Dados'!K$369)","v":6700902},{"$f":"IF('[3]Base Dados'!L$369=\"\",\"\",'[3]Base Dados'!L$369)","v":7395049},{"$f":"IF('[3]Base Dados'!M$369=\"\",\"\",'[3]Base Dados'!M$369)","v":7010077},{"$f":"IF('[3]Base Dados'!N$369=\"\",\"\",'[3]Base Dados'!N$369)","v":7565275},{"$f":"IF('[3]Base Dados'!O$369=\"\",\"\",'[3]Base Dados'!O$369)","v":""},{"$f":"IF('[3]Base Dados'!P$369=\"\",\"\",'[3]Base Dados'!P$369)","v":""},{"$f":"IF('[3]Base Dados'!Q$369=\"\",\"\",'[3]Base Dados'!Q$369)","v":""}]
["META ","Meta ",{"$f":"IF('[3]Base Dados'!E$118=\"\",\"\",'[3]Base Dados'!E$118)","v":0.9},{"$f":"IF('[3]Base Dados'!F$118=\"\",\"\",'[3]Base Dados'!F$118)","v":0.7},{"$f":"IF('[3]Base Dados'!G$118=\"\",\"\",'[3]Base Dados'!G$118)","v":0.7},{"$f":"IF('[3]Base Dados'!H$118=\"\",\"\",'[3]Base Dados'!H$118)","v":0.7},{"$f":"IF('[3]Base Dados'!I$118=\"\",\"\",'[3]Base Dados'!I$118)","v":0.8},{"$f":"IF('[3]Base Dados'!J$118=\"\",\"\",'[3]Base Dados'!J$118)","v":0.8},{"$f":"IF('[3]Base Dados'!K$118=\"\",\"\",'[3]Base Dados'!K$118)","v":0.8},{"$f":"IF('[3]Base Dados'!L$118=\"\",\"\",'[3]Base Dados'!L$118)","v":0.82},{"$f":"IF('[3]Base Dados'!M$118=\"\",\"\",'[3]Base Dados'!M$118)","v":0.82},{"$f":"IF('[3]Base Dados'!N$118=\"\",\"\",'[3]Base Dados'!N$118)","v":0.82},{"$f":"IF('[3]Base Dados'!O$118=\"\",\"\",'[3]Base Dados'!O$118)","v":0.85},{"$f":"IF('[3]Base Dados'!P$118=\"\",\"\",'[3]Base Dados'!P$118)","v":0.85}]
["EFICIÊNCIA DE MÃO DE OBRA ","Eficiência de mão de obra ",{"$f":"IF('[3]Base Dados'!E$117=\"\",\"\",'[3]Base Dados'!E$117)","v":0.73905775116779049},{"$f":"IF('[3]Base Dados'!F$117=\"\",\"\",'[3]Base Dados'!F$117)","v":0.73464406827734263},{"$f":"IF('[3]Base Dados'!G$117=\"\",\"\",'[3]Base Dados'!G$117)","v":0.77387242928497535},{"$f":"IF('[3]Base Dados'!H$117=\"\",\"\",'[3]Base Dados'!H$117)","v":0.842204436142444},{"$f":"IF('[3]Base Dados'!I$117=\"\",\"\",'[3]Base Dados'!I$117)","v":0.86017741548789262},{"$f":"IF('[3]Base Dados'!J$117=\"\",\"\",'[3]Base Dados'!J$117)","v":0.9057103007107522},{"$f":"IF('[3]Base Dados'!K$117=\"\",\"\",'[3]Base Dados'!K$117)","v":0.90045835855746781},{"$f":"IF('[3]Base Dados'!L$117=\"\",\"\",'[3]Base Dados'!L$117)","v":0.85267267742129005},{"$f":"IF('[3]Base Dados'!M$117=\"\",\"\",'[3]Base Dados'!M$117)","v":0.76411261114431106},{"$f":"IF('[3]Base Dados'!N$117=\"\",\"\",'[3]Base Dados'!N$117)","v":0.91938260624690249},{"$f":"IF('[3]Base Dados'!O$117=\"\",\"\",'[3]Base Dados'!O$117)","v":""},{"$f":"IF('[3]Base Dados'!P$117=\"\",\"\",'[3]Base Dados'!P$117)","v":""}]
["META ","Meta ",{"$f":"IF('[3]Base Dados'!F$66=\"\",\"\",'[3]Base Dados'!F$66)","v":0.05},{"$f":"IF('[3]Base Dados'!G$66=\"\",\"\",'[3]Base Dados'!G$66)","v":0.05},{"$f":"IF('[3]Base Dados'!H$66=\"\",\"\",'[3]Base Dados'!H$66)","v":0.05},{"$f":"IF('[3]Base Dados'!I$66=\"\",\"\",'[3]Base Dados'!I$66)","v":4.4999999999999998E-2},{"$f":"IF('[3]Base Dados'!J$66=\"\",\"\",'[3]Base Dados'!J$66)","v":0.04},{"$f":"IF('[3]Base Dados'!K$66=\"\",\"\",'[3]Base Dados'!K$66)","v":0.04},{"$f":"IF('[3]Base Dados'!L$66=\"\",\"\",'[3]Base Dados'!L$66)","v":3.5000000000000003E-2},{"$f":"IF('[3]Base Dados'!M$66=\"\",\"\",'[3]Base Dados'!M$66)","v":3.5000000000000003E-2},{"$f":"IF('[3]Base Dados'!N$66=\"\",\"\",'[3]Base Dados'!N$66)","v":3.5000000000000003E-2},{"$f":"IF('[3]Base Dados'!O$66=\"\",\"\",'[3]Base Dados'!O$66)","v":0.03},{"$f":"IF('[3]Base Dados'!P$66=\"\",\"\",'[3]Base Dados'!P$66)","v":0.03},{"$f":"IF('[3]Base Dados'!Q$66=\"\",\"\",'[3]Base Dados'!Q$66)","v":0.03}]
["REJEIÇÃO INTERNA ","Rejeição Interna ",{"$f":"IF('[3]Base Dados'!F$63=\"\",\"\",'[3]Base Dados'!F$65)","v":3.3250000000000002E-2},{"$f":"IF('[3]Base Dados'!G$63=\"\",\"\",'[3]Base Dados'!G$65)","v":3.5499999999999997E-2},{"$f":"IF('[3]Base Dados'!H$63=\"\",\"\",'[3]Base Dados'!H$65)","v":2.5999999999999999E-2},{"$f":"IF('[3]Base Dados'!I$63=\"\",\"\",'[3]Base Dados'!I$65)","v":2.75E-2},{"$f":"IF('[3]Base Dados'!J$63=\"\",\"\",'[3]Base Dados'!J$65)","v":3.4500000000000003E-2},{"$f":"IF('[3]Base Dados'!K$63=\"\",\"\",'[3]Base Dados'!K$65)","v":3.8000000000000006E-2},{"$f":"IF('[3]Base Dados'!L$63=\"\",\"\",'[3]Base Dados'!L$65)","v":7.8000000000000014E-2},{"$f":"IF('[3]Base Dados'!M$63=\"\",\"\",'[3]Base Dados'!M$65)","v":6.0750000000000005E-2},{"$f":"IF('[3]Base Dados'!N$63=\"\",\"\",'[3]Base Dados'!N$65)","v":5.2500000000000005E-2},{"$f":"IF('[3]Base Dados'!O$63=\"\",\"\",'[3]Base Dados'!O$65)","v":""},{"$f":"IF('[3]Base Dados'!P$63=\"\",\"\",'[3]Base Dados'!P$65)","v":""},{"$f":"IF('[3]Base Dados'!Q$63=\"\",\"\",'[3]Base Dados'!Q$65)","v":""}]
["META ","Meta ",{"$f":"IF('[3]Base Dados'!F$47=\"\",\"\",'[3]Base Dados'!F$47)","v":600},{"$f":"IF('[3]Base Dados'!G$47=\"\",\"\",'[3]Base Dados'!G$47)","v":600},{"$f":"IF('[3]Base Dados'!H$47=\"\",\"\",'[3]Base Dados'!H$47)","v":600},{"$f":"IF('[3]Base Dados'!I$47=\"\",\"\",'[3]Base Dados'!I$47)","v":500},{"$f":"IF('[3]Base Dados'!J$47=\"\",\"\",'[3]Base Dados'!J$47)","v":500},{"$f":"IF('[3]Base Dados'!K$47=\"\",\"\",'[3]Base Dados'!K$47)","v":500},{"$f":"IF('[3]Base Dados'!L$47=\"\",\"\",'[3]Base Dados'!L$47)","v":500},{"$f":"IF('[3]Base Dados'!M$47=\"\",\"\",'[3]Base Dados'!M$47)","v":500},{"$f":"IF('[3]Base Dados'!N$47=\"\",\"\",'[3]Base Dados'!N$47)","v":500},{"$f":"IF('[3]Base Dados'!O$47=\"\",\"\",'[3]Base Dados'!O$47)","v":500},{"$f":"IF('[3]Base Dados'!P$47=\"\",\"\",'[3]Base Dados'!P$47)","v":500},{"$f":"IF('[3]Base Dados'!Q$47=\"\",\"\",'[3]Base Dados'!Q$47)","v":500}]
["HORAS DE RETRABALHO ","Horas de Retrabalho ",{"$f":"IF('[3]Base Dados'!F$46=\"\",\"\",'[3]Base Dados'!F$46)","v":521},{"$f":"IF('[3]Base Dados'!G$46=\"\",\"\",'[3]Base Dados'!G$46)","v":1006.21},{"$f":"IF('[3]Base Dados'!H$46=\"\",\"\",'[3]Base Dados'!H$46)","v":789.62},{"$f":"IF('[3]Base Dados'!I$46=\"\",\"\",'[3]Base Dados'!I$46)","v":148.72},{"$f":"IF('[3]Base Dados'!J$46=\"\",\"\",'[3]Base Dados'!J$46)","v":519.55999999999995},{"$f":"IF('[3]Base Dados'!K$46=\"\",\"\",'[3]Base Dados'!K$46)","v":1192},{"$f":"IF('[3]Base Dados'!L$46=\"\",\"\",'[3]Base Dados'!L$46)","v":1445},{"$f":"IF('[3]Base Dados'!M$46=\"\",\"\",'[3]Base Dados'!M$46)","v":623},{"$f":"IF('[3]Base Dados'!N$46=\"\",\"\",'[3]Base Dados'!N$46)","v":691},{"$f":"IF('[3]Base Dados'!O$46=\"\",\"\",'[3]Base Dados'!O$46)","v":""},{"$f":"IF('[3]Base Dados'!P$46=\"\",\"\",'[3]Base Dados'!P$46)","v":""},{"$f":"IF('[3]Base Dados'!Q$46=\"\",\"\",'[3]Base Dados'!Q$46)","v":""}]
["INDICADOR DE PROCESSO","Indicador de Processo"]
["OEE","OEE"]
["META ","Meta ",{"$f":"IF('[3]Base Dados'!E$94=\"\",\"\",'[3]Base Dados'!E$94)","v":0.61408757999999997},{"$f":"IF('[3]Base Dados'!F$94=\"\",\"\",'[3]Base Dados'!F$94)","v":0.53724278999999997},{"$f":"IF('[3]Base Dados'!G$94=\"\",\"\",'[3]Base Dados'!G$94)","v":0.5980691159999999},{"$f":"IF('[3]Base Dados'!H$94=\"\",\"\",'[3]Base Dados'!H$94)","v":0.62634455999999994},{"$f":"IF('[3]Base Dados'!I$94=\"\",\"\",'[3]Base Dados'!I$94)","v":0.67903628399999993},{"$f":"IF('[3]Base Dados'!J$94=\"\",\"\",'[3]Base Dados'!J$94)","v":0.64089164799999998},{"$f":"IF('[3]Base Dados'!K$94=\"\",\"\",'[3]Base Dados'!K$94)","v":0.68204417399999995},{"$f":"IF('[3]Base Dados'!L$94=\"\",\"\",'[3]Base Dados'!L$94)","v":0.59633582400000007},{"$f":"IF('[3]Base Dados'!M$94=\"\",\"\",'[3]Base Dados'!M$94)","v":0.504817764},{"$f":"IF('[3]Base Dados'!N$94=\"\",\"\",'[3]Base Dados'!N$94)","v":0.52322419799999997},{"$f":"IF('[3]Base Dados'!O$94=\"\",\"\",'[3]Base Dados'!O$94)","v":0},{"$f":"IF('[3]Base Dados'!P$94=\"\",\"\",'[3]Base Dados'!P$94)","v":0}]
["OEE SOPRO","Sopro",{"$f":"IF('[3]Base Dados'!E$90=\"\",\"\",'[3]Base Dados'!E$93)","v":0.92900000000000005},{"$f":"IF('[3]Base Dados'!F$90=\"\",\"\",'[3]Base Dados'!F$93)","v":0.91700000000000004},{"$f":"IF('[3]Base Dados'!G$90=\"\",\"\",'[3]Base Dados'!G$93)","v":0.82199999999999995},{"$f":"IF('[3]Base Dados'!H$90=\"\",\"\",'[3]Base Dados'!H$93)","v":0.94},{"$f":"IF('[3]Base Dados'!I$90=\"\",\"\",'[3]Base Dados'!I$93)","v":0.94799999999999995},{"$f":"IF('[3]Base Dados'!J$90=\"\",\"\",'[3]Base Dados'!J$93)","v":0.998},{"$f":"IF('[3]Base Dados'!K$90=\"\",\"\",'[3]Base Dados'!K$93)","v":0.93700000000000006},{"$f":"IF('[3]Base Dados'!L$90=\"\",\"\",'[3]Base Dados'!L$93)","v":0.91200000000000003},{"$f":"IF('[3]Base Dados'!M$90=\"\",\"\",'[3]Base Dados'!M$93)","v":0.90600000000000003},{"$f":"IF('[3]Base Dados'!N$90=\"\",\"\",'[3]Base Dados'!N$93)","v":0.91800000000000004},{"$f":"IF('[3]Base Dados'!O$90=\"\",\"\",'[3]Base Dados'!O$93)","v":0},{"$f":"IF('[3]Base Dados'!P$90=\"\",\"\",'[3]Base Dados'!P$93)","v":0}]
["META ","Meta ",{"$f":"IF('[3]Base Dados'!E$100=\"\",\"\",'[3]Base Dados'!E$100)","v":0.64728224000000001},{"$f":"IF('[3]Base Dados'!F$100=\"\",\"\",'[3]Base Dados'!F$100)","v":0.60956783999999997},{"$f":"IF('[3]Base Dados'!G$100=\"\",\"\",'[3]Base Dados'!G$100)","v":0.59440920000000008},{"$f":"IF('[3]Base Dados'!H$100=\"\",\"\",'[3]Base Dados'!H$100)","v":0.69918681599999999},{"$f":"IF('[3]Base Dados'!I$100=\"\",\"\",'[3]Base Dados'!I$100)","v":0.69880859999999989},{"$f":"IF('[3]Base Dados'!J$100=\"\",\"\",'[3]Base Dados'!J$100)","v":0.72424460800000001},{"$f":"IF('[3]Base Dados'!K$100=\"\",\"\",'[3]Base Dados'!K$100)","v":0.78894165999999988},{"$f":"IF('[3]Base Dados'!L$100=\"\",\"\",'[3]Base Dados'!L$100)","v":0.67671864000000004},{"$f":"IF('[3]Base Dados'!M$100=\"\",\"\",'[3]Base Dados'!M$100)","v":0.68800735199999996},{"$f":"IF('[3]Base Dados'!N$100=\"\",\"\",'[3]Base Dados'!N$100)","v":0.656812854},{"$f":"IF('[3]Base Dados'!O$100=\"\",\"\",'[3]Base Dados'!O$100)","v":0},{"$f":"IF('[3]Base Dados'!P$100=\"\",\"\",'[3]Base Dados'!P$100)","v":0}]
["OEE INJEÇÃO","Injeção",{"$f":"IF('[3]Base Dados'!E$98=\"\",\"\",'[3]Base Dados'!E$99)","v":0.96799999999999997},{"$f":"IF('[3]Base Dados'!F$98=\"\",\"\",'[3]Base Dados'!F$99)","v":0.97799999999999998},{"$f":"IF('[3]Base Dados'!G$98=\"\",\"\",'[3]Base Dados'!G$99)","v":0.98},{"$f":"IF('[3]Base Dados'!H$98=\"\",\"\",'[3]Base Dados'!H$99)","v":0.97199999999999998},{"$f":"IF('[3]Base Dados'!I$98=\"\",\"\",'[3]Base Dados'!I$99)","v":0.97299999999999998},{"$f":"IF('[3]Base Dados'!J$98=\"\",\"\",'[3]Base Dados'!J$99)","v":0.998},{"$f":"IF('[3]Base Dados'!K$98=\"\",\"\",'[3]Base Dados'!K$99)","v":0.98499999999999999},{"$f":"IF('[3]Base Dados'!L$98=\"\",\"\",'[3]Base Dados'!L$99)","v":0.98499999999999999},{"$f":"IF('[3]Base Dados'!M$98=\"\",\"\",'[3]Base Dados'!M$99)","v":0.97799999999999998},{"$f":"IF('[3]Base Dados'!N$98=\"\",\"\",'[3]Base Dados'!N$99)","v":0.98099999999999998},{"$f":"IF('[3]Base Dados'!O$98=\"\",\"\",'[3]Base Dados'!O$99)","v":""},{"$f":"IF('[3]Base Dados'!P$98=\"\",\"\",'[3]Base Dados'!P$99)","v":""}]
["META ","Meta ",{"$f":"IF('[3]Base Dados'!E$88=\"\",\"\",'[3]Base Dados'!E$88)","v":0.69401103799999997},{"$f":"IF('[3]Base Dados'!F$88=\"\",\"\",'[3]Base Dados'!F$88)","v":0.71205220800000002},{"$f":"IF('[3]Base Dados'!G$88=\"\",\"\",'[3]Base Dados'!G$88)","v":0.68766053999999999},{"$f":"IF('[3]Base Dados'!H$88=\"\",\"\",'[3]Base Dados'!H$88)","v":0.7738216},{"$f":"IF('[3]Base Dados'!I$88=\"\",\"\",'[3]Base Dados'!I$88)","v":0.80777087999999997},{"$f":"IF('[3]Base Dados'!J$88=\"\",\"\",'[3]Base Dados'!J$88)","v":0.77045385600000005},{"$f":"IF('[3]Base Dados'!K$88=\"\",\"\",'[3]Base Dados'!K$88)","v":0.72912830400000006},{"$f":"IF('[3]Base Dados'!L$88=\"\",\"\",'[3]Base Dados'!L$88)","v":0.75150943999999997},{"$f":"IF('[3]Base Dados'!M$88=\"\",\"\",'[3]Base Dados'!M$88)","v":0.79561145999999994},{"$f":"IF('[3]Base Dados'!N$88=\"\",\"\",'[3]Base Dados'!N$88)","v":0.782752},{"$f":"IF('[3]Base Dados'!O$88=\"\",\"\",'[3]Base Dados'!O$88)","v":0},{"$f":"IF('[3]Base Dados'!P$88=\"\",\"\",'[3]Base Dados'!P$88)","v":0}]
["OEE PET","PET",{"$f":"IF('[3]Base Dados'!E$86=\"\",\"\",'[3]Base Dados'!E$87)","v":0.97399999999999998},{"$f":"IF('[3]Base Dados'!F$86=\"\",\"\",'[3]Base Dados'!F$87)","v":0.97199999999999998},{"$f":"IF('[3]Base Dados'!G$86=\"\",\"\",'[3]Base Dados'!G$87)","v":0.96899999999999997},{"$f":"IF('[3]Base Dados'!H$86=\"\",\"\",'[3]Base Dados'!H$87)","v":0.97599999999999998},{"$f":"IF('[3]Base Dados'!I$86=\"\",\"\",'[3]Base Dados'!I$87)","v":0.98},{"$f":"IF('[3]Base Dados'!J$86=\"\",\"\",'[3]Base Dados'!J$87)","v":0.98099999999999998},{"$f":"IF('[3]Base Dados'!K$86=\"\",\"\",'[3]Base Dados'!K$87)","v":0.97199999999999998},{"$f":"IF('[3]Base Dados'!L$86=\"\",\"\",'[3]Base Dados'!L$87)","v":0.97},{"$f":"IF('[3]Base Dados'!M$86=\"\",\"\",'[3]Base Dados'!M$87)","v":0.97},{"$f":"IF('[3]Base Dados'!N$86=\"\",\"\",'[3]Base Dados'!N$87)","v":0.97599999999999998},{"$f":"IF('[3]Base Dados'!O$86=\"\",\"\",'[3]Base Dados'!O$87)","v":""},{"$f":"IF('[3]Base Dados'!P$86=\"\",\"\",'[3]Base Dados'!P$87)","v":""}]
["META ","Meta ",{"$f":"IF('[3]Base Dados'!F$106=\"\",\"\",'[3]Base Dados'!F$106)","v":0.51563397},{"$f":"IF('[3]Base Dados'!G$106=\"\",\"\",'[3]Base Dados'!G$106)","v":0.53750619999999993},{"$f":"IF('[3]Base Dados'!H$106=\"\",\"\",'[3]Base Dados'!H$106)","v":0.50111033599999999},{"$f":"IF('[3]Base Dados'!I$106=\"\",\"\",'[3]Base Dados'!I$106)","v":0.65684214399999996},{"$f":"IF('[3]Base Dados'!J$106=\"\",\"\",'[3]Base Dados'!J$106)","v":0.69829199999999991},{"$f":"IF('[3]Base Dados'!K$106=\"\",\"\",'[3]Base Dados'!K$106)","v":0.76026923999999996},{"$f":"IF('[3]Base Dados'!L$106=\"\",\"\",'[3]Base Dados'!L$106)","v":0.68483887999999993},{"$f":"IF('[3]Base Dados'!M$106=\"\",\"\",'[3]Base Dados'!M$106)","v":0.735275232},{"$f":"IF('[3]Base Dados'!N$106=\"\",\"\",'[3]Base Dados'!N$106)","v":0.72784614399999992},{"$f":"IF('[3]Base Dados'!O$106=\"\",\"\",'[3]Base Dados'!O$106)","v":0},{"$f":"IF('[3]Base Dados'!P$106=\"\",\"\",'[3]Base Dados'!P$106)","v":0},{"$f":"IF('[3]Base Dados'!Q$106=\"\",\"\",'[3]Base Dados'!Q$106)","v":0}]
["OEE DECORAÇÃO","Decoração",{"$f":"IF('[3]Base Dados'!F$103=\"\",\"\",'[3]Base Dados'!F$105)","v":0.96899999999999997},{"$f":"IF('[3]Base Dados'!G$103=\"\",\"\",'[3]Base Dados'!G$105)","v":0.96799999999999997},{"$f":"IF('[3]Base Dados'!H$103=\"\",\"\",'[3]Base Dados'!H$105)","v":0.96399999999999997},{"$f":"IF('[3]Base Dados'!I$103=\"\",\"\",'[3]Base Dados'!I$105)","v":0.97599999999999998},{"$f":"IF('[3]Base Dados'!J$103=\"\",\"\",'[3]Base Dados'!J$105)","v":0.97799999999999998},{"$f":"IF('[3]Base Dados'!K$103=\"\",\"\",'[3]Base Dados'!K$105)","v":0.97199999999999998},{"$f":"IF('[3]Base Dados'!L$103=\"\",\"\",'[3]Base Dados'!L$105)","v":0.97399999999999998},{"$f":"IF('[3]Base Dados'!M$103=\"\",\"\",'[3]Base Dados'!M$105)","v":0.97199999999999998},{"$f":"IF('[3]Base Dados'!N$103=\"\",\"\",'[3]Base Dados'!N$105)","v":0.97599999999999998},{"$f":"IF('[3]Base Dados'!O$103=\"\",\"\",'[3]Base Dados'!O$105)","v":""},{"$f":"IF('[3]Base Dados'!P$103=\"\",\"\",'[3]Base Dados'!P$105)","v":""},{"$f":"IF('[3]Base Dados'!Q$103=\"\",\"\",'[3]Base Dados'!Q$105)","v":""}]
["REFUGO","Refugo"]
["META ","Meta ",{"$f":"IF('[3]Base Dados'!E$34=\"\",\"\",'[3]Base Dados'!E$34)","v":0.04},{"$f":"IF('[3]Base Dados'!F$34=\"\",\"\",'[3]Base Dados'!F$34)","v":7.4999999999999997E-2},{"$f":"IF('[3]Base Dados'!G$34=\"\",\"\",'[3]Base Dados'!G$34)","v":7.4999999999999997E-2},{"$f":"IF('[3]Base Dados'!H$34=\"\",\"\",'[3]Base Dados'!H$34)","v":6.5000000000000002E-2},{"$f":"IF('[3]Base Dados'!I$34=\"\",\"\",'[3]Base Dados'!I$34)","v":6.5000000000000002E-2},{"$f":"IF('[3]Base Dados'!J$34=\"\",\"\",'[3]Base Dados'!J$34)","v":6.5000000000000002E-2},{"$f":"IF('[3]Base Dados'!K$34=\"\",\"\",'[3]Base Dados'!K$34)","v":6.5000000000000002E-2},{"$f":"IF('[3]Base Dados'!L$34=\"\",\"\",'[3]Base Dados'!L$34)","v":6.2E-2},{"$f":"IF('[3]Base Dados'!M$34=\"\",\"\",'[3]Base Dados'!M$34)","v":0.06},{"$f":"IF('[3]Base Dados'!N$34=\"\",\"\",'[3]Base Dados'!N$34)","v":5.8000000000000003E-2},{"$f":"IF('[3]Base Dados'!O$34=\"\",\"\",'[3]Base Dados'!O$34)","v":5.8000000000000003E-2},{"$f":"IF('[3]Base Dados'!P$34=\"\",\"\",'[3]Base Dados'!P$34)","v":5.8000000000000003E-2}]
["REFUGO SOPRO","Sopro",{"$f":"IF('[3]Base Dados'!E$33=\"\",\"\",'[3]Base Dados'!E$33)","v":8.0528874531815106E-2},{"$f":"IF('[3]Base Dados'!F$33=\"\",\"\",'[3]Base Dados'!F$33)","v":8.3581188844346746E-2},{"$f":"IF('[3]Base Dados'!G$33=\"\",\"\",'[3]Base Dados'!G$33)","v":8.2171679862793418E-2},{"$f":"IF('[3]Base Dados'!H$33=\"\",\"\",'[3]Base Dados'!H$33)","v":6.0168624015808178E-2},{"$f":"IF('[3]Base Dados'!I$33=\"\",\"\",'[3]Base Dados'!I$33)","v":5.1939948570564214E-2},{"$f":"IF('[3]Base Dados'!J$33=\"\",\"\",'[3]Base Dados'!J$33)","v":7.2554415811858897E-2},{"$f":"IF('[3]Base Dados'!K$33=\"\",\"\",'[3]Base Dados'!K$33)","v":6.2702785723885032E-2},{"$f":"IF('[3]Base Dados'!L$33=\"\",\"\",'[3]Base Dados'!L$33)","v":8.7873310956192441E-2},{"$f":"IF('[3]Base Dados'!M$33=\"\",\"\",'[3]Base Dados'!M$33)","v":9.4170537096582116E-2},{"$f":"IF('[3]Base Dados'!N$33=\"\",\"\",'[3]Base Dados'!N$33)","v":8.1494599930321682E-2},{"$f":"IF('[3]Base Dados'!O$33=\"\",\"\",'[3]Base Dados'!O$33)","v":""},{"$f":"IF('[3]Base Dados'!P$33=\"\",\"\",'[3]Base Dados'!P$33)","v":""}]
["META ","Meta ",{"$f":"IF('[3]Base Dados'!E$39=\"\",\"\",'[3]Base Dados'!E$39)","v":2.5000000000000001E-2},{"$f":"IF('[3]Base Dados'!F$39=\"\",\"\",'[3]Base Dados'!F$39)","v":0.03},{"$f":"IF('[3]Base Dados'!G$39=\"\",\"\",'[3]Base Dados'!G$39)","v":0.03},{"$f":"IF('[3]Base Dados'!H$39=\"\",\"\",'[3]Base Dados'!H$39)","v":0.03},{"$f":"IF('[3]Base Dados'!I$39=\"\",\"\",'[3]Base Dados'!I$39)","v":0.03},{"$f":"IF('[3]Base Dados'!J$39=\"\",\"\",'[3]Base Dados'!J$39)","v":0.03},{"$f":"IF('[3]Base Dados'!K$39=\"\",\"\",'[3]Base Dados'!K$39)","v":2.3E-2},{"$f":"IF('[3]Base Dados'!L$39=\"\",\"\",'[3]Base Dados'!L$39)","v":2.3E-2},{"$f":"IF('[3]Base Dados'!M$39=\"\",\"\",'[3]Base Dados'!M$39)","v":2.3E-2},{"$f":"IF('[3]Base Dados'!N$39=\"\",\"\",'[3]Base Dados'!N$39)","v":2.3E-2},{"$f":"IF('[3]Base Dados'!O$39=\"\",\"\",'[3]Base Dados'!O$39)","v":2.3E-2},{"$f":"IF('[3]Base Dados'!P$39=\"\",\"\",'[3]Base Dados'!P$39)","v":2.3E-2}]
["REFUGO REFUGO INJEÇÃO","Injeção",{"$f":"IF('[3]Base Dados'!E$38=\"\",\"\",'[3]Base Dados'!E$38)","v":3.4632778233532849E-2},{"$f":"IF('[3]Base Dados'!F$38=\"\",\"\",'[3]Base Dados'!F$38)","v":2.1240827824348576E-2},{"$f":"IF('[3]Base Dados'!G$38=\"\",\"\",'[3]Base Dados'!G$38)","v":2.6040004432887648E-2},{"$f":"IF('[3]Base Dados'!H$38=\"\",\"\",'[3]Base Dados'!H$38)","v":2.8207264055136527E-2},{"$f":"IF('[3]Base Dados'!I$38=\"\",\"\",'[3]Base Dados'!I$38)","v":2.6498512115629872E-2},{"$f":"IF('[3]Base Dados'!J$38=\"\",\"\",'[3]Base Dados'!J$38)","v":2.6755852842809364E-2},{"$f":"IF('[3]Base Dados'!K$38=\"\",\"\",'[3]Base Dados'!K$38)","v":1.5301672877190201E-2},{"$f":"IF('[3]Base Dados'!L$38=\"\",\"\",'[3]Base Dados'!L$38)","v":1.4810562571756601E-2},{"$f":"IF('[3]Base Dados'!M$38=\"\",\"\",'[3]Base Dados'!M$38)","v":2.1757290400972053E-2},{"$f":"IF('[3]Base Dados'!N$38=\"\",\"\",'[3]Base Dados'!N$38)","v":1.8830803822372118E-2},{"$f":"IF('[3]Base Dados'!O$38=\"\",\"\",'[3]Base Dados'!O$38)","v":""},{"$f":"IF('[3]Base Dados'!P$38=\"\",\"\",'[3]Base Dados'!P$38)","v":""}]
["META ","Meta ",{"$f":"IF('[3]Base Dados'!E$29=\"\",\"\",'[3]Base Dados'!E$29)","v":0.01},{"$f":"IF('[3]Base Dados'!F$29=\"\",\"\",'[3]Base Dados'!F$29)","v":0.03},{"$f":"IF('[3]Base Dados'!G$29=\"\",\"\",'[3]Base Dados'!G$29)","v":0.03},{"$f":"IF('[3]Base Dados'!H$29=\"\",\"\",'[3]Base Dados'!H$29)","v":0.03},{"$f":"IF('[3]Base Dados'!I$29=\"\",\"\",'[3]Base Dados'!I$29)","v":0.03},{"$f":"IF('[3]Base Dados'!J$29=\"\",\"\",'[3]Base Dados'!J$29)","v":0.03},{"$f":"IF('[3]Base Dados'!K$29=\"\",\"\",'[3]Base Dados'!K$29)","v":2.7E-2},{"$f":"IF('[3]Base Dados'!L$29=\"\",\"\",'[3]Base Dados'!L$29)","v":2.7E-2},{"$f":"IF('[3]Base Dados'!M$29=\"\",\"\",'[3]Base Dados'!M$29)","v":2.5000000000000001E-2},{"$f":"IF('[3]Base Dados'!N$29=\"\",\"\",'[3]Base Dados'!N$29)","v":2.5000000000000001E-2},{"$f":"IF('[3]Base Dados'!O$29=\"\",\"\",'[3]Base Dados'!O$29)","v":2.3E-2},{"$f":"IF('[3]Base Dados'!P$29=\"\",\"\",'[3]Base Dados'!P$29)","v":2.3E-2}]
["REFUGO PET","PET",{"$f":"IF('[3]Base Dados'!E$28=\"\",\"\",'[3]Base Dados'!E$28)","v":2.4886857044871362E-2},{"$f":"IF('[3]Base Dados'!F$28=\"\",\"\",'[3]Base Dados'!F$28)","v":2.836950210480476E-2},{"$f":"IF('[3]Base Dados'!G$28=\"\",\"\",'[3]Base Dados'!G$28)","v":3.1814904128532134E-2},{"$f":"IF('[3]Base Dados'!H$28=\"\",\"\",'[3]Base Dados'!H$28)","v":2.4343215555389628E-2},{"$f":"IF('[3]Base Dados'!I$28=\"\",\"\",'[3]Base Dados'!I$28)","v":2.0084836307388096E-2},{"$f":"IF('[3]Base Dados'!J$28=\"\",\"\",'[3]Base Dados'!J$28)","v":2.7676409399406569E-2},{"$f":"IF('[3]Base Dados'!K$28=\"\",\"\",'[3]Base Dados'!K$28)","v":2.8239956605005924E-2},{"$f":"IF('[3]Base Dados'!L$28=\"\",\"\",'[3]Base Dados'!L$28)","v":2.9577147998200631E-2},{"$f":"IF('[3]Base Dados'!M$28=\"\",\"\",'[3]Base Dados'!M$28)","v":3.0099036502451656E-2},{"$f":"IF('[3]Base Dados'!N$28=\"\",\"\",'[3]Base Dados'!N$28)","v":2.4209761728731339E-2},{"$f":"IF('[3]Base Dados'!O$28=\"\",\"\",'[3]Base Dados'!O$28)","v":""},{"$f":"IF('[3]Base Dados'!P$28=\"\",\"\",'[3]Base Dados'!P$28)","v":""}]
["META ","Meta ",{"$f":"IF('[3]Base Dados'!E$44=\"\",\"\",'[3]Base Dados'!E$44)","v":0.03},{"$f":"IF('[3]Base Dados'!F$44=\"\",\"\",'[3]Base Dados'!F$44)","v":0.03},{"$f":"IF('[3]Base Dados'!G$44=\"\",\"\",'[3]Base Dados'!G$44)","v":0.03},{"$f":"IF('[3]Base Dados'!H$44=\"\",\"\",'[3]Base Dados'!H$44)","v":0.03},{"$f":"IF('[3]Base Dados'!I$44=\"\",\"\",'[3]Base Dados'!I$44)","v":0.03},{"$f":"IF('[3]Base Dados'!J$44=\"\",\"\",'[3]Base Dados'!J$44)","v":0.03},{"$f":"IF('[3]Base Dados'!K$44=\"\",\"\",'[3]Base Dados'!K$44)","v":0.03},{"$f":"IF('[3]Base Dados'!L$44=\"\",\"\",'[3]Base Dados'!L$44)","v":0.03},{"$f":"IF('[3]Base Dados'!M$44=\"\",\"\",'[3]Base Dados'!M$44)","v":0.03},{"$f":"IF('[3]Base Dados'!N$44=\"\",\"\",'[3]Base Dados'!N$44)","v":0.03},{"$f":"IF('[3]Base Dados'!O$44=\"\",\"\",'[3]Base Dados'!O$44)","v":0.03},{"$f":"IF('[3]Base Dados'!P$44=\"\",\"\",'[3]Base Dados'!P$44)","v":0.03}]
["REFUGO DECORAÇÃO","Decoração",{"$f":"'[3]Base Dados'!E$43","v":2.5657113794739093E-2},{"$f":"'[3]Base Dados'!F$43","v":3.0621555377583761E-2},{"$f":"'[3]Base Dados'!G$43","v":3.1807503045503116E-2},{"$f":"'[3]Base Dados'!H$43","v":3.5551562272665781E-2},{"$f":"'[3]Base Dados'!I$43","v":2.3760550948875969E-2},{"$f":"'[3]Base Dados'!J$43","v":2.2229866860002025E-2},{"$f":"'[3]Base Dados'!K$43","v":2.4570369538357856E-2},{"$f":"'[3]Base Dados'!L$43","v":2.5700911651276213E-2},{"$f":"'[3]Base Dados'!M$43","v":2.8320546253952656E-2},{"$f":"'[3]Base Dados'!N$43","v":2.4476822631326348E-2},{"$f":"'[3]Base Dados'!O$43","v":""},{"$f":"'[3]Base Dados'!P$43","v":""}]
["INDICADOR DO PCP","Indicador do PCP"]
["META ","Meta ",{"$f":"IF('[3]Base Dados'!F$199=\"\",\"\",'[3]Base Dados'!F$199)","v":0.5},{"$f":"IF('[3]Base Dados'!G$199=\"\",\"\",'[3]Base Dados'!G$199)","v":0.6},{"$f":"IF('[3]Base Dados'!H$199=\"\",\"\",'[3]Base Dados'!H$199)","v":0.7},{"$f":"IF('[3]Base Dados'!I$199=\"\",\"\",'[3]Base Dados'!I$199)","v":0.8},{"$f":"IF('[3]Base Dados'!J$199=\"\",\"\",'[3]Base Dados'!J$199)","v":0.9},{"$f":"IF('[3]Base Dados'!K$199=\"\",\"\",'[3]Base Dados'!K$199)","v":0.91},{"$f":"IF('[3]Base Dados'!L$199=\"\",\"\",'[3]Base Dados'!L$199)","v":0.93},{"$f":"IF('[3]Base Dados'!M$199=\"\",\"\",'[3]Base Dados'!M$199)","v":0.95},{"$f":"IF('[3]Base Dados'!N$199=\"\",\"\",'[3]Base Dados'!N$199)","v":0.95},{"$f":"IF('[3]Base Dados'!O$199=\"\",\"\",'[3]Base Dados'!O$199)","v":0.95},{"$f":"IF('[3]Base Dados'!P$199=\"\",\"\",'[3]Base Dados'!P$199)","v":0.95},{"$f":"IF('[3]Base Dados'!Q$199=\"\",\"\",'[3]Base Dados'!Q$199)","v":0.95}]
["OTIF","OTIF",{"$f":"IF('[3]Base Dados'!F$198=\"\",\"\",'[3]Base Dados'!F$198)","v":0.36778115501519759},{"$f":"IF('[3]Base Dados'!G$198=\"\",\"\",'[3]Base Dados'!G$198)","v":0.42577030812324929},{"$f":"IF('[3]Base Dados'!H$198=\"\",\"\",'[3]Base Dados'!H$198)","v":0.78947368421052633},{"$f":"IF('[3]Base Dados'!I$198=\"\",\"\",'[3]Base Dados'!I$198)","v":0.80246913580246915},{"$f":"IF('[3]Base Dados'!J$198=\"\",\"\",'[3]Base Dados'!J$198)","v":0.79922779922779918},{"$f":"IF('[3]Base Dados'!K$198=\"\",\"\",'[3]Base Dados'!K$198)","v":0.94076655052264813},{"$f":"IF('[3]Base Dados'!L$198=\"\",\"\",'[3]Base Dados'!L$198)","v":0.93498452012383904},{"$f":"IF('[3]Base Dados'!M$198=\"\",\"\",'[3]Base Dados'!M$198)","v":0.97667638483965014},{"$f":"IF('[3]Base Dados'!N$198=\"\",\"\",'[3]Base Dados'!N$198)","v":0.95342465753424654},{"$f":"IF('[3]Base Dados'!O$198=\"\",\"\",'[3]Base Dados'!O$198)","v":""},{"$f":"IF('[3]Base Dados'!P$198=\"\",\"\",'[3]Base Dados'!P$198)","v":""},{"$f":"IF('[3]Base Dados'!Q$198=\"\",\"\",'[3]Base Dados'!Q$198)","v":""}]
["META ","Meta ",{"$f":"IF('[3]Base Dados'!F$240=\"\",\"\",'[3]Base Dados'!F$240)","v":0.5},{"$f":"IF('[3]Base Dados'!G$240=\"\",\"\",'[3]Base Dados'!G$240)","v":0.4},{"$f":"IF('[3]Base Dados'!H$240=\"\",\"\",'[3]Base Dados'!H$240)","v":0.3},{"$f":"IF('[3]Base Dados'!I$240=\"\",\"\",'[3]Base Dados'!I$240)","v":0.3},{"$f":"IF('[3]Base Dados'!J$240=\"\",\"\",'[3]Base Dados'!J$240)","v":0.3},{"$f":"IF('[3]Base Dados'!K$240=\"\",\"\",'[3]Base Dados'!K$240)","v":0.2},{"$f":"IF('[3]Base Dados'!L$240=\"\",\"\",'[3]Base Dados'!L$240)","v":0.2},{"$f":"IF('[3]Base Dados'!M$240=\"\",\"\",'[3]Base Dados'!M$240)","v":0.2},{"$f":"IF('[3]Base Dados'!N$240=\"\",\"\",'[3]Base Dados'!N$240)","v":0.2},{"$f":"IF('[3]Base Dados'!O$240=\"\",\"\",'[3]Base Dados'!O$240)","v":""},{"$f":"IF('[3]Base Dados'!P$240=\"\",\"\",'[3]Base Dados'!P$240)","v":""},{"$f":"IF('[3]Base Dados'!Q$240=\"\",\"\",'[3]Base Dados'!Q$240)","v":""}]
["TAXA DE REPROGRAMAÇÃO ","TAXA DE REPROGRAMAÇÃO ",{"$f":"IF('[3]Base Dados'!F$239=\"\",\"\",'[3]Base Dados'!F$239)","v":0.28299999999999997},{"$f":"IF('[3]Base Dados'!G$239=\"\",\"\",'[3]Base Dados'!G$239)","v":0.25700000000000001},{"$f":"IF('[3]Base Dados'!H$239=\"\",\"\",'[3]Base Dados'!H$239)","v":0.27100000000000002},{"$f":"IF('[3]Base Dados'!I$239=\"\",\"\",'[3]Base Dados'!I$239)","v":0.21099999999999999},{"$f":"IF('[3]Base Dados'!J$239=\"\",\"\",'[3]Base Dados'!J$239)","v":0.19},{"$f":"IF('[3]Base Dados'!K$239=\"\",\"\",'[3]Base Dados'!K$239)","v":7.0999999999999994E-2},{"$f":"IF('[3]Base Dados'!L$239=\"\",\"\",'[3]Base Dados'!L$239)","v":0.14899999999999999},{"$f":"IF('[3]Base Dados'!M$239=\"\",\"\",'[3]Base Dados'!M$239)","v":0.13200000000000001},{"$f":"IF('[3]Base Dados'!N$239=\"\",\"\",'[3]Base Dados'!N$239)","v":0.104},{"$f":"IF('[3]Base Dados'!O$239=\"\",\"\",'[3]Base Dados'!O$239)","v":""},{"$f":"IF('[3]Base Dados'!P$239=\"\",\"\",'[3]Base Dados'!P$239)","v":""},{"$f":"IF('[3]Base Dados'!Q$239=\"\",\"\",'[3]Base Dados'!Q$239)","v":""}]
["INDICADOR DA QUALIDADE","Indicador da Qualidade"]
["META ","Meta ",{"$f":"IF('[3]Base Dados'!G$76=\"\",\"\",'[3]Base Dados'!G$76)","v":3},{"$f":"IF('[3]Base Dados'!H$76=\"\",\"\",'[3]Base Dados'!H$76)","v":3},{"$f":"IF('[3]Base Dados'!I$76=\"\",\"\",'[3]Base Dados'!I$76)","v":3},{"$f":"IF('[3]Base Dados'!J$76=\"\",\"\",'[3]Base Dados'!J$76)","v":3},{"$f":"IF('[3]Base Dados'!K$76=\"\",\"\",'[3]Base Dados'!K$76)","v":2},{"$f":"IF('[3]Base Dados'!L$76=\"\",\"\",'[3]Base Dados'!L$76)","v":2},{"$f":"IF('[3]Base Dados'!M$76=\"\",\"\",'[3]Base Dados'!M$76)","v":2},{"$f":"IF('[3]Base Dados'!N$76=\"\",\"\",'[3]Base Dados'!N$76)","v":2},{"$f":"IF('[3]Base Dados'!O$76=\"\",\"\",'[3]Base Dados'!O$76)","v":2},{"$f":"IF('[3]Base Dados'!P$76=\"\",\"\",'[3]Base Dados'!P$76)","v":2},{"$f":"IF('[3]Base Dados'!Q$76=\"\",\"\",'[3]Base Dados'!Q$76)","v":2},{"$f":"IF('[3]Base Dados'!R$76=\"\",\"\",'[3]Base Dados'!R$76)","v":2}]
["RNC DE CLIENTE ","RNC de cliente ",{"$f":"IF('[3]Base Dados'!G$75=\"\",\"\",'[3]Base Dados'!G$75)","v":2},{"$f":"IF('[3]Base Dados'!H$75=\"\",\"\",'[3]Base Dados'!H$75)","v":2},{"$f":"IF('[3]Base Dados'!I$75=\"\",\"\",'[3]Base Dados'!I$75)","v":6},{"$f":"IF('[3]Base Dados'!J$75=\"\",\"\",'[3]Base Dados'!J$75)","v":3},{"$f":"IF('[3]Base Dados'!K$75=\"\",\"\",'[3]Base Dados'!K$75)","v":5},{"$f":"IF('[3]Base Dados'!L$75=\"\",\"\",'[3]Base Dados'!L$75)","v":9},{"$f":"IF('[3]Base Dados'!M$75=\"\",\"\",'[3]Base Dados'!M$75)","v":5},{"$f":"IF('[3]Base Dados'!N$75=\"\",\"\",'[3]Base Dados'!N$75)","v":2},{"$f":"IF('[3]Base Dados'!O$75=\"\",\"\",'[3]Base Dados'!O$75)","v":2},{"$f":"IF('[3]Base Dados'!P$75=\"\",\"\",'[3]Base Dados'!P$75)","v":""},{"$f":"IF('[3]Base Dados'!Q$75=\"\",\"\",'[3]Base Dados'!Q$75)","v":""},{"$f":"IF('[3]Base Dados'!R$75=\"\",\"\",'[3]Base Dados'!R$75)","v":2}]
["META ","Meta ",{"$f":"IF('[3]Base Dados'!F$55=\"\",\"\",'[3]Base Dados'!F$55)","v":1.4999999999999999E-2},{"$f":"IF('[3]Base Dados'!G$55=\"\",\"\",'[3]Base Dados'!G$55)","v":1.4999999999999999E-2},{"$f":"IF('[3]Base Dados'!H$55=\"\",\"\",'[3]Base Dados'!H$55)","v":1.4999999999999999E-2},{"$f":"IF('[3]Base Dados'!I$55=\"\",\"\",'[3]Base Dados'!I$55)","v":1.4999999999999999E-2},{"$f":"IF('[3]Base Dados'!J$55=\"\",\"\",'[3]Base Dados'!J$55)","v":5.0000000000000001E-3},{"$f":"IF('[3]Base Dados'!K$55=\"\",\"\",'[3]Base Dados'!K$55)","v":5.0000000000000001E-3},{"$f":"IF('[3]Base Dados'!L$55=\"\",\"\",'[3]Base Dados'!L$55)","v":5.0000000000000001E-3},{"$f":"IF('[3]Base Dados'!M$55=\"\",\"\",'[3]Base Dados'!M$55)","v":5.0000000000000001E-3},{"$f":"IF('[3]Base Dados'!N$55=\"\",\"\",'[3]Base Dados'!N$55)","v":5.0000000000000001E-3},{"$f":"IF('[3]Base Dados'!O$55=\"\",\"\",'[3]Base Dados'!O$55)","v":5.0000000000000001E-3},{"$f":"IF('[3]Base Dados'!P$55=\"\",\"\",'[3]Base Dados'!P$55)","v":5.0000000000000001E-3},{"$f":"IF('[3]Base Dados'!Q$55=\"\",\"\",'[3]Base Dados'!Q$55)","v":5.0000000000000001E-3}]
["CUSTO NÃO QUALIDADE","Custo não qualidade",{"$f":"IF('[3]Base Dados'!F$54=\"\",\"\",'[3]Base Dados'!F$54)","v":2.9999999999999997E-4},{"$f":"IF('[3]Base Dados'!G$54=\"\",\"\",'[3]Base Dados'!G$54)","v":3.8999999999999998E-3},{"$f":"IF('[3]Base Dados'!H$54=\"\",\"\",'[3]Base Dados'!H$54)","v":4.3E-3},{"$f":"IF('[3]Base Dados'!I$54=\"\",\"\",'[3]Base Dados'!I$54)","v":3.0999999999999999E-3},{"$f":"IF('[3]Base Dados'!J$54=\"\",\"\",'[3]Base Dados'!J$54)","v":4.4999999999999997E-3},{"$f":"IF('[3]Base Dados'!K$54=\"\",\"\",'[3]Base Dados'!K$54)","v":5.67E-2},{"$f":"IF('[3]Base Dados'!L$54=\"\",\"\",'[3]Base Dados'!L$54)","v":2.9100000000000001E-2},{"$f":"IF('[3]Base Dados'!M$54=\"\",\"\",'[3]Base Dados'!M$54)","v":1.1000000000000001E-3},{"$f":"IF('[3]Base Dados'!N$54=\"\",\"\",'[3]Base Dados'!N$54)","v":4.1000000000000003E-3},{"$f":"IF('[3]Base Dados'!O$54=\"\",\"\",'[3]Base Dados'!O$54)","v":""},{"$f":"IF('[3]Base Dados'!P$54=\"\",\"\",'[3]Base Dados'!P$54)","v":""},{"$f":"IF('[3]Base Dados'!Q$54=\"\",\"\",'[3]Base Dados'!Q$54)","v":""}]
["META ","Meta ",{"$f":"IF('[3]Base Dados'!F$59=\"\",\"\",'[3]Base Dados'!F$59)","v":1},{"$f":"IF('[3]Base Dados'!G$59=\"\",\"\",'[3]Base Dados'!G$59)","v":1},{"$f":"IF('[3]Base Dados'!H$59=\"\",\"\",'[3]Base Dados'!H$59)","v":1},{"$f":"IF('[3]Base Dados'!I$59=\"\",\"\",'[3]Base Dados'!I$59)","v":1},{"$f":"IF('[3]Base Dados'!J$59=\"\",\"\",'[3]Base Dados'!J$59)","v":1},{"$f":"IF('[3]Base Dados'!K$59=\"\",\"\",'[3]Base Dados'!K$59)","v":1},{"$f":"IF('[3]Base Dados'!L$59=\"\",\"\",'[3]Base Dados'!L$59)","v":1},{"$f":"IF('[3]Base Dados'!M$59=\"\",\"\",'[3]Base Dados'!M$59)","v":"NA"},{"$f":"IF('[3]Base Dados'!N$59=\"\",\"\",'[3]Base Dados'!N$59)","v":"NA"},{"$f":"IF('[3]Base Dados'!O$59=\"\",\"\",'[3]Base Dados'!O$59)","v":"NA"},{"$f":"IF('[3]Base Dados'!P$59=\"\",\"\",'[3]Base Dados'!P$59)","v":"NA"},{"$f":"IF('[3]Base Dados'!Q$59=\"\",\"\",'[3]Base Dados'!Q$59)","v":"NA"}]
["CERTIFICAÇÃO ISO 9001","Certificação ISO 9001",{"$f":"IF('[3]Base Dados'!F$58=\"\",\"\",'[3]Base Dados'!F$58)","v":0.7},{"$f":"IF('[3]Base Dados'!G$58=\"\",\"\",'[3]Base Dados'!G$58)","v":0.8},{"$f":"IF('[3]Base Dados'!H$58=\"\",\"\",'[3]Base Dados'!H$58)","v":0.9},{"$f":"IF('[3]Base Dados'!I$58=\"\",\"\",'[3]Base Dados'!I$58)","v":0.9},{"$f":"IF('[3]Base Dados'!J$58=\"\",\"\",'[3]Base Dados'!J$58)","v":0.95},{"$f":"IF('[3]Base Dados'!K$58=\"\",\"\",'[3]Base Dados'!K$58)","v":0.95},{"$f":"IF('[3]Base Dados'!L$58=\"\",\"\",'[3]Base Dados'!L$58)","v":1},{"$f":"IF('[3]Base Dados'!M$58=\"\",\"\",'[3]Base Dados'!M$58)","v":"NA"},{"$f":"IF('[3]Base Dados'!N$58=\"\",\"\",'[3]Base Dados'!N$58)","v":"NA"},{"$f":"IF('[3]Base Dados'!O$58=\"\",\"\",'[3]Base Dados'!O$58)","v":"NA"},{"$f":"IF('[3]Base Dados'!P$58=\"\",\"\",'[3]Base Dados'!P$58)","v":"NA"},{"$f":"IF('[3]Base Dados'!Q$58=\"\",\"\",'[3]Base Dados'!Q$58)","v":"NA"}]
["INDICADOR DE DESENVOLVIMENTO","Indicador de Desenvolvimento"]
["META ","Meta ",{"$f":"IF('[3]Base Dados'!F$345=\"\",\"\",'[3]Base Dados'!F$345)","v":0.85},{"$f":"IF('[3]Base Dados'!G$345=\"\",\"\",'[3]Base Dados'!G$345)","v":0.85},{"$f":"IF('[3]Base Dados'!H$345=\"\",\"\",'[3]Base Dados'!H$345)","v":0.85},{"$f":"IF('[3]Base Dados'!I$345=\"\",\"\",'[3]Base Dados'!I$345)","v":0.85},{"$f":"IF('[3]Base Dados'!J$345=\"\",\"\",'[3]Base Dados'!J$345)","v":0.85},{"$f":"IF('[3]Base Dados'!K$345=\"\",\"\",'[3]Base Dados'!K$345)","v":0.85},{"$f":"IF('[3]Base Dados'!L$345=\"\",\"\",'[3]Base Dados'!L$345)","v":0.85},{"$f":"IF('[3]Base Dados'!M$345=\"\",\"\",'[3]Base Dados'!M$345)","v":0.85},{"$f":"IF('[3]Base Dados'!N$345=\"\",\"\",'[3]Base Dados'!N$345)","v":0.85},{"$f":"IF('[3]Base Dados'!O$345=\"\",\"\",'[3]Base Dados'!O$345)","v":0.85},{"$f":"IF('[3]Base Dados'!P$345=\"\",\"\",'[3]Base Dados'!P$345)","v":0.85},{"$f":"IF('[3]Base Dados'!Q$345=\"\",\"\",'[3]Base Dados'!Q$345)","v":0.85}]
["PROJETOS ENCERRADOS X CRONOGRAMA ","Projetos encerrados x cronograma ",{"$f":"IF('[3]Base Dados'!F$344=\"\",\"\",'[3]Base Dados'!F$344)","v":0.81818181818181823},{"$f":"IF('[3]Base Dados'!G$344=\"\",\"\",'[3]Base Dados'!G$344)","v":0.9},{"$f":"IF('[3]Base Dados'!H$344=\"\",\"\",'[3]Base Dados'!H$344)","v":1},{"$f":"IF('[3]Base Dados'!I$344=\"\",\"\",'[3]Base Dados'!I$344)","v":1},{"$f":"IF('[3]Base Dados'!J$344=\"\",\"\",'[3]Base Dados'!J$344)","v":0.9},{"$f":"IF('[3]Base Dados'!K$344=\"\",\"\",'[3]Base Dados'!K$344)","v":1},{"$f":"IF('[3]Base Dados'!L$344=\"\",\"\",'[3]Base Dados'!L$344)","v":1},{"$f":"IF('[3]Base Dados'!M$344=\"\",\"\",'[3]Base Dados'!M$344)","v":1},{"$f":"IF('[3]Base Dados'!N$344=\"\",\"\",'[3]Base Dados'!N$344)","v":1},{"$f":"IF('[3]Base Dados'!O$344=\"\",\"\",'[3]Base Dados'!O$344)","v":""},{"$f":"IF('[3]Base Dados'!P$344=\"\",\"\",'[3]Base Dados'!P$344)","v":""},{"$f":"IF('[3]Base Dados'!Q$344=\"\",\"\",'[3]Base Dados'!Q$344)","v":""}]
["META ","Meta ",{"$f":"IF('[3]Base Dados'!F$355=\"\",\"\",'[3]Base Dados'!F$355)","v":0.85},{"$f":"IF('[3]Base Dados'!G$355=\"\",\"\",'[3]Base Dados'!G$355)","v":0.85},{"$f":"IF('[3]Base Dados'!H$355=\"\",\"\",'[3]Base Dados'!H$355)","v":0.85},{"$f":"IF('[3]Base Dados'!I$355=\"\",\"\",'[3]Base Dados'!I$355)","v":0.85},{"$f":"IF('[3]Base Dados'!J$355=\"\",\"\",'[3]Base Dados'!J$355)","v":0.85},{"$f":"IF('[3]Base Dados'!K$355=\"\",\"\",'[3]Base Dados'!K$355)","v":0.85},{"$f":"IF('[3]Base Dados'!L$355=\"\",\"\",'[3]Base Dados'!L$355)","v":0.85},{"$f":"IF('[3]Base Dados'!M$355=\"\",\"\",'[3]Base Dados'!M$355)","v":0.85},{"$f":"IF('[3]Base Dados'!N$355=\"\",\"\",'[3]Base Dados'!N$355)","v":0.85},{"$f":"IF('[3]Base Dados'!O$355=\"\",\"\",'[3]Base Dados'!O$355)","v":0.85},{"$f":"IF('[3]Base Dados'!P$355=\"\",\"\",'[3]Base Dados'!P$355)","v":0.85},{"$f":"IF('[3]Base Dados'!Q$355=\"\",\"\",'[3]Base Dados'!Q$355)","v":0.85}]
["EXECUÇÃO DE TESTES ","Execução de testes ",{"$f":"IF('[3]Base Dados'!F$354=\"\",\"\",'[3]Base Dados'!F$354)","v":0.94339622641509435},{"$f":"IF('[3]Base Dados'!G$354=\"\",\"\",'[3]Base Dados'!G$354)","v":0.61111111111111116},{"$f":"IF('[3]Base Dados'!H$354=\"\",\"\",'[3]Base Dados'!H$354)","v":0.36274509803921567},{"$f":"IF('[3]Base Dados'!I$354=\"\",\"\",'[3]Base Dados'!I$354)","v":0.42307692307692307},{"$f":"IF('[3]Base Dados'!J$354=\"\",\"\",'[3]Base Dados'!J$354)","v":0.83098591549295775},{"$f":"IF('[3]Base Dados'!K$354=\"\",\"\",'[3]Base Dados'!K$354)","v":0.89230769230769236},{"$f":"IF('[3]Base Dados'!L$354=\"\",\"\",'[3]Base Dados'!L$354)","v":0.87323943661971826},{"$f":"IF('[3]Base Dados'!M$354=\"\",\"\",'[3]Base Dados'!M$354)","v":0.80769230769230771},{"$f":"IF('[3]Base Dados'!N$354=\"\",\"\",'[3]Base Dados'!N$354)","v":0.9452054794520548},{"$f":"IF('[3]Base Dados'!O$354=\"\",\"\",'[3]Base Dados'!O$354)","v":""},{"$f":"IF('[3]Base Dados'!P$354=\"\",\"\",'[3]Base Dados'!P$354)","v":""},{"$f":"IF('[3]Base Dados'!Q$354=\"\",\"\",'[3]Base Dados'!Q$354)","v":""}]
["INDICADORES DE RH","Indicadores de RH"]
["META ","Meta ",{"$f":"IF('[3]Base Dados'!F$294=\"\",\"\",'[3]Base Dados'!F$294)","v":0.02},{"$f":"IF('[3]Base Dados'!G$294=\"\",\"\",'[3]Base Dados'!G$294)","v":0.02},{"$f":"IF('[3]Base Dados'!H$294=\"\",\"\",'[3]Base Dados'!H$294)","v":0.02},{"$f":"IF('[3]Base Dados'!I$294=\"\",\"\",'[3]Base Dados'!I$294)","v":0.02},{"$f":"IF('[3]Base Dados'!J$294=\"\",\"\",'[3]Base Dados'!J$294)","v":0.02},{"$f":"IF('[3]Base Dados'!K$294=\"\",\"\",'[3]Base Dados'!K$294)","v":0.02},{"$f":"IF('[3]Base Dados'!L$294=\"\",\"\",'[3]Base Dados'!L$294)","v":0.02},{"$f":"IF('[3]Base Dados'!M$294=\"\",\"\",'[3]Base Dados'!M$294)","v":0.02},{"$f":"IF('[3]Base Dados'!N$294=\"\",\"\",'[3]Base Dados'!N$294)","v":0.02},{"$f":"IF('[3]Base Dados'!O$294=\"\",\"\",'[3]Base Dados'!O$294)","v":0.02},{"$f":"IF('[3]Base Dados'!P$294=\"\",\"\",'[3]Base Dados'!P$294)","v":0.02},{"$f":"IF('[3]Base Dados'!Q$294=\"\",\"\",'[3]Base Dados'!Q$294)","v":0.02}]
["ABSENTEÍSMO ","Absenteísmo ",{"$f":"IF('[3]Base Dados'!F$293=\"\",\"\",'[3]Base Dados'!F$293)","v":5.5753968253968254E-3},{"$f":"IF('[3]Base Dados'!G$293=\"\",\"\",'[3]Base Dados'!G$293)","v":8.8795289855072464E-3},{"$f":"IF('[3]Base Dados'!H$293=\"\",\"\",'[3]Base Dados'!H$293)","v":1.5478145528044466E-2},{"$f":"IF('[3]Base Dados'!I$293=\"\",\"\",'[3]Base Dados'!I$293)","v":2.4016525539470091E-2},{"$f":"IF('[3]Base Dados'!J$293=\"\",\"\",'[3]Base Dados'!J$293)","v":1.6262935729847494E-2},{"$f":"IF('[3]Base Dados'!K$293=\"\",\"\",'[3]Base Dados'!K$293)","v":1.696696157036218E-2},{"$f":"IF('[3]Base Dados'!L$293=\"\",\"\",'[3]Base Dados'!L$293)","v":2.7978767123287673E-2},{"$f":"IF('[3]Base Dados'!M$293=\"\",\"\",'[3]Base Dados'!M$293)","v":5.1682664853840925E-2},{"$f":"IF('[3]Base Dados'!N$293=\"\",\"\",'[3]Base Dados'!N$293)","v":3.7655078391274709E-2},{"$f":"IF('[3]Base Dados'!O$293=\"\",\"\",'[3]Base Dados'!O$293)","v":""},{"$f":"IF('[3]Base Dados'!P$293=\"\",\"\",'[3]Base Dados'!P$293)","v":""},{"$f":"IF('[3]Base Dados'!Q$293=\"\",\"\",'[3]Base Dados'!Q$293)","v":""}]
["META ","Meta ",{"$f":"IF('[3]Base Dados'!F$340=\"\",\"\",'[3]Base Dados'!F$340)","v":0.5},{"$f":"IF('[3]Base Dados'!G$340=\"\",\"\",'[3]Base Dados'!G$340)","v":0.5},{"$f":"IF('[3]Base Dados'!H$340=\"\",\"\",'[3]Base Dados'!H$340)","v":0.5},{"$f":"IF('[3]Base Dados'!I$340=\"\",\"\",'[3]Base Dados'!I$340)","v":0.5},{"$f":"IF('[3]Base Dados'!J$340=\"\",\"\",'[3]Base Dados'!J$340)","v":0.5},{"$f":"IF('[3]Base Dados'!K$340=\"\",\"\",'[3]Base Dados'!K$340)","v":0.5},{"$f":"IF('[3]Base Dados'!L$340=\"\",\"\",'[3]Base Dados'!L$340)","v":0.5},{"$f":"IF('[3]Base Dados'!M$340=\"\",\"\",'[3]Base Dados'!M$340)","v":0.5},{"$f":"IF('[3]Base Dados'!N$340=\"\",\"\",'[3]Base Dados'!N$340)","v":0.5},{"$f":"IF('[3]Base Dados'!O$340=\"\",\"\",'[3]Base Dados'!O$340)","v":0.5},{"$f":"IF('[3]Base Dados'!P$340=\"\",\"\",'[3]Base Dados'!P$340)","v":0.5},{"$f":"IF('[3]Base Dados'!Q$340=\"\",\"\",'[3]Base Dados'!Q$340)","v":0.5}]
["TREINAMENTO ","Treinamento ",{"$f":"IF('[3]Base Dados'!F$338=\"\",\"\",'[3]Base Dados'!F$339)","v":2.4230769230769229},{"$f":"IF('[3]Base Dados'!G$338=\"\",\"\",'[3]Base Dados'!G$339)","v":0.93625352112676052},{"$f":"IF('[3]Base Dados'!H$338=\"\",\"\",'[3]Base Dados'!H$339)","v":0.39208823529411763},{"$f":"IF('[3]Base Dados'!I$338=\"\",\"\",'[3]Base Dados'!I$339)","v":5.2552552552552556E-3},{"$f":"IF('[3]Base Dados'!J$338=\"\",\"\",'[3]Base Dados'!J$339)","v":0.38142011834319522},{"$f":"IF('[3]Base Dados'!K$338=\"\",\"\",'[3]Base Dados'!K$339)","v":0.26923076923076922},{"$f":"IF('[3]Base Dados'!L$338=\"\",\"\",'[3]Base Dados'!L$339)","v":0.36253776435045315},{"$f":"IF('[3]Base Dados'!M$338=\"\",\"\",'[3]Base Dados'!M$339)","v":0.24003067484662577},{"$f":"IF('[3]Base Dados'!N$338=\"\",\"\",'[3]Base Dados'!N$339)","v":0.57088414634146345},{"$f":"IF('[3]Base Dados'!O$338=\"\",\"\",'[3]Base Dados'!O$339)","v":""},{"$f":"IF('[3]Base Dados'!P$338=\"\",\"\",'[3]Base Dados'!P$339)","v":""},{"$f":"IF('[3]Base Dados'!Q$338=\"\",\"\",'[3]Base Dados'!Q$339)","v":""}]

{"sheet":"GRAF COMERCIAL ","index":6,"n_rows":5,"n_cols":13,"rows_kept":5,"cut":false,"hidden":false,"merged":[[1,0,2,0],[10,0,10,2],[11,0,11,2],[12,0,12,2],[4,0,4,2],[4,4,4,6],[6,0,6,2],[7,0,7,2],[8,0,8,2],[9,0,9,2]]}
["INDICADOR","JAN","FEV","MAR","ABR","MAI","JUN","JUL","AGO","SET","OUT","NOV","DEZ"]
["SATISFAÇÃO DE CLIENTE NPS",{"$f":"VLOOKUP(A2,#REF!,MATCH(B1,#REF!,0),FALSE)","v":{"$error":"#REF!"}},{"$f":"VLOOKUP(B2,#REF!,MATCH(C1,#REF!,0),FALSE)","v":{"$error":"#REF!"}},{"$f":"VLOOKUP(C2,#REF!,MATCH(D1,#REF!,0),FALSE)","v":{"$error":"#REF!"}},{"$f":"VLOOKUP(D2,#REF!,MATCH(E1,#REF!,0),FALSE)","v":{"$error":"#REF!"}},{"$f":"VLOOKUP(E2,#REF!,MATCH(F1,#REF!,0),FALSE)","v":{"$error":"#REF!"}},{"$f":"VLOOKUP(F2,#REF!,MATCH(G1,#REF!,0),FALSE)","v":{"$error":"#REF!"}},{"$f":"VLOOKUP(G2,#REF!,MATCH(H1,#REF!,0),FALSE)","v":{"$error":"#REF!"}},{"$f":"VLOOKUP(H2,#REF!,MATCH(I1,#REF!,0),FALSE)","v":{"$error":"#REF!"}},{"$f":"VLOOKUP(I2,#REF!,MATCH(J1,#REF!,0),FALSE)","v":{"$error":"#REF!"}},{"$f":"VLOOKUP(J2,#REF!,MATCH(K1,#REF!,0),FALSE)","v":{"$error":"#REF!"}},{"$f":"VLOOKUP(K2,#REF!,MATCH(L1,#REF!,0),FALSE)","v":{"$error":"#REF!"}},{"$f":"VLOOKUP(L2,#REF!,MATCH(M1,#REF!,0),FALSE)","v":{"$error":"#REF!"}}]
[null,{"$f":"VLOOKUP($A$2,Dados!$B$1:$N$432,MATCH(B1,Dados!$A1:$O1,0),FALSE)","v":23},{"$f":"VLOOKUP($A$2,Dados!$B$1:$N$432,MATCH(C1,Dados!$B1:$O1,0),FALSE)","v":23},{"$f":"VLOOKUP($A$2,Dados!$B$1:$N$432,MATCH(D1,Dados!$B1:$O1,0),FALSE)","v":23},{"$f":"VLOOKUP($A$2,Dados!$B$1:$N$432,MATCH(E1,Dados!$B1:$O1,0),FALSE)","v":23},{"$f":"VLOOKUP($A$2,Dados!$B$1:$N$432,MATCH(F1,Dados!$B1:$O1,0),FALSE)","v":23},{"$f":"VLOOKUP($A$2,Dados!$B$1:$N$432,MATCH(G1,Dados!$B1:$O1,0),FALSE)","v":23},{"$f":"VLOOKUP($A$2,Dados!$B$1:$N$432,MATCH(H1,Dados!$B1:$O1,0),FALSE)","v":57},{"$f":"VLOOKUP($A$2,Dados!$B$1:$N$432,MATCH(I1,Dados!$B1:$O1,0),FALSE)","v":57},{"$f":"VLOOKUP($A$2,Dados!$B$1:$N$432,MATCH(J1,Dados!$B1:$O1,0),FALSE)","v":57},{"$f":"VLOOKUP($A$2,Dados!$B$1:$N$432,MATCH(K1,Dados!$B1:$O1,0),FALSE)","v":""},{"$f":"VLOOKUP($A$2,Dados!$B$1:$N$432,MATCH(L1,Dados!$B1:$O1,0),FALSE)","v":""},{"$f":"VLOOKUP($A$2,Dados!$B$1:$N$432,MATCH(M1,Dados!$B1:$O1,0),FALSE)","v":""}]
[]
[{"$f":"IF(Painel!F10=\"\",\"\",IFERROR(HYPERLINK(fnLinkDinamico(Painel!F10)),Painel!F10))","v":"SATISFAÇÃO DE CLIENTE NPS"},null,null,null,{"$f":"IF(Painel!F11=\"\",\"\",IFERROR(HYPERLINK(fnLinkDinamico(Painel!F11)),Painel!F11))","v":"FATURAMENTO MENSAL "}]

{"sheet":"listas","index":7,"n_rows":14,"n_cols":7,"rows_kept":14,"cut":false,"hidden":true,"merged":[]}
[]
[null,"Ano",1,{"$f":"VLOOKUP(C2,A3:B12,2,TRUE)","v":2020},null,"Mês",9]
[1,2020,null,null,1,"JAN","Janeiro"]
[2,2021,null,null,2,"FEV","Fevereiro"]
[3,2022,null,null,3,"MAR","Março"]
[4,2023,null,null,4,"ABR","Abril"]
[5,2024,null,null,5,"MAI","Maio"]
[6,2025,null,null,6,"JUN","Junho"]
[7,2026,null,null,7,"JUL","Julho"]
[8,2027,null,null,8,"AGO","Agosto"]
[9,2028,null,null,9,"SET","Setembro"]
[10,2029,null,null,10,"OUT","Outubro"]
[null,null,null,null,11,"NOV","Novembro"]
[null,null,null,null,12,"DEZ","Dezembro"]