{"text_format":"1","workbook":"xlsx","n_sheets":8,"sheets":["Painel","Dashboard","Cálculos","Lançamento","Data","Dados","GRAF COMERCIAL ","listas"],"not_rendered":{"charts":2,"images":1,"macros":1,"external_links":3,"defined_names":31,"comments":0,"pivot_tables":0},"unopened":[],"bounds":{"document_bytes":16777216,"sheet_cells":100000,"rows_first":2000,"rows_last":500,"rows_between":2000,"halvings":0,"cell_chars":16384,"cell_head_chars":4096},"cells_cut":0,"cells_raw":0,"read":"whole","date_system":"1900"}

{"sheet":"Painel","index":0,"n_rows":31,"n_cols":25,"rows_kept":31,"cut":false,"hidden":true,"merged":[[3,4,3,13],[5,4,5,5],[5,7,5,9],[5,11,5,13],[25,4,26,4],[27,4,28,4],[29,4,30,4],[11,4,13,4],[9,4,10,4],[14,4,21,4],[22,4,24,4]]}
[]
[null,null,null,null,null,null,null,null,null,null,null,null,null,null,null,null,null,null,null,null,null,1,null,{"$f":"listas!G2","v":9}]
[null,null,null,null,null,null,null,null,null,null,null,null,null,null,null,null,null,null,null,null,null,"Ano",null,"Mês"]
[null,null,null,null,null,null,null,null,null,null,null,null,null,null,null,null,null,null,null,null,null,2020,1,"Janeiro","JAN"]
[null,null,null,null,null,null,null,null,null,null,null,null,null,null,null,null,null,null,null,null,null,2021,2,"Fevereiro","FEV"]
[null,null,null,null,"PAINEL DE CONTROLE DE INDICADORES ",null,null,{"$f":"UPPER(VLOOKUP(listas!G2,listas!E3:G14,3,TRUE)& \" \"&VLOOKUP(listas!C2,listas!A3:B12,2,TRUE))","v":"SETEMBRO 2020"},null,null,null,{"$f":"IF(listas!G2=1,H6,\"ACUMULADO \"&listas!D2&\" JAN / \"&VLOOKUP(listas!G2,listas!E3:G14,2,TRUE)&\" \"&listas!D2)","v":"ACUMULADO 2020 JAN / SET 2020"},null,null,null,null,null,null,null,null,null,2022,3,"Março","MAR"]
[null,null,null,null,null,null,null,null,null,null,null,null,null,null,null,null,null,null,null,null,null,2023,4,"Abril","ABR"]
[null,null,null,null,"Processo","Indicador",null,"Meta","Realizado","Status",null,"Meta","Realizado","Status",null,null,null,null,null,null,null,2024,5,"Maio","MAI"]
{"$rows_left_out":24}
{"sheet":"Dashboard","index":1,"n_rows":17,"n_cols":3,"rows_kept":17,"cut":false,"hidden":true,"merged":[]}
["Seleção de Indicador","EFICIÊNCIA DE MÃO DE OBRA ","Meta"]
["JAN",{"$f":"Cálculos!B2","v":0.73464406827734263},{"$f":"Cálculos!C2","v":70}]
["FEV",{"$f":"Cálculos!B3","v":0.77387242928497535},{"$f":"Cálculos!C3","v":71}]
["MAR",{"$f":"Cálculos!B4","v":0.842204436142444},{"$f":"Cálculos!C4","v":72}]
["ABR",{"$f":"Cálculos!B5","v":0.86017741548789262},{"$f":"Cálculos!C5","v":73}]
["MAI",{"$f":"Cálculos!B6","v":0.9057103007107522},{"$f":"Cálculos!C6","v":74}]
["JUN"]
["JUL"]
{"$rows_left_out":10}
{"sheet":"Cálculos","index":2,"n_rows":13,"n_cols":3,"rows_kept":13,"cut":false,"hidden":true,"merged":[]}
["Mês ",{"$f":"Dashboard!B1","v":"EFICIÊNCIA DE MÃO DE OBRA "},"Meta "]
["JAN",{"$f":"INDEX(Data!$A$2:$E$7,MATCH(Cálculos!A2,Data!$A$2:$A$7,0),MATCH(Cálculos!$B$1,Data!$A$2:$E$2,0))","v":0.73464406827734263},{"$f":"INDEX(Data!$A$16:$E$21,MATCH(Cálculos!A2,Data!$A$16:$A$21,0),MATCH(Cálculos!$B$1,Data!$A$16:$E$16,0))","v":70}]
["FEV",{"$f":"INDEX(Data!$A$2:$E$7,MATCH(Cálculos!A3,Data!$A$2:$A$7,0),MATCH(Cálculos!$B$1,Data!$A$2:$E$2,0))","v":0.77387242928497535},{"$f":"INDEX(Data!$A$16:$E$21,MATCH(Cálculos!A3,Data!$A$16:$A$21,0),MATCH(Cálculos!$B$1,Data!$A$16:$E$16,0))","v":71}]
["MAR",{"$f":"INDEX(Data!$A$2:$E$7,MATCH(Cálculos!A4,Data!$A$2:$A$7,0),MATCH(Cálculos!$B$1,Data!$A$2:$E$2,0))","v":0.842204436142444},{"$f":"INDEX(Data!$A$16:$E$21,MATCH(Cálculos!A4,Data!$A$16:$A$21,0),MATCH(Cálculos!$B$1,Data!$A$16:$E$16,0))","v":72}]
["ABR",{"$f":"INDEX(Data!$A$2:$E$7,MATCH(Cálculos!A5,Data!$A$2:$A$7,0),MATCH(Cálculos!$B$1,Data!$A$2:$E$2,0))","v":0.86017741548789262},{"$f":"INDEX(Data!$A$16:$E$21,MATCH(Cálculos!A5,Data!$A$16:$A$21,0),MATCH(Cálculos!$B$1,Data!$A$16:$E$16,0))","v":73}]
["MAI",{"$f":"INDEX(Data!$A$2:$E$7,MATCH(Cálculos!A6,Data!$A$2:$A$7,0),MATCH(Cálculos!$B$1,Data!$A$2:$E$2,0))","v":0.9057103007107522},{"$f":"INDEX(Data!$A$16:$E$21,MATCH(Cálculos!A6,Data!$A$16:$A$21,0),MATCH(Cálculos!$B$1,Data!$A$16:$E$16,0))","v":74}]
["JUN"]
["JUL"]
{"$rows_left_out":6}
{"sheet":"Lançamento","index":3,"n_rows":57,"n_cols":56,"rows_kept":57,"cut":false,"hidden":true,"merged":[[24,1,24,3],[24,8,24,10],[3,15,3,20],[4,15,4,20],[5,15,5,17],[4,8,4,13],[5,8,5,10],[23,1,23,6],[24,15,24,17],[1,1,1,13],[3,8,3,13],[20,1,20,55],[22,22,22,27],[3,1,3,6],[4,1,4,6],[5,1,5,3],[1,15,1,34],[22,1,22,6],[22,8,22,13],[22,15,22,20],[3,22,3,27],[4,22,4,27],[5,22,5,24],[3,29,3,34],[4,29,4,34],[5,29,5,31],[23,15,23,20],[23,22,23,27],[23,29,23,34],[23,8,23,13],[24,43,24,45],[24,50,24,52],[24,22,24,24],[24,29,24,31],[22,36,22,41],[22,43,22,48],[22,29,22,34],[5,36,5,38],[5,43,5,45],[5,50,5,52],[39,1,39,13],[1,36,1,55],[3,36,3,41],[3,43,3,48],[3,50,3,55],[4,36,4,41],[4,43,4,48],[4,50,4,55],[22,50,22,55],[23,36,23,41],[23,43,23,48],[23,50,23,55],[24,36,24,38],[43,1,43,3],[43,8,43,10],[41,36,41,41],[42,1,42,6],[42,8,42,13],[42,15,42,20],[42,22,42,27],[42,29,42,34],[42,36,42,41],[41,1,41,6],[41,8,41,13],[43,36,43,38],[39,29,39,41],[41,29,41,34],[43,29,43,31],[39,15,39,27],[41,15,41,20],[41,22,41,27],[43,15,43,17],[43,22,43,24]]}
[]
[null,"INDICADOR COMERCIAL ",null,null,null,null,null,null,null,null,null,null,null,null,null,"INDICADOR DA PRODUÇÃO",null,null,null,null,null,null,null,null,null,null,null,null,null,null,null,null,null,null,null,null,"INDICADOR DA QUALIDADE"]
[]
[null,"SATISFAÇÃO DE CLIENTE NPS",null,null,null,null,null,null,"FATURAMENTO MENSAL ",null,null,null,null,null,null,"EFICIÊNCIA DE MÃO DE OBRA ",null,null,null,null,null,null,"REJEIÇÃO INTERNA ",null,null,null,null,null,null,"HORAS DE RETRABALHO ",null,null,null,null,null,null,"RNC DE CLIENTE ",null,null,null,null,null,null,"CUSTO NÃO QUALIDADE",null,null,null,null,null,null,"CERTIFICAÇÃO ISO 9001"]
[]
[null,"Mês Selecionado",null,null,{"$f":"listas!G2","v":9},"Status Mês",{"$f":"VLOOKUP($E$6,$B$8:$G$19,6,FALSE)","v":0.95},null,"Mês Selecionado",null,null,{"$f":"E6","v":9},"Status Mês",{"$f":"VLOOKUP($E$6,$I$8:$N$19,6,FALSE)","v":1.0240192478841879},null,"Mês Selecionado",null,null,{"$f":"E6","v":9},"Status Mês",{"$f":"VLOOKUP($E$6,$P$8:$U$19,6,FALSE)","v":1.1211983003011006},null,"Mês Selecionado",null,null,{"$f":"L6","v":9},"Status Mês",{"$f":"VLOOKUP(Z6,W8:AB19,6,FALSE)","v":1.5},null,"Mês Selecionado",null,null,{"$f":"Z6","v":9},"Status Mês",{"$f":"VLOOKUP(AG6,AD8:AI19,6,FALSE)","v":1.3819999999999999},null,"Mês Selecionado",null,null,{"$f":"Z6","v":9},"Status Mês",{"$f":"VLOOKUP(AN6,AK8:AP19,6,FALSE)","v":1},null,"Mês Selecionado",null,null,{"$f":"E6","v":9},"Status Mês",{"$f":"VLOOKUP(AU6,AR8:AW19,6,FALSE)","v":0.82000000000000006},null,"Mês Selecionado",null,null,{"$f":"Z6","v":9},"Status Mês",{"$f":"VLOOKUP(BB6,AY8:BD19,6,FALSE)","v":1}]
[null,null,null,"Meta","Realizado","Média","Status",null,null,null,"Meta","Realizado","Média","Status",null,null,null,"Meta","Realizado","Média","Status",null,null,null,"Meta","Realizado","Média","Status",null,null,null,"Meta","Realizado","Média","Status",null,null,null,"Meta","Realizado","Média","Status",null,null,null,"Meta","Realizado","Média","Status",null,null,null,"Meta","Realizado","Média","Status"]
[null,1,"JAN",{"$f":"IF('[3]Base Dados'!F$363=\"\",\"\",'[3]Base Dados'!F$363)","v":60},{"$f":"IF('[3]Base Dados'!F$362=\"\",\"\",'[3]Base Dados'!F$362)","v":23},{"$f":"AVERAGE(E8:E19)","v":34.333333333333336},{"$f":"IF(E8=\"\",\"\",E8/D8)","v":0.38333333333333336},null,1,"JAN",{"$f":"IF('[3]Base Dados'!F$371=\"\",\"\",'[3]Base Dados'!F$371)","v":5969034},{"$f":"IF('[3]Base Dados'!F$369=\"\",\"\",'[3]Base Dados'!F$369)","v":5920749},{"$f":"AVERAGE(L8:L19)","v":6801486.5844444446},{"$f":"IF(L8=\"\",\"\",L8/K8)","v":0.99191075138791307},null,1,"JAN",0.9,0.73464406827734263,{"$f":"AVERAGE(S8:S19)","v":0.83924832258593085},{"$f":"IF(S8=\"\",\"\",S8/R8)","v":0.81627118697482515},null,1,"JAN",{"$f":"IF('[3]Base Dados'!F$66=\"\",\"\",'[3]Base Dados'!F$66)","v":0.05},{"$f":"IF('[3]Base Dados'!F$63=\"\",\"\",'[3]Base Dados'!F$65)","v":3.3250000000000002E-2},{"$f":"AVERAGE(Z8:Z19)","v":4.2888888888888893E-2},{"$f":"IF(Z8=\"\",\"\",Z8/Y8)","v":0.66500000000000004},null,1,"JAN",{"$f":"IF('[3]Base Dados'!F$47=\"\",\"\",'[3]Base Dados'!F$47)","v":600},{"$f":"IF('[3]Base Dados'!F$46=\"\",\"\",'[3]Base Dados'!F$46)","v":521},{"$f":"AVERAGE(AG8:AG19)","v":770.67888888888888},{"$f":"IF(AG8=\"\",\"\",AG8/AF8)","v":0.86833333333333329},null,1,"JAN",{"$f":"IF('[3]Base Dados'!G$76=\"\",\"\",'[3]Base Dados'!G$76)","v":3},{"$f":"IF('[3]Base Dados'!G$75=\"\",\"\",'[3]Base Dados'!G$75)","v":2},{"$f":"AVERAGE(AN8:AN19)","v":3.8},{"$f":"IF(AN8=\"\",\"\",AN8/AM8)","v":0.66666666666666663},null,1,"JAN",{"$f":"IF('[3]Base Dados'!F$55=\"\",\"\",'[3]Base Dados'!F$55)","v":1.4999999999999999E-2},{"$f":"IF('[3]Base Dados'!F$54=\"\",\"\",'[3]Base Dados'!F$54)","v":2.9999999999999997E-4},{"$f":"AVERAGE(AU8:AU19)","v":1.1900000000000001E-2},{"$f":"IF(AU8=\"\",\"\",AU8/AT8)","v":0.02},null,1,"JAN",1,0.7,{"$f":"AVERAGE(BB8:BB19)","v":0.93333333333333324},{"$f":"IF(BB8=\"\",\"\",BB8/BA8)","v":0.7}]
{"$rows_left_out":50}
{"sheet":"Data","index":4,"n_rows":28,"n_cols":23,"rows_kept":28,"cut":false,"hidden":true,"merged":[[0,0,0,4],[14,0,14,4]]}
["Realizado "]
["Mês ","SATISFAÇÃO DE CLIENTE NPS","FATURAMENTO MENSAL ","EFICIÊNCIA DE MÃO DE OBRA ","REJEIÇÃO INTERNA ","HORAS DE RETRABALHO ","OEE SOPRO","OEE INJEÇÃO","OEE PET","OEE DECORAÇÃO","REFUGO SOPRO","REFUGO INJEÇÃO","REFUGO PET","REFUGO DECORAÇÃO","RNC DE CLIENTE ","CUSTO NÃO QUALIDADE","CERTIFICAÇÃO ISO 9001","OTIF","TAXA DE REPROGRAMAÇÃO ","PROJETOS ENCERRADOS X CRONOGRAMA ","EXECUÇÃO DE TESTES ","ABSENTEÍSMO ","TREINAMENTO "]
["JAN",{"$f":"Lançamento!E8","v":23},{"$f":"Lançamento!L8","v":5920749},{"$f":"Lançamento!S8","v":0.73464406827734263},{"$f":"Lançamento!Z8","v":3.3250000000000002E-2},{"$f":"Lançamento!AG8","v":521},{"$f":"Lançamento!E27","v":0.92900000000000005},{"$f":"Lançamento!L27","v":0.96799999999999997},{"$f":"Lançamento!S27","v":0.69401103799999997},{"$f":"Lançamento!Z27","v":0.96899999999999997},{"$f":"Lançamento!AG27","v":8.0528874531815106E-2},{"$f":"Lançamento!AN27","v":3.4632778233532849E-2},{"$f":"Lançamento!AU27","v":2.4886857044871362E-2},{"$f":"Lançamento!BB27","v":2.5657113794739093E-2},{"$f":"Lançamento!AN8","v":2},{"$f":"Lançamento!AU8","v":2.9999999999999997E-4},{"$f":"Lançamento!BB8","v":0.7},{"$f":"Lançamento!E46","v":0.36778115501519759},{"$f":"Lançamento!L46","v":0.28299999999999997},{"$f":"Lançamento!S46","v":0.81818181818181823},{"$f":"Lançamento!Z46","v":0.94339622641509435},{"$f":"Lançamento!AG46","v":5.5753968253968254E-3},{"$f":"Lançamento!AN46","v":2.4230769230769229}]
["FEV",{"$f":"Lançamento!E9","v":23},{"$f":"Lançamento!L9","v":6728756},{"$f":"Lançamento!S9","v":0.77387242928497535},{"$f":"Lançamento!Z9","v":3.5499999999999997E-2},{"$f":"Lançamento!AG9","v":1006.21},{"$f":"Lançamento!E28","v":0.91700000000000004},{"$f":"Lançamento!L28","v":0.97799999999999998},{"$f":"Lançamento!S28","v":0.71205220800000002},{"$f":"Lançamento!Z28","v":0.96799999999999997},{"$f":"Lançamento!AG28","v":8.3581188844346746E-2},{"$f":"Lançamento!AN28","v":2.1240827824348576E-2},{"$f":"Lançamento!AU28","v":2.836950210480476E-2},{"$f":"Lançamento!BB28","v":3.0621555377583761E-2},{"$f":"Lançamento!AN9","v":2},{"$f":"Lançamento!AU9","v":3.8999999999999998E-3},{"$f":"Lançamento!BB9","v":0.8},{"$f":"Lançamento!E47","v":0.42577030812324929},{"$f":"Lançamento!L47","v":0.25700000000000001},{"$f":"Lançamento!S47","v":0.9},{"$f":"Lançamento!Z47","v":0.61111111111111116},{"$f":"Lançamento!AG47","v":8.8795289855072464E-3},{"$f":"Lançamento!AN47","v":0.93625352112676052}]
["MAR",{"$f":"Lançamento!E10","v":23},{"$f":"Lançamento!L10","v":6056838},{"$f":"Lançamento!S10","v":0.842204436142444},{"$f":"Lançamento!Z10","v":2.5999999999999999E-2},{"$f":"Lançamento!AG10","v":789.62},{"$f":"Lançamento!E29","v":0.82199999999999995},{"$f":"Lançamento!L29","v":0.98},{"$f":"Lançamento!S29","v":0.68766053999999999},{"$f":"Lançamento!Z29","v":0.96399999999999997},{"$f":"Lançamento!AG29","v":8.2171679862793418E-2},{"$f":"Lançamento!AN29","v":2.6040004432887648E-2},{"$f":"Lançamento!AU29","v":3.1814904128532134E-2},{"$f":"Lançamento!BB29","v":3.1807503045503116E-2},{"$f":"Lançamento!AN10","v":6},{"$f":"Lançamento!AU10","v":4.3E-3},{"$f":"Lançamento!BB10","v":0.9},{"$f":"Lançamento!E48","v":0.78947368421052633},{"$f":"Lançamento!L48","v":0.27100000000000002},{"$f":"Lançamento!S48","v":1},{"$f":"Lançamento!Z48","v":0.36274509803921567},{"$f":"Lançamento!AG48","v":1.5478145528044466E-2},{"$f":"Lançamento!AN48","v":0.39208823529411763}]
["ABR",{"$f":"Lançamento!E11","v":23},{"$f":"Lançamento!L11","v":7056727},{"$f":"Lançamento!S11","v":0.86017741548789262},{"$f":"Lançamento!Z11","v":2.75E-2},{"$f":"Lançamento!AG11","v":148.72},{"$f":"Lançamento!E30","v":0.94},{"$f":"Lançamento!L30","v":0.97199999999999998},{"$f":"Lançamento!S30","v":0.7738216},{"$f":"Lançamento!Z30","v":0.97599999999999998},{"$f":"Lançamento!AG30","v":6.0168624015808178E-2},{"$f":"Lançamento!AN30","v":2.8207264055136527E-2},{"$f":"Lançamento!AU30","v":2.4343215555389628E-2},{"$f":"Lançamento!BB30","v":3.5551562272665781E-2},{"$f":"Lançamento!AN11","v":3},{"$f":"Lançamento!AU11","v":3.0999999999999999E-3},{"$f":"Lançamento!BB11","v":0.9},{"$f":"Lançamento!E49","v":0.80246913580246915},{"$f":"Lançamento!L49","v":0.21099999999999999},{"$f":"Lançamento!S49","v":1},{"$f":"Lançamento!Z49","v":0.42307692307692307},{"$f":"Lançamento!AG49","v":2.4016525539470091E-2},{"$f":"Lançamento!AN49","v":5.2552552552552556E-3}]
["MAI",{"$f":"Lançamento!E12","v":23},{"$f":"Lançamento!L12","v":6779006.2599999998},{"$f":"Lançamento!S12","v":0.9057103007107522},{"$f":"Lançamento!Z12","v":3.4500000000000003E-2},{"$f":"Lançamento!AG12","v":519.55999999999995},{"$f":"Lançamento!E31","v":0.94799999999999995},{"$f":"Lançamento!L31","v":0.97299999999999998},{"$f":"Lançamento!S31","v":0.80777087999999997},{"$f":"Lançamento!Z31","v":0.97799999999999998},{"$f":"Lançamento!AG31","v":5.1939948570564214E-2},{"$f":"Lançamento!AN31","v":2.6498512115629872E-2},{"$f":"Lançamento!AU31","v":2.0084836307388096E-2},{"$f":"Lançamento!BB31","v":2.3760550948875969E-2},{"$f":"Lançamento!AN12","v":5},{"$f":"Lançamento!AU12","v":4.4999999999999997E-3},{"$f":"Lançamento!BB12","v":0.95},{"$f":"Lançamento!E50","v":0.79922779922779918},{"$f":"Lançamento!L50","v":0.19},{"$f":"Lançamento!S50","v":0.9},{"$f":"Lançamento!Z50","v":0.83098591549295775},{"$f":"Lançamento!AG50","v":1.6262935729847494E-2},{"$f":"Lançamento!AN50","v":0.38142011834319522}]
["JUN",{"$f":"Lançamento!E13","v":23},{"$f":"Lançamento!L13","v":6700902},{"$f":"Lançamento!S13","v":0.90045835855746781},{"$f":"Lançamento!Z13","v":3.8000000000000006E-2},{"$f":"Lançamento!AG13","v":1192},{"$f":"Lançamento!E32","v":0.998},{"$f":"Lançamento!L32","v":0.998},{"$f":"Lançamento!S32","v":0.77045385600000005},{"$f":"Lançamento!Z32","v":0.97199999999999998},{"$f":"Lançamento!AG32","v":7.2554415811858897E-2},{"$f":"Lançamento!AN32","v":2.6755852842809364E-2},{"$f":"Lançamento!AU32","v":2.7676409399406569E-2},{"$f":"Lançamento!BB32","v":2.2229866860002025E-2},{"$f":"Lançamento!AN13","v":9},{"$f":"Lançamento!AU13","v":5.67E-2},{"$f":"Lançamento!BB13","v":0.95},{"$f":"Lançamento!E51","v":0.94076655052264813},{"$f":"Lançamento!L51","v":7.0999999999999994E-2},{"$f":"Lançamento!S51","v":1},{"$f":"Lançamento!Z51","v":0.89230769230769236},{"$f":"Lançamento!AG51","v":1.696696157036218E-2},{"$f":"Lançamento!AN51","v":0.26923076923076922}]
{"$rows_left_out":21}
{"sheet":"Dados","index":5,"n_rows":52,"n_cols":14,"rows_kept":52,"cut":false,"hidden":true,"merged":[]}
[null,"Indicador ","JAN","FEV","MAR","ABR","MAI","JUN","JUL","AGO","SET","OUT","NOV","DEZ"]
["META ","Meta ",{"$f":"IF('[3]Base Dados'!F$363=\"\",\"\",'[3]Base Dados'!F$363)","v":60},{"$f":"IF('[3]Base Dados'!G$363=\"\",\"\",'[3]Base Dados'!G$363)","v":60},{"$f":"IF('[3]Base Dados'!H$363=\"\",\"\",'[3]Base Dados'!H$363)","v":60},{"$f":"IF('[3]Base Dados'!I$363=\"\",\"\",'[3]Base Dados'!I$363)","v":60},{"$f":"IF('[3]Base Dados'!J$363=\"\",\"\",'[3]Base Dados'!J$363)","v":60},{"$f":"IF('[3]Base Dados'!K$363=\"\",\"\",'[3]Base Dados'!K$363)","v":60},{"$f":"IF('[3]Base Dados'!L$363=\"\",\"\",'[3]Base Dados'!L$363)","v":60},{"$f":"IF('[3]Base Dados'!M$363=\"\",\"\",'[3]Base Dados'!M$363)","v":60},{"$f":"IF('[3]Base Dados'!N$363=\"\",\"\",'[3]Base Dados'!N$363)","v":60},{"$f":"IF('[3]Base Dados'!O$363=\"\",\"\",'[3]Base Dados'!O$363)","v":60},{"$f":"IF('[3]Base Dados'!P$363=\"\",\"\",'[3]Base Dados'!P$363)","v":60},{"$f":"IF('[3]Base Dados'!Q$363=\"\",\"\",'[3]Base Dados'!Q$363)","v":60}]
["SATISFAÇÃO DE CLIENTE NPS","Satisfação de cliente NPS",{"$f":"IF('[3]Base Dados'!F$362=\"\",\"\",'[3]Base Dados'!F$362)","v":23},{"$f":"IF('[3]Base Dados'!G$362=\"\",\"\",'[3]Base Dados'!G$362)","v":23},{"$f":"IF('[3]Base Dados'!H$362=\"\",\"\",'[3]Base Dados'!H$362)","v":23},{"$f":"IF('[3]Base Dados'!I$362=\"\",\"\",'[3]Base Dados'!I$362)","v":23},{"$f":"IF('[3]Base Dados'!J$362=\"\",\"\",'[3]Base Dados'!J$362)","v":23},{"$f":"IF('[3]Base Dados'!K$362=\"\",\"\",'[3]Base Dados'!K$362)","v":23},{"$f":"IF('[3]Base Dados'!L$362=\"\",\"\",'[3]Base Dados'!L$362)","v":57},{"$f":"IF('[3]Base Dados'!M$362=\"\",\"\",'[3]Base Dados'!M$362)","v":57},{"$f":"IF('[3]Base Dados'!N$362=\"\",\"\",'[3]Base Dados'!N$362)","v":57},{"$f":"IF('[3]Base Dados'!O$362=\"\",\"\",'[3]Base Dados'!O$362)","v":""},{"$f":"IF('[3]Base Dados'!P$362=\"\",\"\",'[3]Base Dados'!P$362)","v":""},{"$f":"IF('[3]Base Dados'!Q$362=\"\",\"\",'[3]Base Dados'!Q$362)","v":""}]
["META ","Meta ",{"$f":"IF('[3]Base Dados'!F$371=\"\",\"\",'[3]Base Dados'!F$371)","v":5969034},{"$f":"IF('[3]Base Dados'!G$371=\"\",\"\",'[3]Base Dados'!G$371)","v":7134119},{"$f":"IF('[3]Base Dados'!H$371=\"\",\"\",'[3]Base Dados'!H$371)","v":7102330},{"$f":"IF('[3]Base Dados'!I$371=\"\",\"\",'[3]Base Dados'!I$371)","v":6681373},{"$f":"IF('[3]Base Dados'!J$371=\"\",\"\",'[3]Base Dados'!J$371)","v":6417033},{"$f":"IF('[3]Base Dados'!K$371=\"\",\"\",'[3]Base Dados'!K$371)","v":6420195},{"$f":"IF('[3]Base Dados'!L$371=\"\",\"\",'[3]Base Dados'!L$371)","v":7124833},{"$f":"IF('[3]Base Dados'!M$371=\"\",\"\",'[3]Base Dados'!M$371)","v":7183658},{"$f":"IF('[3]Base Dados'!N$371=\"\",\"\",'[3]Base Dados'!N$371)","v":7387825},{"$f":"IF('[3]Base Dados'!O$371=\"\",\"\",'[3]Base Dados'!O$371)","v":7309759},{"$f":"IF('[3]Base Dados'!P$371=\"\",\"\",'[3]Base Dados'!P$371)","v":7411696},{"$f":"IF('[3]Base Dados'!Q$371=\"\",\"\",'[3]Base Dados'!Q$371)","v":3884849}]
["FATURAMENTO MENSAL ","Faturamento mensal ",{"$f":"IF('[3]Base Dados'!F$369=\"\",\"\",'[3]Base Dados'!F$369)","v":5920749},{"$f":"IF('[3]Base Dados'!G$369=\"\",\"\",'[3]Base Dados'!G$369)","v":6728756},{"$f":"IF('[3]Base Dados'!H$369=\"\",\"\",'[3]Base Dados'!H$369)","v":6056838},{"$f":"IF('[3]Base Dados'!I$369=\"\",\"\",'[3]Base Dados'!I$369)","v":7056727},{"$f":"IF('[3]Base Dados'!J$369=\"\",\"\",'[3]Base Dados'!J$369)","v":6779006.2599999998},{"$f":"IF('[3]Base Dados'!K$369=\"\",\"\",'[3]Base Dados'!K$369)","v":6700902},{"$f":"IF('[3]Base Dados'!L$369=\"\",\"\",'[3]Base Dados'!L$369)","v":7395049},{"$f":"IF('[3]Base Dados'!M$369=\"\",\"\",'[3]Base Dados'!M$369)","v":7010077},{"$f":"IF('[3]Base Dados'!N$369=\"\",\"\",'[3]Base Dados'!N$369)","v":7565275},{"$f":"IF('[3]Base Dados'!O$369=\"\",\"\",'[3]Base Dados'!O$369)","v":""},{"$f":"IF('[3]Base Dados'!P$369=\"\",\"\",'[3]Base Dados'!P$369)","v":""},{"$f":"IF('[3]Base Dados'!Q$369=\"\",\"\",'[3]Base Dados'!Q$369)","v":""}]
["META ","Meta ",{"$f":"IF('[3]Base Dados'!E$118=\"\",\"\",'[3]Base Dados'!E$118)","v":0.9},{"$f":"IF('[3]Base Dados'!F$118=\"\",\"\",'[3]Base Dados'!F$118)","v":0.7},{"$f":"IF('[3]Base Dados'!G$118=\"\",\"\",'[3]Base Dados'!G$118)","v":0.7},{"$f":"IF('[3]Base Dados'!H$118=\"\",\"\",'[3]Base Dados'!H$118)","v":0.7},{"$f":"IF('[3]Base Dados'!I$118=\"\",\"\",'[3]Base Dados'!I$118)","v":0.8},{"$f":"IF('[3]Base Dados'!J$118=\"\",\"\",'[3]Base Dados'!J$118)","v":0.8},{"$f":"IF('[3]Base Dados'!K$118=\"\",\"\",'[3]Base Dados'!K$118)","v":0.8},{"$f":"IF('[3]Base Dados'!L$118=\"\",\"\",'[3]Base Dados'!L$118)","v":0.82},{"$f":"IF('[3]Base Dados'!M$118=\"\",\"\",'[3]Base Dados'!M$118)","v":0.82},{"$f":"IF('[3]Base Dados'!N$118=\"\",\"\",'[3]Base Dados'!N$118)","v":0.82},{"$f":"IF('[3]Base Dados'!O$118=\"\",\"\",'[3]Base Dados'!O$118)","v":0.85},{"$f":"IF('[3]Base Dados'!P$118=\"\",\"\",'[3]Base Dados'!P$118)","v":0.85}]
["EFICIÊNCIA DE MÃO DE OBRA ","Eficiência de mão de obra ",{"$f":"IF('[3]Base Dados'!E$117=\"\",\"\",'[3]Base Dados'!E$117)","v":0.73905775116779049},{"$f":"IF('[3]Base Dados'!F$117=\"\",\"\",'[3]Base Dados'!F$117)","v":0.73464406827734263},{"$f":"IF('[3]Base Dados'!G$117=\"\",\"\",'[3]Base Dados'!G$117)","v":0.77387242928497535},{"$f":"IF('[3]Base Dados'!H$117=\"\",\"\",'[3]Base Dados'!H$117)","v":0.842204436142444},{"$f":"IF('[3]Base Dados'!I$117=\"\",\"\",'[3]Base Dados'!I$117)","v":0.86017741548789262},{"$f":"IF('[3]Base Dados'!J$117=\"\",\"\",'[3]Base Dados'!J$117)","v":0.9057103007107522},{"$f":"IF('[3]Base Dados'!K$117=\"\",\"\",'[3]Base Dados'!K$117)","v":0.90045835855746781},{"$f":"IF('[3]Base Dados'!L$117=\"\",\"\",'[3]Base Dados'!L$117)","v":0.85267267742129005},{"$f":"IF('[3]Base Dados'!M$117=\"\",\"\",'[3]Base Dados'!M$117)","v":0.76411261114431106},{"$f":"IF('[3]Base Dados'!N$117=\"\",\"\",'[3]Base Dados'!N$117)","v":0.91938260624690249},{"$f":"IF('[3]Base Dados'!O$117=\"\",\"\",'[3]Base Dados'!O$117)","v":""},{"$f":"IF('[3]Base Dados'!P$117=\"\",\"\",'[3]Base Dados'!P$117)","v":""}]
["META ","Meta ",{"$f":"IF('[3]Base Dados'!F$66=\"\",\"\",'[3]Base Dados'!F$66)","v":0.05},{"$f":"IF('[3]Base Dados'!G$66=\"\",\"\",'[3]Base Dados'!G$66)","v":0.05},{"$f":"IF('[3]Base Dados'!H$66=\"\",\"\",'[3]Base Dados'!H$66)","v":0.05},{"$f":"IF('[3]Base Dados'!I$66=\"\",\"\",'[3]Base Dados'!I$66)","v":4.4999999999999998E-2},{"$f":"IF('[3]Base Dados'!J$66=\"\",\"\",'[3]Base Dados'!J$66)","v":0.04},{"$f":"IF('[3]Base Dados'!K$66=\"\",\"\",'[3]Base Dados'!K$66)","v":0.04},{"$f":"IF('[3]Base Dados'!L$66=\"\",\"\",'[3]Base Dados'!L$66)","v":3.5000000000000003E-2},{"$f":"IF('[3]Base Dados'!M$66=\"\",\"\",'[3]Base Dados'!M$66)","v":3.5000000000000003E-2},{"$f":"IF('[3]Base Dados'!N$66=\"\",\"\",'[3]Base Dados'!N$66)","v":3.5000000000000003E-2},{"$f":"IF('[3]Base Dados'!O$66=\"\",\"\",'[3]Base Dados'!O$66)","v":0.03},{"$f":"IF('[3]Base Dados'!P$66=\"\",\"\",'[3]Base Dados'!P$66)","v":0.03},{"$f":"IF('[3]Base Dados'!Q$66=\"\",\"\",'[3]Base Dados'!Q$66)","v":0.03}]
{"$rows_left_out":45}
{"sheet":"GRAF COMERCIAL ","index":6,"n_rows":5,"n_cols":13,"rows_kept":5,"cut":false,"hidden":false,"merged":[[1,0,2,0],[10,0,10,2],[11,0,11,2],[12,0,12,2],[4,0,4,2],[4,4,4,6],[6,0,6,2],[7,0,7,2],[8,0,8,2],[9,0,9,2]]}
["INDICADOR","JAN","FEV","MAR","ABR","MAI","JUN","JUL","AGO","SET","OUT","NOV","DEZ"]
["SATISFAÇÃO DE CLIENTE NPS",{"$f":"VLOOKUP(A2,#REF!,MATCH(B1,#REF!,0),FALSE)","v":{"$error":"#REF!"}},{"$f":"VLOOKUP(B2,#REF!,MATCH(C1,#REF!,0),FALSE)","v":{"$error":"#REF!"}},{"$f":"VLOOKUP(C2,#REF!,MATCH(D1,#REF!,0),FALSE)","v":{"$error":"#REF!"}},{"$f":"VLOOKUP(D2,#REF!,MATCH(E1,#REF!,0),FALSE)","v":{"$error":"#REF!"}},{"$f":"VLOOKUP(E2,#REF!,MATCH(F1,#REF!,0),FALSE)","v":{"$error":"#REF!"}},{"$f":"VLOOKUP(F2,#REF!,MATCH(G1,#REF!,0),FALSE)","v":{"$error":"#REF!"}},{"$f":"VLOOKUP(G2,#REF!,MATCH(H1,#REF!,0),FALSE)","v":{"$error":"#REF!"}},{"$f":"VLOOKUP(H2,#REF!,MATCH(I1,#REF!,0),FALSE)","v":{"$error":"#REF!"}},{"$f":"VLOOKUP(I2,#REF!,MATCH(J1,#REF!,0),FALSE)","v":{"$error":"#REF!"}},{"$f":"VLOOKUP(J2,#REF!,MATCH(K1,#REF!,0),FALSE)","v":{"$error":"#REF!"}},{"$f":"VLOOKUP(K2,#REF!,MATCH(L1,#REF!,0),FALSE)","v":{"$error":"#REF!"}},{"$f":"VLOOKUP(L2,#REF!,MATCH(M1,#REF!,0),FALSE)","v":{"$error":"#REF!"}}]
[null,{"$f":"VLOOKUP($A$2,Dados!$B$1:$N$432,MATCH(B1,Dados!$A1:$O1,0),FALSE)","v":23},{"$f":"VLOOKUP($A$2,Dados!$B$1:$N$432,MATCH(C1,Dados!$B1:$O1,0),FALSE)","v":23},{"$f":"VLOOKUP($A$2,Dados!$B$1:$N$432,MATCH(D1,Dados!$B1:$O1,0),FALSE)","v":23},{"$f":"VLOOKUP($A$2,Dados!$B$1:$N$432,MATCH(E1,Dados!$B1:$O1,0),FALSE)","v":23},{"$f":"VLOOKUP($A$2,Dados!$B$1:$N$432,MATCH(F1,Dados!$B1:$O1,0),FALSE)","v":23},{"$f":"VLOOKUP($A$2,Dados!$B$1:$N$432,MATCH(G1,Dados!$B1:$O1,0),FALSE)","v":23},{"$f":"VLOOKUP($A$2,Dados!$B$1:$N$432,MATCH(H1,Dados!$B1:$O1,0),FALSE)","v":57},{"$f":"VLOOKUP($A$2,Dados!$B$1:$N$432,MATCH(I1,Dados!$B1:$O1,0),FALSE)","v":57},{"$f":"VLOOKUP($A$2,Dados!$B$1:$N$432,MATCH(J1,Dados!$B1:$O1,0),FALSE)","v":57},{"$f":"VLOOKUP($A$2,Dados!$B$1:$N$432,MATCH(K1,Dados!$B1:$O1,0),FALSE)","v":""},{"$f":"VLOOKUP($A$2,Dados!$B$1:$N$432,MATCH(L1,Dados!$B1:$O1,0),FALSE)","v":""},{"$f":"VLOOKUP($A$2,Dados!$B$1:$N$432,MATCH(M1,Dados!$B1:$O1,0),FALSE)","v":""}]
[]
[{"$f":"IF(Painel!F10=\"\",\"\",IFERROR(HYPERLINK(fnLinkDinamico(Painel!F10)),Painel!F10))","v":"SATISFAÇÃO DE CLIENTE NPS"},null,null,null,{"$f":"IF(Painel!F11=\"\",\"\",IFERROR(HYPERLINK(fnLinkDinamico(Painel!F11)),Painel!F11))","v":"FATURAMENTO MENSAL "}]

{"sheet":"listas","index":7,"n_rows":14,"n_cols":7,"rows_kept":14,"cut":false,"hidden":true,"merged":[]}
[]
[null,"Ano",1,{"$f":"VLOOKUP(C2,A3:B12,2,TRUE)","v":2020},null,"Mês",9]
[1,2020,null,null,1,"JAN","Janeiro"]
[2,2021,null,null,2,"FEV","Fevereiro"]
[3,2022,null,null,3,"MAR","Março"]
[4,2023,null,null,4,"ABR","Abril"]
[5,2024,null,null,5,"MAI","Maio"]
[6,2025,null,null,6,"JUN","Junho"]
{"$rows_left_out":6}