{"text_format":"1","workbook":"xlsx","n_sheets":5,"sheets":["Disparo de Emails","Cadastro Clientes","Cadastro Planilha","Tabela Infos","Vencimentos Impostos"],"not_rendered":{"charts":0,"images":0,"macros":1,"external_links":1,"defined_names":8,"comments":0,"pivot_tables":0},"unopened":[],"bounds":{"document_bytes":16777216,"sheet_cells":100000,"rows_first":2000,"rows_last":500,"rows_between":2000,"halvings":0,"cell_chars":16384,"cell_head_chars":4096},"cells_cut":0,"cells_raw":0,"read":"whole","date_system":"1900"}

{"sheet":"Disparo de Emails","index":0,"n_rows":26,"n_cols":12,"rows_kept":26,"cut":false,"hidden":false,"merged":[[20,5,20,8],[0,5,0,9],[11,0,11,1],[10,0,10,1],[3,4,4,4],[3,5,4,9],[9,5,9,8],[10,5,10,8],[13,5,13,8],[16,5,16,8],[18,5,18,8],[1,4,2,4],[1,5,2,9],[12,5,12,8],[15,5,15,8],[5,0,5,1]]}
["Status:",{"$f":"IF(B20=\"Fim\",\"Parar Macro\",\"\")","v":""},null,"","Empresa:",{"$f":"IF(OR(B20=0,B20=\"Fim\"),\"\",IF(B7<>\"\",VLOOKUP(B20,$A$7:$B$9,2,0),VLOOKUP(B20,'Cadastro Clientes'!$A$5:$B$104,2,0)))","v":"4L SERVIÇOS E MANUTENÇÕES LTDA"},null,null,null,null,null,"Mês/Ano:"]
["Envio para:",{"$f":"IF(OR(B20=\"Fim\",B20=0),\"\",IF(OR(AND('Tabela Infos'!K17=0,'Tabela Infos'!H31=\"\"),'Tabela Infos'!H31=\"Não há faturamento informado neste mês, portante não há geração de DAS.\"),\"ronaldo.marques@abaci.com.br\",VLOOKUP(F1,'Cadastro Clientes'!$B$5:$F$1048576,3,0)))","v":"ronaldo.marques@abaci.com.br"},null,"","Tipo E-mail:","Simples + CPRB",null,null,null,null,null,"2018-10-01"]
["Com cópia p/:",{"$f":"IF(OR(B20=\"Fim\",B20=0),\"\",IF(AND('Tabela Infos'!K17=0,'Tabela Infos'!H31=\"\"),\"\",VLOOKUP(F1,'Cadastro Clientes'!$B$5:$F$1048576,4,0)))","v":""},null,""]
["Assunto:",{"$f":"IF(OR(B20=\"Fim\",B20=0),\"\",IF(VLOOKUP(F2,'Cadastro Planilha'!$H$4:$K$7,3,0)=\"\",\"\",IF(AND('Tabela Infos'!K17=0,'Tabela Infos'!H31=\"\"),\"E-mail não enviado - \"&VLOOKUP(F2,'Cadastro Planilha'!$H$4:$K$7,3,0)&\" > \"&F1,VLOOKUP(F2,'Cadastro Planilha'!$H$4:$K$7,3,0))))","v":"E-mail não enviado - Fechamento de Impostos - Outubro/2018 > 4L SERVIÇOS E MANUTENÇÕES LTDA"},"","","Pasta Cliente:",{"$f":"IF(F1=\"\",\"\",VLOOKUP(F1,'Cadastro Clientes'!$B$5:$F$1048576,5,0)&\"\\\"&VLOOKUP(F2,'Cadastro Planilha'!$H$4:$I$8,2,0)&\"\\\"&YEAR(L2)&\"\\\"&IF(MONTH(L2)<10,\"0\"&MONTH(L2),MONTH(L2))&\".\"&YEAR(L2))","v":{"$error":"#N/A"}}]
[null,null,null,""]
["Disparo de E-mails Especificos",null,"","",null,null,null,null,null,null,""]
[1,"4L SERVIÇOS E MANUTENÇÕES LTDA","","",null,null,null,null,null,null,""]
[2,null,"","",null,{"$f":"IF(F1=\"\",\"\",VLOOKUP(F1,'Cadastro Clientes'!$B$5:$F$1048576,2,0))&IF(F1=\"\",\"Olá,\",\",\"&IF(HOUR(NOW())<=12,\" bom dia.\",IF(HOUR(NOW())<=19,\" boa tarde.\",\"boa noite.\")))","v":{"$error":"#N/A"}},null,null,null,null,""]
[3,null,"","",null,null,null,null,null,null,""]
[null,null,"","",null,{"$f":"IF(OR(B20=\"Fim\",B20=0),\"\",IF(AND(F2='Cadastro Planilha'!$H$5,'Tabela Infos'!H31<>\"\"),\"Informativo:\",\"Segue em anexo, referente ao mês de \"&VLOOKUP(MONTH(L2),'Cadastro Planilha'!$D$4:$F$15,2,0)&\"/\"&YEAR(L2)&\", os seguintes documentos:\"))","v":"Segue em anexo, referente ao mês de Outubro/2018, os seguintes documentos:"},null,null,null,null,""]
{"$rows_left_out":17}
{"sheet":"Cadastro Clientes","index":1,"n_rows":104,"n_cols":6,"rows_kept":104,"cut":false,"hidden":false,"merged":[]}
["Cadastro de Informações de Envio"]
[]
[]
["Nº","Nome de Clientes/Destinatário (Razão Social para Empresas)","Nome de Chamada","E-mail (destinatário)","E-mail (em cópia)","Pasta na Rede para Localização de Arquivos"]
[1,"EMPRESA 123","Rodrigo","rodrigo.luiz@davinciec.com.br","","Y:\\Lista de Destinatários\\EMPRESA 123"]
[2,"EMPRESA 124","André","andre@mixcon.com.br","","Y:\\Lista de Destinatários\\EMPRESA 124"]
[3,"EMPRESA 125","Adolfo","perdizes@helphome.srv.br","","Y:\\Lista de Destinatários\\EMPRESA 125"]
[4,"EMPRESA 126","Adevanir/Estevan","estevan.pavarin@helphome.srv.br","financeiro@helphome.srv.br","Y:\\Lista de Destinatários\\EMPRESA 126"]
[5,"EMPRESA 127","Edson","el_affonso@hotmail.com","","Y:\\Lista de Destinatários\\EMPRESA 127"]
[6,"EMPRESA 128","Vilmar","vilmar.costa81@gmail.com ","","Y:\\Lista de Destinatários\\EMPRESA 128"]
{"$rows_left_out":95}
{"sheet":"Cadastro Planilha","index":2,"n_rows":34,"n_cols":33,"rows_kept":34,"cut":false,"hidden":false,"merged":[[9,7,9,8]]}
["Cadastro Utilizado nas Planilhas",null,null,null,null,null,null,null,null,null,null,null,null,"Mais Anexos >>>>>"]
[]
[null,"Mês de Apuração",null,"Mês","Nome","Abreviado",null,"Tipos (opções) de Envio:","Pasta na Rede","Assunto E-mail","Chamada Caixa Secundária","Mensagem 1","Mensagem 2","Anexo 1:","Anexo 2:","Anexo 3:","Anexo 4:","Anexo 5:","Anexo 6:","Anexo 7:","Anexo 8:","Anexo 9:","Anexo 10:","Anexo 11:","Anexo 12:","Anexo 13:","Anexo 14:","Anexo 15:","Anexo 16:","Anexo 17:","Anexo 18:","Anexo 19:","Anexo 20:"]
[null,"2018-12-01",null,1,"Janeiro","Jan",null,"RH - Fechamento Mês","Folha de Pagto",{"$f":"\"Fechamento da Folha de Pagamento - \"&VLOOKUP(MONTH('Disparo de Emails'!$L$2),'Cadastro Planilha'!$D$4:$F$15,2,0)&\"/\"&YEAR('Disparo de Emails'!$L$2)","v":"Fechamento da Folha de Pagamento - Outubro/2018"},"Lembretes e Observações:",{"$f":"\"> Pagamentos Salariais devem ser feitos até no máximo o 5º dia útil (\"&DAY(VLOOKUP('Disparo de Emails'!$L$2,'Vencimentos Impostos'!$B$4:$H$15,7,0))&\"/\"&VLOOKUP(MONTH(VLOOKUP('Disparo de Emails'!$L$2,'Vencimentos Impostos'!$B$4:$H$15,7,0)),$D$4:$F$15,2,0)&\" - \"&VLOOKUP(WEEKDAY(VLOOKUP('Disparo de Emails'!$L$2,'Vencimentos Impostos'!$B$4:$H$15,7,0)),dia_semana,2,0)&\").\"","v":"> Pagamentos Salariais devem ser feitos até no máximo o 5º dia útil (8/Novembro - Quinta-feira)."}," > Evite fornecer VALE TRANSPORTE, VALE ALIMENTAÇÃO OU REFEIÇÃO em dinheiro ao seu colaborador, essa prática pode ser considerada salário \"in natura\" posteriormente.","Holerite","Guia INSS","Guia FGTS","Guia IRRF","Folha Ponto","Recibo de Vale Transporte","Recibo de Vale Alimentação","Resumo Folha de Pagamento","SEFIP","Recibo de Pagamento a Autônomo - RPA","Guia INSS Complementar","Guia FGTS Complementar","Empregada Doméstica","Guia INSS Tomadores","Guia FGTS Tomadores"]
[null,"2018-11-01",null,2,"Fevereiro","Fev",null,"Simples + CPRB","Cálculo de Impostos",{"$f":"\"Fechamento de Impostos - \"&VLOOKUP(MONTH('Disparo de Emails'!$L$2),'Cadastro Planilha'!$D$4:$F$15,2,0)&\"/\"&YEAR('Disparo de Emails'!$L$2)","v":"Fechamento de Impostos - Outubro/2018"},"Observação Importante:",{"$f":"IFERROR(VLOOKUP('Disparo de Emails'!L2&'Disparo de Emails'!F1,'[1]Banco de Dados'!$B17:$Q5016,16,0),\"\")","v":"Em Out/2018 a sua empresa ficou na 4ª faixa do Simples. Para Nov/2018 continuará na 4ª Faixa. E se este mês você faturar até R$ 750.490,74 permanecerá na 4ª Faixa em Dez/2018.\n\nPara emissão de notas fiscais a partir de 01/11/2018, por favor considerar:\nAnexo II = Efetiva 9,09%\nAnexo IV = Efetiva 10,28% - ISS 4,11%\nAnexo V = Efetiva 18,9% - ISS 3,97%"},{"$f":"\"Caso já tenham emitido notas fiscais neste mês (\"&VLOOKUP(IF(MONTH('Disparo de Emails'!L2)=12,1,MONTH('Disparo de Emails'!L2)+1),'Cadastro Planilha'!$D$4:$F$15,2,0)&\"/\"&IF(MONTH('Disparo de Emails'!L2)=12,YEAR('Disparo de Emails'!L2)+1,YEAR('Disparo de Emails'!L2))&\") não é necessário o cancelamento das mesmas.\"","v":"Caso já tenham emitido notas fiscais neste mês (Novembro/2018) não é necessário o cancelamento das mesmas."},"DAS do Simples Nacional","Contribuição Previdenciária sobre Receita Bruta - CPRB"]
[null,"2018-10-01",null,3,"Março","Mar",null,"RH - Adiantamento da Folha","Folha de Pagto",{"$f":"\"Adiantamento da Folha de Pagamento - \"&VLOOKUP(MONTH('Disparo de Emails'!$L$2),'Cadastro Planilha'!$D$4:$F$15,2,0)&\"/\"&YEAR('Disparo de Emails'!$L$2)","v":"Adiantamento da Folha de Pagamento - Outubro/2018"},"Lembrete:",{"$f":"\"> Pagamentos de adiantamentos devem ser feitos até o dia \"&DAY(VLOOKUP('Disparo de Emails'!$L$2,'Vencimentos Impostos'!$B$4:$I$15,8,0))&\"/\"&VLOOKUP(MONTH(VLOOKUP('Disparo de Emails'!$L$2,'Vencimentos Impostos'!$B$4:$I$15,8,0)),$D$4:$F$15,2,0)&\" (\"&VLOOKUP(WEEKDAY(VLOOKUP('Disparo de Emails'!$L$2,'Vencimentos Impostos'!$B$4:$I$15,8,0)),dia_semana,2,0)&\").\"","v":"> Pagamentos de adiantamentos devem ser feitos até o dia 19/Outubro (Sexta-feira)."},null,"Holerite Adiantamento Salarial","Resumo Adiantamento Folha de Pagamento"]
[null,"2018-09-01",null,4,"Abril","Abr",null,"RH - 1ª Parcela 13º Salário","Folha de Pagto","Folha de Pagamento - 1ª Parcela do 13º Salário","Lembrete:",{"$f":"\"> Pagamentos da 1ª parcela do 13º salário devem ser feitos até o dia \"&DAY(VLOOKUP('Disparo de Emails'!$L$2,'Vencimentos Impostos'!$B$4:$K$15,8,0))&\"/\"&VLOOKUP(MONTH(VLOOKUP('Disparo de Emails'!$L$2,'Vencimentos Impostos'!$B$4:$K$15,8,0)),$D$4:$F$15,2,0)&\" (\"&VLOOKUP(WEEKDAY(VLOOKUP('Disparo de Emails'!$L$2,'Vencimentos Impostos'!$B$4:$K$15,8,0)),dia_semana,2,0)&\").\"","v":"> Pagamentos da 1ª parcela do 13º salário devem ser feitos até o dia 19/Outubro (Sexta-feira)."},null,"Holerite 1ª Parcela - 13º Salário"]
[null,"2018-08-01",null,5,"Maio","Mai",null,"RH - 2ª Parcela 13º Salário","Folha de Pagto","Folha de Pagamento - 2ª Parcela do 13º Salário","Lembrete:",{"$f":"\"> Pagamentos da 2ª parcela do 13º salário devem ser feitos até o dia \"&DAY(VLOOKUP('Disparo de Emails'!$L$2,'Vencimentos Impostos'!$B$4:$K$15,8,0))&\"/\"&VLOOKUP(MONTH(VLOOKUP('Disparo de Emails'!$L$2,'Vencimentos Impostos'!$B$4:$K$15,8,0)),$D$4:$F$15,2,0)&\" (\"&VLOOKUP(WEEKDAY(VLOOKUP('Disparo de Emails'!$L$2,'Vencimentos Impostos'!$B$4:$K$15,8,0)),dia_semana,2,0)&\").\"","v":"> Pagamentos da 2ª parcela do 13º salário devem ser feitos até o dia 19/Outubro (Sexta-feira)."},0,"Holerite 2ª Parcela - 13º Salário","Guia INSS - 13º Salário","Guia FGTS - 13º Salário"]
[null,"2018-07-01",null,6,"Junho","Jun"]
[null,"2018-06-01",null,7,"Julho","Jul",null,"Cadastro de Nome de Arquivos"]
{"$rows_left_out":25}
{"sheet":"Tabela Infos","index":3,"n_rows":44,"n_cols":26,"rows_kept":44,"cut":false,"hidden":true,"merged":[[1,1,1,2],[12,8,12,9],[13,8,13,9],[14,8,14,9],[15,8,15,9],[1,3,1,4],[3,11,22,12],[3,19,22,20],[3,8,3,9],[4,8,4,9],[5,8,5,9],[16,8,16,9],[8,8,8,9],[9,8,9,9],[10,8,10,9],[11,8,11,9],[39,1,39,4],[6,8,6,9],[7,8,7,9],[17,8,17,9],[18,8,18,9],[19,8,19,9],[20,8,20,9],[21,8,21,9],[22,8,22,9]]}
[]
[null,"Caminho Verificação PDF",null,{"$f":"'Disparo de Emails'!F4&\"\\*.pdf\"","v":{"$error":"#N/A"}}]
[null,1,{"$f":"IFERROR(INDEX(caminho_verificacao,B3),\"\")","v":""},16,{"$f":"IFERROR(INDEX(caminho_verificacao,D3),\"\")","v":""}]
[null,2,{"$f":"IFERROR(INDEX(caminho_verificacao,B4),\"\")","v":""},17,{"$f":"IFERROR(INDEX(caminho_verificacao,D4),\"\")","v":""},null,1,{"$f":"IF(G4>MAX('Tabela Infos'!$W$4:$W$23),\"\",VLOOKUP(G4,'Tabela Infos'!$W$4:$Z$23,3,0))","v":""},{"$f":"IF(H4=\"\",\"\",INDEX(cadastro_arquivos,MATCH('Tabela Infos'!H4,'Cadastro Planilha'!$I$11:$I$40,0),1))","v":""},null,{"$f":"IF(H4=\"\",K3,I4)","v":0},{"$f":"IF(K23=0,\"Não foram encontrados os arquivos procurados na pasta indicada. Por favor verifique.\",K23)","v":"Não foram encontrados os arquivos procurados na pasta indicada. Por favor verifique."},null,{"$f":"IF(O4=\"\",\"\",MAX($N$3:N3)+1)","v":""},{"$f":"IFERROR(INDEX('Vencimentos Impostos'!$C$4:$G$15,MATCH('Disparo de Emails'!$L$2,'Vencimentos Impostos'!$B$4:$B$15,0),MATCH('Tabela Infos'!I4,'Vencimentos Impostos'!$C$3:$G$3,0)),\"\")","v":""},{"$f":"IF(O4=\"\",\"\",VLOOKUP(WEEKDAY(O4),dia_semana,2,0))","v":""},{"$f":"IF(O4=\"\",\"\",\"> \"&I4&\" - \"&DAY(O4)&\"/\"&MONTH(O4)&\"/\"&YEAR(O4)&\" (\"&P4&\")\")","v":""},{"$f":"IF(G4>MAX($N$4:$N$23),\"\",VLOOKUP(G4,$N$4:$Q$23,4,0))","v":""},{"$f":"IF(R4=\"\",S3,R4)","v":0},{"$f":"IF(S17=0,\"Não há vencimentos para as guias anexadas neste e-mail.\",S17)","v":"Não há vencimentos para as guias anexadas neste e-mail."},null,null,{"$f":"IF(Y4=\"\",\"\",MAX('Disparo de Emails'!$E$28:E28)+1)","v":""},"Anexo 1:",{"$f":"IF((COUNTIF('Tabela Infos'!$C$3:$C$32,VLOOKUP(VLOOKUP('Disparo de Emails'!$F$2,'Cadastro Planilha'!$H$4:$AG$8,MATCH(X4,'Cadastro Planilha'!$H$3:$AG$3,0),0),'Cadastro Planilha'!$H$11:$I$40,2,0))\n+COUNTIF('Tabela Infos'!$E$3:$E$32,VLOOKUP(VLOOKUP('Disparo de Emails'!$F$2,'Cadastro Planilha'!$H$4:$AG$8,MATCH(X4,'Cadastro Planilha'!$H$3:$AG$3,0),0),'Cadastro Planilha'!$H$11:$I$40,2,0)))>0,VLOOKUP(VLOOKUP('Disparo de Emails'!$F$2,'Cadastro Planilha'!$H$4:$AG$8,MATCH(X4,'Cadastro Planilha'!$H$3:$AG$3,0),0),'Cadastro Planilha'!$H$11:$I$40,2,0),\"\")","v":""},{"$f":"IF(Y4=\"\",\"\",'Disparo de Emails'!$F$4&\"\\\"&Y4)","v":""}]
[null,3,{"$f":"IFERROR(INDEX(caminho_verificacao,B5),\"\")","v":""},18,{"$f":"IFERROR(INDEX(caminho_verificacao,D5),\"\")","v":""},null,2,{"$f":"IF(G5>MAX('Tabela Infos'!$W$4:$W$23),\"\",VLOOKUP(G5,'Tabela Infos'!$W$4:$Z$23,3,0))","v":""},{"$f":"IF(H5=\"\",\"\",INDEX(cadastro_arquivos,MATCH('Tabela Infos'!H5,'Cadastro Planilha'!$I$11:$I$40,0),1))","v":""},null,{"$f":"IF(H5=\"\",K4,K4&CHAR(10)&I5)","v":0},null,null,{"$f":"IF(O5=\"\",\"\",MAX($N$3:N4)+1)","v":""},{"$f":"IFERROR(INDEX('Vencimentos Impostos'!$C$4:$G$15,MATCH('Disparo de Emails'!$L$2,'Vencimentos Impostos'!$B$4:$B$15,0),MATCH('Tabela Infos'!I5,'Vencimentos Impostos'!$C$3:$G$3,0)),\"\")","v":""},"","",{"$f":"IF(G5>MAX($N$4:$N$23),\"\",VLOOKUP(G5,$N$4:$Q$23,4,0))","v":""},{"$f":"IF(R5=\"\",S4,S4&CHAR(10)&R5)","v":0},null,null,null,{"$f":"IF(Y5=\"\",\"\",MAX($W$4:W4)+1)","v":""},"Anexo 2:",{"$f":"IF((COUNTIF('Tabela Infos'!$C$3:$C$32,VLOOKUP(VLOOKUP('Disparo de Emails'!$F$2,'Cadastro Planilha'!$H$4:$AG$8,MATCH(X5,'Cadastro Planilha'!$H$3:$AG$3,0),0),'Cadastro Planilha'!$H$11:$I$40,2,0))\n+COUNTIF('Tabela Infos'!$E$3:$E$32,VLOOKUP(VLOOKUP('Disparo de Emails'!$F$2,'Cadastro Planilha'!$H$4:$AG$8,MATCH(X5,'Cadastro Planilha'!$H$3:$AG$3,0),0),'Cadastro Planilha'!$H$11:$I$40,2,0)))>0,VLOOKUP(VLOOKUP('Disparo de Emails'!$F$2,'Cadastro Planilha'!$H$4:$AG$8,MATCH(X5,'Cadastro Planilha'!$H$3:$AG$3,0),0),'Cadastro Planilha'!$H$11:$I$40,2,0),\"\")","v":""},{"$f":"IF(Y5=\"\",\"\",'Disparo de Emails'!$F$4&\"\\\"&Y5)","v":""}]
[null,4,{"$f":"IFERROR(INDEX(caminho_verificacao,B6),\"\")","v":""},19,{"$f":"IFERROR(INDEX(caminho_verificacao,D6),\"\")","v":""},null,3,{"$f":"IF(G6>MAX('Tabela Infos'!$W$4:$W$23),\"\",VLOOKUP(G6,'Tabela Infos'!$W$4:$Z$23,3,0))","v":""},{"$f":"IF(H6=\"\",\"\",INDEX(cadastro_arquivos,MATCH('Tabela Infos'!H6,'Cadastro Planilha'!$I$11:$I$40,0),1))","v":""},null,0,null,null,{"$f":"IF(O6=\"\",\"\",MAX($N$3:N5)+1)","v":""},{"$f":"IFERROR(INDEX('Vencimentos Impostos'!$C$4:$G$15,MATCH('Disparo de Emails'!$L$2,'Vencimentos Impostos'!$B$4:$B$15,0),MATCH('Tabela Infos'!I6,'Vencimentos Impostos'!$C$3:$G$3,0)),\"\")","v":""},"","","",0,null,null,null,{"$f":"IF(Y6=\"\",\"\",MAX($W$4:W5)+1)","v":""},"Anexo 3:",{"$f":"IF((COUNTIF('Tabela Infos'!$C$3:$C$32,VLOOKUP(VLOOKUP('Disparo de Emails'!$F$2,'Cadastro Planilha'!$H$4:$AG$8,MATCH(X6,'Cadastro Planilha'!$H$3:$AG$3,0),0),'Cadastro Planilha'!$H$11:$I$40,2,0))\n+COUNTIF('Tabela Infos'!$E$3:$E$32,VLOOKUP(VLOOKUP('Disparo de Emails'!$F$2,'Cadastro Planilha'!$H$4:$AG$8,MATCH(X6,'Cadastro Planilha'!$H$3:$AG$3,0),0),'Cadastro Planilha'!$H$11:$I$40,2,0)))>0,VLOOKUP(VLOOKUP('Disparo de Emails'!$F$2,'Cadastro Planilha'!$H$4:$AG$8,MATCH(X6,'Cadastro Planilha'!$H$3:$AG$3,0),0),'Cadastro Planilha'!$H$11:$I$40,2,0),\"\")","v":""},{"$f":"IF(Y6=\"\",\"\",'Disparo de Emails'!$F$4&\"\\\"&Y6)","v":""}]
[null,5,{"$f":"IFERROR(INDEX(caminho_verificacao,B7),\"\")","v":""},20,{"$f":"IFERROR(INDEX(caminho_verificacao,D7),\"\")","v":""},null,4,{"$f":"IF(G7>MAX('Tabela Infos'!$W$4:$W$23),\"\",VLOOKUP(G7,'Tabela Infos'!$W$4:$Z$23,3,0))","v":""},{"$f":"IF(H7=\"\",\"\",INDEX(cadastro_arquivos,MATCH('Tabela Infos'!H7,'Cadastro Planilha'!$I$11:$I$40,0),1))","v":""},null,0,null,null,{"$f":"IF(O7=\"\",\"\",MAX($N$3:N6)+1)","v":""},{"$f":"IFERROR(INDEX('Vencimentos Impostos'!$C$4:$G$15,MATCH('Disparo de Emails'!$L$2,'Vencimentos Impostos'!$B$4:$B$15,0),MATCH('Tabela Infos'!I7,'Vencimentos Impostos'!$C$3:$G$3,0)),\"\")","v":""},"","","",0,null,null,null,{"$f":"IF(Y7=\"\",\"\",MAX($W$4:W6)+1)","v":""},"Anexo 4:",{"$f":"IF((COUNTIF('Tabela Infos'!$C$3:$C$32,VLOOKUP(VLOOKUP('Disparo de Emails'!$F$2,'Cadastro Planilha'!$H$4:$AG$8,MATCH(X7,'Cadastro Planilha'!$H$3:$AG$3,0),0),'Cadastro Planilha'!$H$11:$I$40,2,0))\n+COUNTIF('Tabela Infos'!$E$3:$E$32,VLOOKUP(VLOOKUP('Disparo de Emails'!$F$2,'Cadastro Planilha'!$H$4:$AG$8,MATCH(X7,'Cadastro Planilha'!$H$3:$AG$3,0),0),'Cadastro Planilha'!$H$11:$I$40,2,0)))>0,VLOOKUP(VLOOKUP('Disparo de Emails'!$F$2,'Cadastro Planilha'!$H$4:$AG$8,MATCH(X7,'Cadastro Planilha'!$H$3:$AG$3,0),0),'Cadastro Planilha'!$H$11:$I$40,2,0),\"\")","v":""},{"$f":"IF(Y7=\"\",\"\",'Disparo de Emails'!$F$4&\"\\\"&Y7)","v":""}]
[null,6,{"$f":"IFERROR(INDEX(caminho_verificacao,B8),\"\")","v":""},21,{"$f":"IFERROR(INDEX(caminho_verificacao,D8),\"\")","v":""},null,5,{"$f":"IF(G8>MAX('Tabela Infos'!$W$4:$W$23),\"\",VLOOKUP(G8,'Tabela Infos'!$W$4:$Z$23,3,0))","v":""},{"$f":"IF(H8=\"\",\"\",INDEX(cadastro_arquivos,MATCH('Tabela Infos'!H8,'Cadastro Planilha'!$I$11:$I$40,0),1))","v":""},null,0,null,null,{"$f":"IF(O8=\"\",\"\",MAX($N$3:N7)+1)","v":""},{"$f":"IFERROR(INDEX('Vencimentos Impostos'!$C$4:$G$15,MATCH('Disparo de Emails'!$L$2,'Vencimentos Impostos'!$B$4:$B$15,0),MATCH('Tabela Infos'!I8,'Vencimentos Impostos'!$C$3:$G$3,0)),\"\")","v":""},"","","",0,null,null,null,{"$f":"IF(Y8=\"\",\"\",MAX($W$4:W7)+1)","v":""},"Anexo 5:",{"$f":"IF((COUNTIF('Tabela Infos'!$C$3:$C$32,VLOOKUP(VLOOKUP('Disparo de Emails'!$F$2,'Cadastro Planilha'!$H$4:$AG$8,MATCH(X8,'Cadastro Planilha'!$H$3:$AG$3,0),0),'Cadastro Planilha'!$H$11:$I$40,2,0))\n+COUNTIF('Tabela Infos'!$E$3:$E$32,VLOOKUP(VLOOKUP('Disparo de Emails'!$F$2,'Cadastro Planilha'!$H$4:$AG$8,MATCH(X8,'Cadastro Planilha'!$H$3:$AG$3,0),0),'Cadastro Planilha'!$H$11:$I$40,2,0)))>0,VLOOKUP(VLOOKUP('Disparo de Emails'!$F$2,'Cadastro Planilha'!$H$4:$AG$8,MATCH(X8,'Cadastro Planilha'!$H$3:$AG$3,0),0),'Cadastro Planilha'!$H$11:$I$40,2,0),\"\")","v":""},{"$f":"IF(Y8=\"\",\"\",'Disparo de Emails'!$F$4&\"\\\"&Y8)","v":""}]
[null,7,{"$f":"IFERROR(INDEX(caminho_verificacao,B9),\"\")","v":""},22,{"$f":"IFERROR(INDEX(caminho_verificacao,D9),\"\")","v":""},null,6,{"$f":"IF(G9>MAX('Tabela Infos'!$W$4:$W$23),\"\",VLOOKUP(G9,'Tabela Infos'!$W$4:$Z$23,3,0))","v":""},{"$f":"IF(H9=\"\",\"\",INDEX(cadastro_arquivos,MATCH('Tabela Infos'!H9,'Cadastro Planilha'!$I$11:$I$40,0),1))","v":""},null,0,null,null,{"$f":"IF(O9=\"\",\"\",MAX($N$3:N8)+1)","v":""},{"$f":"IFERROR(INDEX('Vencimentos Impostos'!$C$4:$G$15,MATCH('Disparo de Emails'!$L$2,'Vencimentos Impostos'!$B$4:$B$15,0),MATCH('Tabela Infos'!I9,'Vencimentos Impostos'!$C$3:$G$3,0)),\"\")","v":""},"","","",0,null,null,null,{"$f":"IF(Y9=\"\",\"\",MAX($W$4:W8)+1)","v":""},"Anexo 6:",{"$f":"IF((COUNTIF('Tabela Infos'!$C$3:$C$32,VLOOKUP(VLOOKUP('Disparo de Emails'!$F$2,'Cadastro Planilha'!$H$4:$AG$8,MATCH(X9,'Cadastro Planilha'!$H$3:$AG$3,0),0),'Cadastro Planilha'!$H$11:$I$40,2,0))\n+COUNTIF('Tabela Infos'!$E$3:$E$32,VLOOKUP(VLOOKUP('Disparo de Emails'!$F$2,'Cadastro Planilha'!$H$4:$AG$8,MATCH(X9,'Cadastro Planilha'!$H$3:$AG$3,0),0),'Cadastro Planilha'!$H$11:$I$40,2,0)))>0,VLOOKUP(VLOOKUP('Disparo de Emails'!$F$2,'Cadastro Planilha'!$H$4:$AG$8,MATCH(X9,'Cadastro Planilha'!$H$3:$AG$3,0),0),'Cadastro Planilha'!$H$11:$I$40,2,0),\"\")","v":""},{"$f":"IF(Y9=\"\",\"\",'Disparo de Emails'!$F$4&\"\\\"&Y9)","v":""}]
[null,8,{"$f":"IFERROR(INDEX(caminho_verificacao,B10),\"\")","v":""},23,{"$f":"IFERROR(INDEX(caminho_verificacao,D10),\"\")","v":""},null,7,{"$f":"IF(G10>MAX('Tabela Infos'!$W$4:$W$23),\"\",VLOOKUP(G10,'Tabela Infos'!$W$4:$Z$23,3,0))","v":""},{"$f":"IF(H10=\"\",\"\",INDEX(cadastro_arquivos,MATCH('Tabela Infos'!H10,'Cadastro Planilha'!$I$11:$I$40,0),1))","v":""},null,0,null,null,{"$f":"IF(O10=\"\",\"\",MAX($N$3:N9)+1)","v":""},{"$f":"IFERROR(INDEX('Vencimentos Impostos'!$C$4:$G$15,MATCH('Disparo de Emails'!$L$2,'Vencimentos Impostos'!$B$4:$B$15,0),MATCH('Tabela Infos'!I10,'Vencimentos Impostos'!$C$3:$G$3,0)),\"\")","v":""},"","","",0,null,null,null,{"$f":"IF(Y10=\"\",\"\",MAX($W$4:W9)+1)","v":""},"Anexo 7:",{"$f":"IF((COUNTIF('Tabela Infos'!$C$3:$C$32,VLOOKUP(VLOOKUP('Disparo de Emails'!$F$2,'Cadastro Planilha'!$H$4:$AG$8,MATCH(X10,'Cadastro Planilha'!$H$3:$AG$3,0),0),'Cadastro Planilha'!$H$11:$I$40,2,0))\n+COUNTIF('Tabela Infos'!$E$3:$E$32,VLOOKUP(VLOOKUP('Disparo de Emails'!$F$2,'Cadastro Planilha'!$H$4:$AG$8,MATCH(X10,'Cadastro Planilha'!$H$3:$AG$3,0),0),'Cadastro Planilha'!$H$11:$I$40,2,0)))>0,VLOOKUP(VLOOKUP('Disparo de Emails'!$F$2,'Cadastro Planilha'!$H$4:$AG$8,MATCH(X10,'Cadastro Planilha'!$H$3:$AG$3,0),0),'Cadastro Planilha'!$H$11:$I$40,2,0),\"\")","v":""},{"$f":"IF(Y10=\"\",\"\",'Disparo de Emails'!$F$4&\"\\\"&Y10)","v":""}]
{"$rows_left_out":35}
{"sheet":"Vencimentos Impostos","index":4,"n_rows":15,"n_cols":11,"rows_kept":15,"cut":false,"hidden":false,"merged":[[1,2,1,6],[1,9,1,10]]}
[]
[null,null,"Data Vencimento",null,null,null,null,null,null,"13º Salário"]
[null,"MÊS REF.","DAS do Simples Nacional","Contribuição Previdenciária sobre Receita Bruta - CPRB","Guia INSS","Guia FGTS","Guia IRRF","5º dia útil","Dia 20","1ª Parcela","2ª Parcela"]
[null,"2018-12-01","2019-01-18",{"$f":"C4","v":"2019-01-18"},{"$f":"C4","v":"2019-01-18"},"2019-01-07",{"$f":"C4","v":"2019-01-18"},"2019-01-08","2018-12-20","2018-12-20","2018-12-20"]
[null,"2018-11-01","2018-12-20","2018-12-20","2018-12-20","2018-12-07","2018-12-20","2018-12-07","2018-11-20","2018-11-30","2018-11-30"]
[null,"2018-10-01","2018-11-20","2018-11-20","2018-11-20","2018-11-07","2018-11-20","2018-11-08","2018-10-19","N/A","N/A"]
[null,"2018-09-01","2018-10-22","2018-10-19","2018-10-19","2018-10-05","2018-10-19","2018-10-05","2018-09-20","N/A","N/A"]
[null,"2018-08-01","2018-09-20","2018-09-20","2018-09-20","2018-09-06","2018-09-20","2018-09-06","2018-08-20","N/A","N/A"]
[null,"2018-07-01","2018-08-20","2018-08-20","2018-08-20","2018-08-07","2018-08-20","2018-08-07","2018-07-20","N/A","N/A"]
[null,"2018-06-01","2018-07-20","2018-07-20","2018-07-20","2018-07-06","2018-07-20","2018-07-06","2018-06-20","N/A","N/A"]
{"$rows_left_out":5}