{"text_format":"1","workbook":"xlsx","n_sheets":2,"sheets":["Lançamento captação","Base balanço Hídrico"],"not_rendered":{"charts":0,"images":4,"macros":1,"external_links":0,"defined_names":0,"comments":0,"pivot_tables":0},"unopened":[],"bounds":{"document_bytes":16777216,"sheet_cells":100000,"rows_first":2000,"rows_last":500,"rows_between":2000,"halvings":0,"cell_chars":16384,"cell_head_chars":4096},"cells_cut":0,"cells_raw":0,"read":"whole","date_system":"1900"}

{"sheet":"Lançamento captação","index":0,"n_rows":25,"n_cols":24,"rows_kept":25,"cut":false,"hidden":false,"merged":[[13,0,16,2],[0,3,1,6],[7,21,7,22],[7,3,7,4],[7,5,7,6],[7,7,7,8],[7,9,7,10],[7,11,7,12],[7,13,7,14],[7,15,7,16],[7,17,7,18],[7,19,7,20]]}
[null,null,null,"LANÇAMENTO CAPTAÇÃO DIÁRIA E SEMANAL"]
[]
["DATA ","ANO","MÊS ","Poço 1 - Hidrômetro","Poço 1 - Horimetro","Poço 4 - Hidrômetro","Poço 4 - Horimetro","Poço 6 - Hidrômetro","Poço 6 - Horimetro","Poço 8 - Hidrômetro","Poço 8 - Horimetro","Poço 9 - Hidrômetro","Poço 9 - Horimetro","Poço 10 - Hidrômetro","Poço 10 - Horimetro","Poço 11 - Hidrômetro","Poço 11 - Horimetro","Poço 12 - Hidrômetro","Poço 12 - Horimetro","Poço 13 - Hidrômetro","Poço 13 - Horimetro","Poço 14 - Hidrômetro","Poço 14 - Horimetro","Rede Publica SAAE"]
["2021-01-27",{"$f":"VLOOKUP($A$4,'Base balanço Hídrico'!$A$7:$BT$845,MATCH(B3,'Base balanço Hídrico'!$A$6:$BT$6,0),FALSE)","v":2021},{"$f":"MONTH(A4)","v":1},10,13,1,20,null,null,{"$f":"VLOOKUP($A$4,'Base balanço Hídrico'!$A$5:$BT$843,MATCH(J3,'Base balanço Hídrico'!$A$6:$BT$6,0),FALSE)","v":0},{"$f":"VLOOKUP($A$4,'Base balanço Hídrico'!$A$5:$BT$843,MATCH(K3,'Base balanço Hídrico'!$A$6:$BT$6,0),FALSE)","v":0},{"$f":"VLOOKUP($A$4,'Base balanço Hídrico'!$A$5:$BT$843,MATCH(L3,'Base balanço Hídrico'!$A$6:$BT$6,0),FALSE)","v":0},{"$f":"VLOOKUP($A$4,'Base balanço Hídrico'!$A$5:$BT$843,MATCH(M3,'Base balanço Hídrico'!$A$6:$BT$6,0),FALSE)","v":0},{"$f":"VLOOKUP($A$4,'Base balanço Hídrico'!$A$5:$BT$843,MATCH(N3,'Base balanço Hídrico'!$A$6:$BT$6,0),FALSE)","v":0},{"$f":"VLOOKUP($A$4,'Base balanço Hídrico'!$A$5:$BT$843,MATCH(O3,'Base balanço Hídrico'!$A$6:$BT$6,0),FALSE)","v":0},{"$f":"VLOOKUP($A$4,'Base balanço Hídrico'!$A$5:$BT$843,MATCH(P3,'Base balanço Hídrico'!$A$6:$BT$6,0),FALSE)","v":0},{"$f":"VLOOKUP($A$4,'Base balanço Hídrico'!$A$5:$BT$843,MATCH(Q3,'Base balanço Hídrico'!$A$6:$BT$6,0),FALSE)","v":0},{"$f":"VLOOKUP($A$4,'Base balanço Hídrico'!$A$5:$BT$843,MATCH(R3,'Base balanço Hídrico'!$A$6:$BT$6,0),FALSE)","v":0},{"$f":"VLOOKUP($A$4,'Base balanço Hídrico'!$A$5:$BT$843,MATCH(S3,'Base balanço Hídrico'!$A$6:$BT$6,0),FALSE)","v":0},{"$f":"VLOOKUP($A$4,'Base balanço Hídrico'!$A$5:$BT$843,MATCH(T3,'Base balanço Hídrico'!$A$6:$BT$6,0),FALSE)","v":0},{"$f":"VLOOKUP($A$4,'Base balanço Hídrico'!$A$5:$BT$843,MATCH(U3,'Base balanço Hídrico'!$A$6:$BT$6,0),FALSE)","v":0},{"$f":"VLOOKUP($A$4,'Base balanço Hídrico'!$A$5:$BT$843,MATCH(V3,'Base balanço Hídrico'!$A$6:$BT$6,0),FALSE)","v":0},{"$f":"VLOOKUP($A$4,'Base balanço Hídrico'!$A$5:$BT$843,MATCH(W3,'Base balanço Hídrico'!$A$6:$BT$6,0),FALSE)","v":0},{"$f":"VLOOKUP($A$4,'Base balanço Hídrico'!$A$5:$BT$843,MATCH(X3,'Base balanço Hídrico'!$A$6:$BT$6,0),FALSE)","v":0}]
[{"$f":"A4-1","v":"2021-01-26"},null,"DIA ANTERIOR:",{"$f":"VLOOKUP($A$5,'Base balanço Hídrico'!$A$6:$BT$845,MATCH(D3,'Base balanço Hídrico'!$A$6:$BT$6,0),FALSE)","v":0},{"$f":"VLOOKUP($A$5,'Base balanço Hídrico'!$A$6:$BT$845,MATCH(E3,'Base balanço Hídrico'!$A$6:$BT$6,0),FALSE)","v":0},{"$f":"VLOOKUP($A$5,'Base balanço Hídrico'!$A$6:$BT$845,MATCH(F3,'Base balanço Hídrico'!$A$6:$BT$6,0),FALSE)","v":0},{"$f":"VLOOKUP($A$5,'Base balanço Hídrico'!$A$6:$BT$845,MATCH(G3,'Base balanço Hídrico'!$A$6:$BT$6,0),FALSE)","v":0},{"$f":"VLOOKUP($A$5,'Base balanço Hídrico'!$A$6:$BT$845,MATCH(H3,'Base balanço Hídrico'!$A$6:$BT$6,0),FALSE)","v":0},{"$f":"VLOOKUP($A$5,'Base balanço Hídrico'!$A$6:$BT$845,MATCH(I3,'Base balanço Hídrico'!$A$6:$BT$6,0),FALSE)","v":0},{"$f":"VLOOKUP($A$5,'Base balanço Hídrico'!$A$6:$BT$845,MATCH(J3,'Base balanço Hídrico'!$A$6:$BT$6,0),FALSE)","v":0},{"$f":"VLOOKUP($A$5,'Base balanço Hídrico'!$A$6:$BT$845,MATCH(K3,'Base balanço Hídrico'!$A$6:$BT$6,0),FALSE)","v":0},{"$f":"VLOOKUP($A$5,'Base balanço Hídrico'!$A$6:$BT$845,MATCH(L3,'Base balanço Hídrico'!$A$6:$BT$6,0),FALSE)","v":0},{"$f":"VLOOKUP($A$5,'Base balanço Hídrico'!$A$6:$BT$845,MATCH(M3,'Base balanço Hídrico'!$A$6:$BT$6,0),FALSE)","v":0},{"$f":"VLOOKUP($A$5,'Base balanço Hídrico'!$A$6:$BT$845,MATCH(N3,'Base balanço Hídrico'!$A$6:$BT$6,0),FALSE)","v":0},{"$f":"VLOOKUP($A$5,'Base balanço Hídrico'!$A$6:$BT$845,MATCH(O3,'Base balanço Hídrico'!$A$6:$BT$6,0),FALSE)","v":0},{"$f":"VLOOKUP($A$5,'Base balanço Hídrico'!$A$6:$BT$845,MATCH(P3,'Base balanço Hídrico'!$A$6:$BT$6,0),FALSE)","v":0},{"$f":"VLOOKUP($A$5,'Base balanço Hídrico'!$A$6:$BT$845,MATCH(Q3,'Base balanço Hídrico'!$A$6:$BT$6,0),FALSE)","v":0},{"$f":"VLOOKUP($A$5,'Base balanço Hídrico'!$A$6:$BT$845,MATCH(R3,'Base balanço Hídrico'!$A$6:$BT$6,0),FALSE)","v":0},{"$f":"VLOOKUP($A$5,'Base balanço Hídrico'!$A$6:$BT$845,MATCH(S3,'Base balanço Hídrico'!$A$6:$BT$6,0),FALSE)","v":0},{"$f":"VLOOKUP($A$5,'Base balanço Hídrico'!$A$6:$BT$845,MATCH(T3,'Base balanço Hídrico'!$A$6:$BT$6,0),FALSE)","v":0},{"$f":"VLOOKUP($A$5,'Base balanço Hídrico'!$A$6:$BT$845,MATCH(U3,'Base balanço Hídrico'!$A$6:$BT$6,0),FALSE)","v":0},{"$f":"VLOOKUP($A$5,'Base balanço Hídrico'!$A$6:$BT$845,MATCH(V3,'Base balanço Hídrico'!$A$6:$BT$6,0),FALSE)","v":0},{"$f":"VLOOKUP($A$5,'Base balanço Hídrico'!$A$6:$BT$845,MATCH(W3,'Base balanço Hídrico'!$A$6:$BT$6,0),FALSE)","v":0},{"$f":"VLOOKUP($A$5,'Base balanço Hídrico'!$A$6:$BT$845,MATCH(X3,'Base balanço Hídrico'!$A$6:$BT$6,0),FALSE)","v":0}]
[null,null,"EXCEÇÃO:"]
[null,null,"STATUS:",{"$f":"D17","v":"OK"},{"$f":"E17","v":"OK"},{"$f":"F17","v":"OK"},{"$f":"G17","v":"OK"},{"$f":"H17","v":""},"","OK","OK","OK","OK","OK","OK","OK","OK","OK","OK","OK","OK","OK","OK",{"$f":"X17","v":"OK"}]
[null,null,null,"3 CASAS DECIMAIS",null,"3 CASAS DECIMAIS",null,"3 CASAS DECIMAIS",null,"3 CASAS DECIMAIS",null,"3 CASAS DECIMAIS",null,"3 CASAS DECIMAIS",null,"3 CASAS DECIMAIS",null,"3 CASAS DECIMAIS",null,"3 CASAS DECIMAIS",null,"3 CASAS DECIMAIS"]
[null,null,null,"m³ captado","Horas","m³ captado","Horas","m³ captado","Horas","m³ captado","Horas","m³ captado","Horas","m³ captado","Horas","m³ captado","Horas","m³ captado","Horas","m³ captado","Horas","m³ captado","Horas","m³ captado"]
[null,null,null,{"$f":"IF(D6=\"trocado\",0,IF(D6=\"zerou\",D4-D5+D12,D4-D5))","v":10},13,1,20,0,0,0,0,0,0,0,0,0,0,0,0,0,0,0,0,0]
[null,null,null,"zera em","zera em","zera em","zera em","zera em","zera em","zera em","zera em","zera em","zera em","zera em","zera em","zera em","zera em","zera em","zera em","zera em","zera em","zera em","zera em","zera em"]
[null,null,null,99999,99999,99999,99999,99999,99999,99999,99999,99999,99999,99999,99999,99999,99999,99999,99999,99999,99999,99999,99999,99999]
[null,null,null,"máx outorga","máx outorga","máx outorga","máx outorga","máx outorga","máx outorga","máx outorga","máx outorga","máx outorga","máx outorga","máx outorga","máx outorga","máx outorga","máx outorga","máx outorga","máx outorga","máx outorga","máx outorga","máx outorga","máx outorga","máx outorga"]
["Pode gravar a qualquer momento, no ultimo gravar para salvar tudo. ",null,null,140,140,140,140,140,140,140,140,140,140,140,140,140,140,140,140,140,140,140,140,140]
[null,null,null,"máx erro","máx erro","máx erro","máx erro","máx erro","máx erro","máx erro","máx erro","máx erro","máx erro","máx erro","máx erro","máx erro","máx erro","máx erro","máx erro","máx erro","máx erro","máx erro","máx erro","máx erro"]
[null,null,null,300,300,300,300,300,300,300,300,300,300,300,300,300,300,300,300,300,300,300,300,300]
[null,null,null,{"$f":"IF(D4=\"\",\"\",IF(D10<0,\"ERRO\",IF(D10<D14,\"OK\",IF(D10<D16,\"Acima Outorga\",\"ERRO\"))))","v":"OK"},"OK","OK","OK","","","OK","OK","OK","OK","OK","OK","OK","OK","OK","OK","OK","OK","OK","OK","OK"]
[]
[null,null,null,null,null,{"$f":"IF(F3=Base[[#Headers],[Poço 1 - Hidrômetro]],1,2)","v":2}]
["AVISOS "]
[null,null,null,{"$f":"INDEX(Base[#All],MATCH($A$4,Base[[#All],[DATA]],0),MATCH(D$3,Base[#Headers],0))","v":0},{"$f":"INDEX(Base[#All],MATCH($A$4,Base[[#All],[DATA]],0),MATCH(E$3,Base[#Headers],0))","v":0},{"$f":"INDEX(Base[#All],MATCH($A$4,Base[[#All],[DATA]],0),MATCH(F$3,Base[#Headers],0))","v":0},{"$f":"INDEX(Base[#All],MATCH($A$4,Base[[#All],[DATA]],0),MATCH(G$3,Base[#Headers],0))","v":0},{"$f":"INDEX(Base[#All],MATCH($A$4,Base[[#All],[DATA]],0),MATCH(H$3,Base[#Headers],0))","v":0},{"$f":"INDEX(Base[#All],MATCH($A$4,Base[[#All],[DATA]],0),MATCH(I$3,Base[#Headers],0))","v":0},{"$f":"INDEX(Base[#All],MATCH($A$4,Base[[#All],[DATA]],0),MATCH(J$3,Base[#Headers],0))","v":0},{"$f":"INDEX(Base[#All],MATCH($A$4,Base[[#All],[DATA]],0),MATCH(K$3,Base[#Headers],0))","v":0},{"$f":"INDEX(Base[#All],MATCH($A$4,Base[[#All],[DATA]],0),MATCH(L$3,Base[#Headers],0))","v":0},{"$f":"INDEX(Base[#All],MATCH($A$4,Base[[#All],[DATA]],0),MATCH(M$3,Base[#Headers],0))","v":0},{"$f":"INDEX(Base[#All],MATCH($A$4,Base[[#All],[DATA]],0),MATCH(N$3,Base[#Headers],0))","v":0},{"$f":"INDEX(Base[#All],MATCH($A$4,Base[[#All],[DATA]],0),MATCH(O$3,Base[#Headers],0))","v":0},{"$f":"INDEX(Base[#All],MATCH($A$4,Base[[#All],[DATA]],0),MATCH(P$3,Base[#Headers],0))","v":0},{"$f":"INDEX(Base[#All],MATCH($A$4,Base[[#All],[DATA]],0),MATCH(Q$3,Base[#Headers],0))","v":0},{"$f":"INDEX(Base[#All],MATCH($A$4,Base[[#All],[DATA]],0),MATCH(R$3,Base[#Headers],0))","v":0},{"$f":"INDEX(Base[#All],MATCH($A$4,Base[[#All],[DATA]],0),MATCH(S$3,Base[#Headers],0))","v":0},{"$f":"INDEX(Base[#All],MATCH($A$4,Base[[#All],[DATA]],0),MATCH(T$3,Base[#Headers],0))","v":0},{"$f":"INDEX(Base[#All],MATCH($A$4,Base[[#All],[DATA]],0),MATCH(U$3,Base[#Headers],0))","v":0},{"$f":"INDEX(Base[#All],MATCH($A$4,Base[[#All],[DATA]],0),MATCH(V$3,Base[#Headers],0))","v":0},{"$f":"INDEX(Base[#All],MATCH($A$4,Base[[#All],[DATA]],0),MATCH(W$3,Base[#Headers],0))","v":0},{"$f":"INDEX(Base[#All],MATCH($A$4,Base[[#All],[DATA]],0),MATCH(X$3,Base[#Headers],0))","v":0}]
[]
[null,null,null,{"$f":"COUNTA(Base[#Headers])","v":72}]
[null,null,null,{"$f":"MATCH($A$4,Base[[#All],[DATA]],0)","v":27}]
[null,null,null,{"$f":"MATCH(D$3,Base[#Headers],0)","v":4},{"$f":"MATCH(E$3,Base[#Headers],0)","v":5},{"$f":"MATCH(F$3,Base[#Headers],0)","v":10},{"$f":"MATCH(G$3,Base[#Headers],0)","v":11},{"$f":"MATCH(H$3,Base[#Headers],0)","v":16},{"$f":"MATCH(I$3,Base[#Headers],0)","v":17},{"$f":"MATCH(J$3,Base[#Headers],0)","v":28},{"$f":"MATCH(K$3,Base[#Headers],0)","v":29},{"$f":"MATCH(L$3,Base[#Headers],0)","v":34},{"$f":"MATCH(M$3,Base[#Headers],0)","v":35},{"$f":"MATCH(N$3,Base[#Headers],0)","v":40},{"$f":"MATCH(O$3,Base[#Headers],0)","v":41},{"$f":"MATCH(P$3,Base[#Headers],0)","v":46},{"$f":"MATCH(Q$3,Base[#Headers],0)","v":47},{"$f":"MATCH(R$3,Base[#Headers],0)","v":52},{"$f":"MATCH(S$3,Base[#Headers],0)","v":53},{"$f":"MATCH(T$3,Base[#Headers],0)","v":58},{"$f":"MATCH(U$3,Base[#Headers],0)","v":59},{"$f":"MATCH(V$3,Base[#Headers],0)","v":64},{"$f":"MATCH(W$3,Base[#Headers],0)","v":65},{"$f":"MATCH(X$3,Base[#Headers],0)","v":70}]

{"sheet":"Base balanço Hídrico","index":1,"n_rows":845,"n_cols":72,"rows_kept":845,"cut":false,"hidden":false,"merged":[]}
[]
[]
[]
[]
[]
["DATA","ANO","MÊS ","Poço 1 - Hidrômetro","Poço 1 - Horimetro","Poço 1 - m³ Captado","Poço 1 - m³ Horas de uso","Poço 1 - m³ Vazão","Poço 1 - m³ Vazão Outorgada","Poço 4 - Hidrômetro","Poço 4 - Horimetro","Poço 4 - m³ Captado","Poço 4 - m³ Horas de uso","Poço 4 - m³ Vazão","Poço 4 - m³ Vazão Outorgada","Poço 6 - Hidrômetro","Poço 6 - Horimetro","Poço 6 - m³ Captado","Poço 6 - m³ Horas de uso","Poço 6 - m³ Vazão","Poço 6 - m³ Vazão Outorgada","Poço 7 - Hidrômetro","Poço 7 - Horimetro","Poço 7 - m³ Captado","Poço 7 - m³ Horas de uso","Poço 7 - m³ Vazão","Poço 7 - m³ Vazão Outorgada","Poço 8 - Hidrômetro","Poço 8 - Horimetro","Poço 8 - m³ Captado","Poço 8 - m³ Horas de uso","Poço 8 - m³ Vazão","Poço 8 - m³ Vazão Outorgada","Poço 9 - Hidrômetro","Poço 9 - Horimetro","Poço 9 - m³ Captado","Poço 9 - m³ Horas de uso","Poço 9 - m³ Vazão","Poço 9 - m³ Vazão Outorgada","Poço 10 - Hidrômetro","Poço 10 - Horimetro","Poço 10 - m³ Captado","Poço 10 - m³ Horas de uso","Poço 10 - m³ Vazão","Poço 10 - m³ Vazão Outorgada","Poço 11 - Hidrômetro","Poço 11 - Horimetro","Poço 11 - m³ Captado","Poço 11 - m³ Horas de uso","Poço 11 - m³ Vazão","Poço 11 - m³ Vazão Outorgada","Poço 12 - Hidrômetro","Poço 12 - Horimetro","Poço 12 - m³ Captado","Poço 12 - m³ Horas de uso","Poço 12 - m³ Vazão","Poço 12 - m³ Vazão Outorgada","Poço 13 - Hidrômetro","Poço 13 - Horimetro","Poço 13 - m³ Captado","Poço 13 - m³ Horas de uso","Poço 13 - m³ Vazão","Poço 13 - m³ Vazão Outorgada","Poço 14 - Hidrômetro","Poço 14 - Horimetro","Poço 14 - m³ Captado","Poço 14 - m³ Horas de uso","Poço 14 - m³ Vazão","Poço 14 - m³ Vazão Outorgada","Rede Publica SAAE","Abastecimento Caminhão","Coluna1"]
["2021-01-02",2021,1]
["2021-01-03",2021,1]
["2021-01-04",2021,1]
["2021-01-05",2021,1]
["2021-01-06",2021,1]
["2021-01-07",2021,1]
["2021-01-08",2021,1]
["2021-01-09",2021,1]
["2021-01-10",2021,1]
["2021-01-11",2021,1]
["2021-01-12",2021,1]
["2021-01-13",2021,1]
["2021-01-14",2021,1]
["2021-01-15",2021,1]
["2021-01-16",2021,1]
["2021-01-17",2021,1]
["2021-01-18",2021,1]
["2021-01-19",2021,1]
["2021-01-20",2021,1]
["2021-01-21",2021,1]
["2021-01-22",2021,1]
["00:00:00",1900,1]
["2021-01-24",2021,1]
["2021-01-25",2021,1]
["2021-01-26",2021,1]
["2021-01-27",2021,1]
["2021-01-28",2021,1]
["2021-01-29",2021,1]
["2021-01-30",2021,1]
["2021-01-31",2021,1]
["2021-02-01",2021,2]
["2021-02-02",2021,2]
["2021-02-03",2021,2]
["2021-02-04",2021,2]
["2021-02-05",2021,2]
["2021-02-06",2021,2]
["2021-02-07",2021,2]
["2021-02-08",2021,2]
["2021-02-09",2021,2]
["2021-02-10",2021,2]
["2021-02-11",2021,2]
["2021-02-12",2021,2]
["2021-02-13",2021,2]
["2021-02-14",2021,2]
["2021-02-15",2021,2]
["2021-02-16",2021,2]
["2021-02-17",2021,2]
["2021-02-18",2021,2]
["2021-02-19",2021,2]
["2021-02-20",2021,2]
["2021-02-21",2021,2]
["2021-02-22",2021,2]
["2021-02-23",2021,2]
["2021-02-24",2021,2]
["2021-02-25",2021,2]
["2021-02-26",2021,2]
["2021-02-27",2021,2]
["2021-02-28",2021,2]
["2021-03-01",2021,3]
["2021-03-02",2021,3]
["2021-03-03",2021,3]
["2021-03-04",2021,3]
["2021-03-05",2021,3]
["2021-03-06",2021,3]
["2021-03-07",2021,3]
["2021-03-08",2021,3]
["2021-03-09",2021,3]
["2021-03-10",2021,3]
["2021-03-11",2021,3]
["2021-03-12",2021,3]
["2021-03-13",2021,3]
["2021-03-14",2021,3]
["2021-03-15",2021,3]
["2021-03-16",2021,3]
["2021-03-17",2021,3]
["2021-03-18",2021,3]
["2021-03-19",2021,3]
["2021-03-20",2021,3]
["2021-03-21",2021,3]
["2021-03-22",2021,3]
["2021-03-23",2021,3]
["2021-03-24",2021,3]
["2021-03-25",2021,3]
["2021-03-26",2021,3]
["2021-03-27",2021,3]
["2021-03-28",2021,3]
["2021-03-29",2021,3]
["2021-03-30",2021,3]
["2021-03-31",2021,3]
["2021-04-01",2021,4]
["2021-04-02",2021,4]
["2021-04-03",2021,4]
["2021-04-04",2021,4]
["2021-04-05",2021,4]
["2021-04-06",2021,4]
["2021-04-07",2021,4]
["2021-04-08",2021,4]
["2021-04-09",2021,4]
["2021-04-10",2021,4]
["2021-04-11",2021,4]
["2021-04-12",2021,4]
["2021-04-13",2021,4]
["2021-04-14",2021,4]
["2021-04-15",2021,4]
["2021-04-16",2021,4]
["2021-04-17",2021,4]
["2021-04-18",2021,4]
["2021-04-19",2021,4]
["2021-04-20",2021,4]
["2021-04-21",2021,4]
["2021-04-22",2021,4]
["2021-04-23",2021,4]
["2021-04-24",2021,4]
["2021-04-25",2021,4]
["2021-04-26",2021,4]
["2021-04-27",2021,4]
["2021-04-28",2021,4]
["2021-04-29",2021,4]
["2021-04-30",2021,4]
["2021-05-01",2021,5]
["2021-05-02",2021,5]
["2021-05-03",2021,5]
["2021-05-04",2021,5]
["2021-05-05",2021,5]
["2021-05-06",2021,5]
["2021-05-07",2021,5]
["2021-05-08",2021,5]
["2021-05-09",2021,5]
["2021-05-10",2021,5]
["2021-05-11",2021,5]
["2021-05-12",2021,5]
["2021-05-13",2021,5]
["2021-05-14",2021,5]
["2021-05-15",2021,5]
["2021-05-16",2021,5]
["2021-05-17",2021,5]
["2021-05-18",2021,5]
["2021-05-19",2021,5]
["2021-05-20",2021,5]
["2021-05-21",2021,5]
["2021-05-22",2021,5]
["2021-05-23",2021,5]
["2021-05-24",2021,5]
["2021-05-25",2021,5]
["2021-05-26",2021,5]
["2021-05-27",2021,5]
["2021-05-28",2021,5]
["2021-05-29",2021,5]
["2021-05-30",2021,5]
["2021-05-31",2021,5]
["2021-06-01",2021,6]
["2021-06-02",2021,6]
["2021-06-03",2021,6]
["2021-06-04",2021,6]
["2021-06-05",2021,6]
["2021-06-06",2021,6]
["2021-06-07",2021,6]
["2021-06-08",2021,6]
["2021-06-09",2021,6]
["2021-06-10",2021,6]
["2021-06-11",2021,6]
["2021-06-12",2021,6]
["2021-06-13",2021,6]
["2021-06-14",2021,6]
["2021-06-15",2021,6]
["2021-06-16",2021,6]
["2021-06-17",2021,6]
["2021-06-18",2021,6]
["2021-06-19",2021,6]
["2021-06-20",2021,6]
["2021-06-21",2021,6]
["2021-06-22",2021,6]
["2021-06-23",2021,6]
["2021-06-24",2021,6]
["2021-06-25",2021,6]
["2021-06-26",2021,6]
["2021-06-27",2021,6]
["2021-06-28",2021,6]
["2021-06-29",2021,6]
["2021-06-30",2021,6]
["2021-07-01",2021,7]
["2021-07-02",2021,7]
["2021-07-03",2021,7]
["2021-07-04",2021,7]
["2021-07-05",2021,7]
["2021-07-06",2021,7]
["2021-07-07",2021,7]
["2021-07-08",2021,7]
["2021-07-09",2021,7]
["2021-07-10",2021,7]
["2021-07-11",2021,7]
["2021-07-12",2021,7]
["2021-07-13",2021,7]
["2021-07-14",2021,7]
["2021-07-15",2021,7]
["2021-07-16",2021,7]
["2021-07-17",2021,7]
["2021-07-18",2021,7]
["2021-07-19",2021,7]
["2021-07-20",2021,7]
["2021-07-21",2021,7]
["2021-07-22",2021,7]
["2021-07-23",2021,7]
["2021-07-24",2021,7]
["2021-07-25",2021,7]
["2021-07-26",2021,7]
["2021-07-27",2021,7]
["2021-07-28",2021,7]
["2021-07-29",2021,7]
["2021-07-30",2021,7]
["2021-07-31",2021,7]
["2021-08-01",2021,8]
["2021-08-02",2021,8]
["2021-08-03",2021,8]
["2021-08-04",2021,8]
["2021-08-05",2021,8]
["2021-08-06",2021,8]
["2021-08-07",2021,8]
["2021-08-08",2021,8]
["2021-08-09",2021,8]
["2021-08-10",2021,8]
["2021-08-11",2021,8]
["2021-08-12",2021,8]
["2021-08-13",2021,8]
["2021-08-14",2021,8]
["2021-08-15",2021,8]
["2021-08-16",2021,8]
["2021-08-17",2021,8]
["2021-08-18",2021,8]
["2021-08-19",2021,8]
["2021-08-20",2021,8]
["2021-08-21",2021,8]
["2021-08-22",2021,8]
["2021-08-23",2021,8]
["2021-08-24",2021,8]
["2021-08-25",2021,8]
["2021-08-26",2021,8]
["2021-08-27",2021,8]
["2021-08-28",2021,8]
["2021-08-29",2021,8]
["2021-08-30",2021,8]
["2021-08-31",2021,8]
["2021-09-01",2021,9]
["2021-09-02",2021,9]
["2021-09-03",2021,9]
["2021-09-04",2021,9]
["2021-09-05",2021,9]
["2021-09-06",2021,9]
["2021-09-07",2021,9]
["2021-09-08",2021,9]
["2021-09-09",2021,9]
["2021-09-10",2021,9]
["2021-09-11",2021,9]
["2021-09-12",2021,9]
["2021-09-13",2021,9]
["2021-09-14",2021,9]
["2021-09-15",2021,9]
["2021-09-16",2021,9]
["2021-09-17",2021,9]
["2021-09-18",2021,9]
["2021-09-19",2021,9]
["2021-09-20",2021,9]
["2021-09-21",2021,9]
["2021-09-22",2021,9]
["2021-09-23",2021,9]
["2021-09-24",2021,9]
["2021-09-25",2021,9]
["2021-09-26",2021,9]
["2021-09-27",2021,9]
["2021-09-28",2021,9]
["2021-09-29",2021,9]
["2021-09-30",2021,9]
["2021-10-01",2021,10]
["2021-10-02",2021,10]
["2021-10-03",2021,10]
["2021-10-04",2021,10]
["2021-10-05",2021,10]
["2021-10-06",2021,10]
["2021-10-07",2021,10]
["2021-10-08",2021,10]
["2021-10-09",2021,10]
["2021-10-10",2021,10]
["2021-10-11",2021,10]
["2021-10-12",2021,10]
["2021-10-13",2021,10]
["2021-10-14",2021,10]
["2021-10-15",2021,10]
["2021-10-16",2021,10]
["2021-10-17",2021,10]
["2021-10-18",2021,10]
["2021-10-19",2021,10]
["2021-10-20",2021,10]
["2021-10-21",2021,10]
["2021-10-22",2021,10]
["2021-10-23",2021,10]
["2021-10-24",2021,10]
["2021-10-25",2021,10]
["2021-10-26",2021,10]
["2021-10-27",2021,10]
["2021-10-28",2021,10]
["2021-10-29",2021,10]
["2021-10-30",2021,10]
["2021-10-31",2021,10]
["2021-11-01",2021,11]
["2021-11-02",2021,11]
["2021-11-03",2021,11]
["2021-11-04",2021,11]
["2021-11-05",2021,11]
["2021-11-06",2021,11]
["2021-11-07",2021,11]
["2021-11-08",2021,11]
["2021-11-09",2021,11]
["2021-11-10",2021,11]
["2021-11-11",2021,11]
["2021-11-12",2021,11]
["2021-11-13",2021,11]
["2021-11-14",2021,11]
["2021-11-15",2021,11]
["2021-11-16",2021,11]
["2021-11-17",2021,11]
["2021-11-18",2021,11]
["2021-11-19",2021,11]
["2021-11-20",2021,11]
["2021-11-21",2021,11]
["2021-11-22",2021,11]
["2021-11-23",2021,11]
["2021-11-24",2021,11]
["2021-11-25",2021,11]
["2021-11-26",2021,11]
["2021-11-27",2021,11]
["2021-11-28",2021,11]
["2021-11-29",2021,11]
["2021-11-30",2021,11]
["2021-12-01",2021,12]
["2021-12-02",2021,12]
["2021-12-03",2021,12]
["2021-12-04",2021,12]
["2021-12-05",2021,12]
["2021-12-06",2021,12]
["2021-12-07",2021,12]
["2021-12-08",2021,12]
["2021-12-09",2021,12]
["2021-12-10",2021,12]
["2021-12-11",2021,12]
["2021-12-12",2021,12]
["2021-12-13",2021,12]
["2021-12-14",2021,12]
["2021-12-15",2021,12]
["2021-12-16",2021,12]
["2021-12-17",2021,12]
["2021-12-18",2021,12]
["2021-12-19",2021,12]
["2021-12-20",2021,12]
["2021-12-21",2021,12]
["2021-12-22",2021,12]
["2021-12-23",2021,12]
["2021-12-24",2021,12]
["2021-12-25",2021,12]
["2021-12-26",2021,12]
["2021-12-27",2021,12]
["2021-12-28",2021,12]
["2021-12-29",2021,12]
["2021-12-30",2021,12]
["2021-12-31",2021,12]
["2022-01-01",2022,1]
["2022-01-02",2022,1]
["2022-01-03",2022,1]
["2022-01-04",2022,1]
["2022-01-05",2022,1]
["2022-01-06",2022,1]
["2022-01-07",2022,1]
["2022-01-08",2022,1]
["2022-01-09",2022,1]
["2022-01-10",2022,1]
["2022-01-11",2022,1]
["2022-01-12",2022,1]
["2022-01-13",2022,1]
["2022-01-14",2022,1]
["2022-01-15",2022,1]
["2022-01-16",2022,1]
["2022-01-17",2022,1]
["2022-01-18",2022,1]
["2022-01-19",2022,1]
["2022-01-20",2022,1]
["2022-01-21",2022,1]
["2022-01-22",2022,1]
["2022-01-23",2022,1]
["2022-01-24",2022,1]
["2022-01-25",2022,1]
["2022-01-26",2022,1]
["2022-01-27",2022,1]
["2022-01-28",2022,1]
["2022-01-29",2022,1]
["2022-01-30",2022,1]
{"$rows_left_out":445}