{"text_format":"1","workbook":"xlsx","n_sheets":7,"sheets":["Base de Dados","Produtos","Gestão de Prazos","CARROS (JANEIRO 2021)","CARROS (FEVEREIRO 2021)","CARROS (MARÇO 2021)","CARROS (ABRIL 2021)"],"not_rendered":{"charts":0,"images":4,"macros":1,"external_links":0,"defined_names":12,"comments":0,"pivot_tables":0},"unopened":[],"bounds":{"document_bytes":16777216,"sheet_cells":100000,"rows_first":2000,"rows_last":500,"rows_between":2000,"halvings":0,"cell_chars":16384,"cell_head_chars":4096},"cells_cut":0,"cells_raw":0,"read":"whole","date_system":"1900"}

{"sheet":"Base de Dados","index":0,"n_rows":60,"n_cols":28,"rows_kept":60,"cut":false,"hidden":true,"merged":[]}
[null,null,null,null,null,null,null,null,null,null,null,null,null,null,null,null,null,null,null,null,null,null,null,null,null,null,null,"Pedido"]
[null,null,null,null,null,null,null,null,null,null,null,null,null,null,null,null,null,null,null,null,null,null,null,null,null,null,null,"Estoque"]
[]
[]
[null,"Cod. Prod.","Descrição","Ean","Dun","CO","Modelo","Peso"]
[null,33467,"EXEMPLO 1"]
[null,33468,"Exemplo 2"]
[null,33469,"EXEMPLO 3"]
[null,33470,"EXEMPLO 4"]
[null,33487,"EXEMPLO 5"]
[null,33488,"EXEMPLO 6"]
[null,33489,"EXEMPLO 7"]
[null,33490,"EXEMPLO 8"]
[null,33679,"EXEMPLO 9"]
[null,42367,"EXEMPLO 10"]
[null,42368,"EXEMPLO 11"]
[null,42369,"EXEMPLO 12"]
[null,20137,"EXEMPLO 13",null,null,null,null,3.5000000000000001E-3]
[null,27348,"EXEMPLO 14",null,null,null,null,3.3999999999999998E-3]
[null,27349,"EXEMPLO 15",null,null,null,null,3.3999999999999998E-3]
[null,31776,"EXEMPLO 16",null,null,null,null,3.5100000000000001E-3]
[null,33709,"EXEMPLO 17",null,null,null,null,3.5000000000000001E-3]
[null,33725,"EXEMPLO 18",null,null,null,null,3.5000000000000001E-3]
[null,38997,"EXEMPLO 19",null,null,null,null,3.3999999999999998E-3]
[null,38998,"EXEMPLO 20",null,null,null,null,3.3999999999999998E-3]
[null,39810,"EXEMPLO 21",null,null,null,null,3.5000000000000001E-3]
[null,39811,"EXEMPLO 22",null,null,null,null,3.5000000000000001E-3]
[null,39812,"EXEMPLO 23",null,null,null,null,3.5000000000000001E-3]
[null,39813,"EXEMPLO 24",null,null,null,null,3.5000000000000001E-3]
[null,39814,"EXEMPLO 25",null,null,null,null,3.5000000000000001E-3]
[null,39824,"EXEMPLO 26",null,null,null,null,3.5000000000000001E-3]
[null,42095,"EXEMPLO 27",null,null,null,null,3.5000000000000001E-3]
[null,42338,"EXEMPLO 28",null,null,null,null,3.5000000000000001E-3]
[null,42339,"EXEMPLO 29",null,null,null,null,3.5000000000000001E-3]
[null,42632,"EXEMPLO 30",null,null,null,null,3.5000000000000001E-3]
[null,7961,"EXEMPLO 31",null,null,null,null,4.4999999999999997E-3]
[null,12654,"EXEMPLO 32",null,null,null,null,4.4999999999999997E-3]
[null,33462,"EXEMPLO 33",null,null,null,null,4.4999999999999997E-3]
[null,36686,"EXEMPLO 34",null,null,null,null,4.4999999999999997E-3]
[null,36689,"EXEMPLO 35",null,null,null,null,7.0000000000000001E-3]
[null,36693,"EXEMPLO 36",null,null,null,null,4.4999999999999997E-3]
[null,37363,"EXEMPLO 37",null,null,null,null,4.5999999999999999E-3]
[null,39670,"EXEMPLO 38",null,null,null,null,0.01]
[null,42424,"EXEMPLO 39",null,null,null,null,4.4999999999999997E-3]
[null,42541,"EXEMPLO 40",null,null,null,null,4.4999999999999997E-3]
[null,18952,"EXEMPLO 41",null,null,null,null,"Pesar"]
[null,23293,"EXEMPLO 42",null,null,null,null,0.19500000000000001]
[null,33027,"EXEMPLO 43",null,null,null,null,0.18]
[null,38679,"EXEMPLO 44",null,null,null,null,0.18]
[null,39140,"EXEMPLO 45",null,null,null,null,0.26500000000000001]
[null,39141,"EXEMPLO 46",null,null,null,null,"Pesar"]
[null,39142,"EXEMPLO 47",null,null,null,null,0.112]
[null,39225,"EXEMPLO 48",null,null,null,null,0.17499999999999999]
[null,39227,"EXEMPLO 49",null,null,null,null,0.112]
[null,39228,"EXEMPLO 50",null,null,null,null,"Pesar"]
[null,39229,"EXEMPLO 51",null,null,null,null,0.112]
[null,39230,"EXEMPLO 52",null,null,null,null,0.19500000000000001]
[null,39231,"EXEMPLO 53",null,null,null,null,0.112]
[null,39232,"EXEMPLO 54",null,null,null,null,0.19500000000000001]
[null,39817,"EXEMPLO 55",null,null,null,null,3.5000000000000001E-3]

{"sheet":"Produtos","index":1,"n_rows":8,"n_cols":28,"rows_kept":8,"cut":false,"hidden":true,"merged":[]}
[null,null,null,null,null,null,null,null,null,null,null,null,null,null,null,null,null,null,null,null,null,null,null,null,null,null,null,"Pedido"]
[null,null,null,null,null,null,null,null,null,null,null,null,null,null,null,null,null,null,null,null,null,null,null,null,null,null,null,"Estoque"]
[]
[null,null,"Produtos"]
[null,null,"Papelaria e Outros"]
[null,null,"PDV"]
[null,null,"Envelopes"]
[null,null,"Agibank"]

{"sheet":"Gestão de Prazos","index":2,"n_rows":151,"n_cols":31,"rows_kept":151,"cut":false,"hidden":false,"merged":[]}
[null,null,null,null,null,null,null,null,null,null,null,null,null,null,null,null,null,null,null,null,null,null,null,null,null,null,null,null,"Pedido",null,"Aguardando Impressão"]
[null,null,null,null,null,null,null,null,null,null,null,null,null,null,null,null,null,null,null,null,null,null,null,null,null,null,null,null,"Estoque",null,"Imprimindo"]
[null,null,null,null,null,null,null,null,null,null,null,null,null,null,null,null,null,null,null,null,null,null,null,null,null,null,null,null,null,null,"Finalizado"]
[null,null,"* Pra ativar o filtro basta digitar a informação nas caixas de texto abaixo"]
[]
[]
[]
[]
[]
[]
[]
["Código",null,"OP","OC","Cód. Produto","Descrição","Modelo","Data do pedido","Tiragem","Qtd. Total do pedido","Quantidade no Pacote\n(Shirink)","Volume de Pacotes","Quantidade de und na caixa","Vol. de caixa","Local Entrega","Data de entrega","Insumos ok?","Status","Data negociada","Agendado","Peso Unit\n(Kg)","Peso Total (Kg)","Quantidade Entregue","Status2"]
[null,null,null,null,null,null,null,null,null,null,null,null,null,null,null,null,null,null,null,null,null,null,null,null,{"$f":"CONCATENATE(AA13,AB13,AC13,Z13)","v":""}]
[null,false,26066,219543,39811,{"$f":"IFERROR(VLOOKUP('Gestão de Prazos'!$E14,Tabela6[],2,0),\"Cadastrar produto na aba (Cadastro de Produtos)\")","v":"EXEMPLO 22"},{"$f":"IFERROR(VLOOKUP('Gestão de Prazos'!$E14,Tabela6[],6,0),\"Cadastrar\")","v":0},"2021-05-11",3996000,3996000,"-",{"$f":"IFERROR('Gestão de Prazos'!$J82/'Gestão de Prazos'!$K82,\"-\")","v":"-"},2000,{"$f":"ROUNDUP('Gestão de Prazos'!$J14/'Gestão de Prazos'!$M14,0)","v":1998},"RS","-",null,null,"-",null,{"$f":"VLOOKUP('Gestão de Prazos'!$E14,Tabela6[],7,0)","v":3.5000000000000001E-3},{"$f":"'Gestão de Prazos'!$U14*'Gestão de Prazos'!$J14","v":13986},null,null,{"$f":"CONCATENATE($C14,$D14,$E14,$B14)","v":"2606621954339811FALSO"}]
[null,false,26065,219544,39811,{"$f":"IFERROR(VLOOKUP('Gestão de Prazos'!$E15,Tabela6[],2,0),\"Cadastrar produto na aba (Cadastro de Produtos)\")","v":"EXEMPLO 22"},{"$f":"IFERROR(VLOOKUP('Gestão de Prazos'!$E15,Tabela6[],6,0),\"Cadastrar\")","v":0},"2021-05-11",2000000,2000000,"-",{"$f":"IFERROR('Gestão de Prazos'!$J81/'Gestão de Prazos'!$K81,\"-\")","v":"-"},2000,{"$f":"ROUNDUP('Gestão de Prazos'!$J15/'Gestão de Prazos'!$M15,0)","v":1000},"RS","2021-07-05",null,null,"2021-07-05",null,{"$f":"VLOOKUP('Gestão de Prazos'!$E15,Tabela6[],7,0)","v":3.5000000000000001E-3},{"$f":"'Gestão de Prazos'!$U15*'Gestão de Prazos'!$J15","v":7000},null,null,{"$f":"CONCATENATE($C15,$D15,$E15,$B15)","v":"2606521954439811FALSO"}]
[null,false,26060,219542,39810,{"$f":"IFERROR(VLOOKUP('Gestão de Prazos'!$E16,Tabela6[],2,0),\"Cadastrar produto na aba (Cadastro de Produtos)\")","v":"EXEMPLO 21"},{"$f":"IFERROR(VLOOKUP('Gestão de Prazos'!$E16,Tabela6[],6,0),\"Cadastrar\")","v":0},"2021-05-11",1962000,1962000,"-",{"$f":"IFERROR('Gestão de Prazos'!$J89/'Gestão de Prazos'!$K89,\"-\")","v":"-"},2000,{"$f":"ROUNDUP('Gestão de Prazos'!$J16/'Gestão de Prazos'!$M16,0)","v":981},"RS","2021-07-05",null,null,"2021-07-05",null,{"$f":"VLOOKUP('Gestão de Prazos'!$E16,Tabela6[],7,0)","v":3.5000000000000001E-3},{"$f":"'Gestão de Prazos'!$U16*'Gestão de Prazos'!$J16","v":6867},null,null,"2606021954239810FALSO"]
[null,false,26067,219546,42338,{"$f":"IFERROR(VLOOKUP('Gestão de Prazos'!$E17,Tabela6[],2,0),\"Cadastrar produto na aba (Cadastro de Produtos)\")","v":"EXEMPLO 28"},{"$f":"IFERROR(VLOOKUP('Gestão de Prazos'!$E17,Tabela6[],6,0),\"Cadastrar\")","v":0},"2021-05-11",250000,250000,250,{"$f":"IFERROR('Gestão de Prazos'!$J113/'Gestão de Prazos'!$K113,\"-\")","v":"-"},1000,{"$f":"ROUNDUP('Gestão de Prazos'!$J17/'Gestão de Prazos'!$M17,0)","v":250},"SP ","2021-07-05",null,null,"2021-07-05",null,{"$f":"VLOOKUP('Gestão de Prazos'!$E17,Tabela6[],7,0)","v":3.5000000000000001E-3},{"$f":"'Gestão de Prazos'!$U17*'Gestão de Prazos'!$J17","v":875},null,null,"2606721954642338FALSO"]
[null,false,26045,219109,39811,{"$f":"IFERROR(VLOOKUP('Gestão de Prazos'!$E18,Tabela6[],2,0),\"Cadastrar produto na aba (Cadastro de Produtos)\")","v":"EXEMPLO 22"},{"$f":"IFERROR(VLOOKUP('Gestão de Prazos'!$E18,Tabela6[],6,0),\"Cadastrar\")","v":0},"2021-05-07",3130000,3130000,"-",{"$f":"IFERROR('Gestão de Prazos'!$J78/'Gestão de Prazos'!$K78,\"-\")","v":"-"},2000,{"$f":"ROUNDUP('Gestão de Prazos'!$J18/'Gestão de Prazos'!$M18,0)","v":1565},"RS","2021-06-14",null,null,"2021-06-14",null,{"$f":"VLOOKUP('Gestão de Prazos'!$E18,Tabela6[],7,0)","v":3.5000000000000001E-3},{"$f":"'Gestão de Prazos'!$U18*'Gestão de Prazos'!$J18","v":10955},null,null,"2604521910939811FALSO"]
[null,false,26046,219108,39811,{"$f":"IFERROR(VLOOKUP('Gestão de Prazos'!$E19,Tabela6[],2,0),\"Cadastrar produto na aba (Cadastro de Produtos)\")","v":"EXEMPLO 22"},{"$f":"IFERROR(VLOOKUP('Gestão de Prazos'!$E19,Tabela6[],6,0),\"Cadastrar\")","v":0},"2021-05-07",540000,540000,"-",{"$f":"IFERROR('Gestão de Prazos'!$J79/'Gestão de Prazos'!$K79,\"-\")","v":6200},2000,{"$f":"ROUNDUP('Gestão de Prazos'!$J19/'Gestão de Prazos'!$M19,0)","v":270},"RS","2021-06-14",null,null,"2021-06-14",null,{"$f":"VLOOKUP('Gestão de Prazos'!$E19,Tabela6[],7,0)","v":3.5000000000000001E-3},{"$f":"'Gestão de Prazos'!$U19*'Gestão de Prazos'!$J19","v":1890},null,null,"2604621910839811FALSO"]
[null,false,26044,219106,39811,{"$f":"IFERROR(VLOOKUP('Gestão de Prazos'!$E20,Tabela6[],2,0),\"Cadastrar produto na aba (Cadastro de Produtos)\")","v":"EXEMPLO 22"},{"$f":"IFERROR(VLOOKUP('Gestão de Prazos'!$E20,Tabela6[],6,0),\"Cadastrar\")","v":0},"2021-05-07",326000,326000,"-",{"$f":"IFERROR('Gestão de Prazos'!$J80/'Gestão de Prazos'!$K80,\"-\")","v":"-"},2000,{"$f":"ROUNDUP('Gestão de Prazos'!$J20/'Gestão de Prazos'!$M20,0)","v":163},"RS","2021-06-14",null,null,"2021-06-14",null,{"$f":"VLOOKUP('Gestão de Prazos'!$E20,Tabela6[],7,0)","v":3.5000000000000001E-3},{"$f":"'Gestão de Prazos'!$U20*'Gestão de Prazos'!$J20","v":1141},null,null,"2604421910639811FALSO"]
[null,false,26041,219103,39812,{"$f":"IFERROR(VLOOKUP('Gestão de Prazos'!$E21,Tabela6[],2,0),\"Cadastrar produto na aba (Cadastro de Produtos)\")","v":"EXEMPLO 23"},{"$f":"IFERROR(VLOOKUP('Gestão de Prazos'!$E21,Tabela6[],6,0),\"Cadastrar\")","v":0},"2021-05-07",300000,300000,"-",{"$f":"IFERROR('Gestão de Prazos'!$J90/'Gestão de Prazos'!$K90,\"-\")","v":"-"},2000,{"$f":"ROUNDUP('Gestão de Prazos'!$J21/'Gestão de Prazos'!$M21,0)","v":150},"RS","2021-06-14",null,null,"2021-06-14",null,{"$f":"VLOOKUP('Gestão de Prazos'!$E21,Tabela6[],7,0)","v":3.5000000000000001E-3},{"$f":"'Gestão de Prazos'!$U21*'Gestão de Prazos'!$J21","v":1050},null,null,"2604121910339812FALSO"]
[null,false,26043,219104,39813,{"$f":"IFERROR(VLOOKUP('Gestão de Prazos'!$E22,Tabela6[],2,0),\"Cadastrar produto na aba (Cadastro de Produtos)\")","v":"EXEMPLO 24"},{"$f":"IFERROR(VLOOKUP('Gestão de Prazos'!$E22,Tabela6[],6,0),\"Cadastrar\")","v":0},"2021-05-11",600000,600000,"-",{"$f":"IFERROR('Gestão de Prazos'!$J121/'Gestão de Prazos'!$K121,\"-\")","v":"-"},2000,{"$f":"ROUNDUP('Gestão de Prazos'!$J22/'Gestão de Prazos'!$M22,0)","v":300},"RS","2021-06-14",null,null,"2021-06-14",null,{"$f":"VLOOKUP('Gestão de Prazos'!$E22,Tabela6[],7,0)","v":3.5000000000000001E-3},{"$f":"'Gestão de Prazos'!$U22*'Gestão de Prazos'!$J22","v":2100},null,null,"2604321910439813FALSO"]
[null,false,26034,219013,42338,{"$f":"IFERROR(VLOOKUP('Gestão de Prazos'!$E23,Tabela6[],2,0),\"Cadastrar produto na aba (Cadastro de Produtos)\")","v":"EXEMPLO 28"},{"$f":"IFERROR(VLOOKUP('Gestão de Prazos'!$E23,Tabela6[],6,0),\"Cadastrar\")","v":0},"2021-05-07",250000,250000,250,{"$f":"IFERROR('Gestão de Prazos'!$J111/'Gestão de Prazos'!$K111,\"-\")","v":"-"},1000,{"$f":"ROUNDUP('Gestão de Prazos'!$J23/'Gestão de Prazos'!$M23,0)","v":250},"SP ","2021-06-11",null,null,"2021-06-11",null,{"$f":"VLOOKUP('Gestão de Prazos'!$E23,Tabela6[],7,0)","v":3.5000000000000001E-3},{"$f":"'Gestão de Prazos'!$U23*'Gestão de Prazos'!$J23","v":875},null,null,"2603421901342338FALSO"]
[null,false,26033,219014,42338,{"$f":"IFERROR(VLOOKUP('Gestão de Prazos'!$E24,Tabela6[],2,0),\"Cadastrar produto na aba (Cadastro de Produtos)\")","v":"EXEMPLO 28"},{"$f":"IFERROR(VLOOKUP('Gestão de Prazos'!$E24,Tabela6[],6,0),\"Cadastrar\")","v":0},"2021-05-07",125000,125000,250,{"$f":"IFERROR('Gestão de Prazos'!$J112/'Gestão de Prazos'!$K112,\"-\")","v":"-"},1000,{"$f":"ROUNDUP('Gestão de Prazos'!$J24/'Gestão de Prazos'!$M24,0)","v":125},"SP ","2021-06-11",null,null,"2021-06-11",null,{"$f":"VLOOKUP('Gestão de Prazos'!$E24,Tabela6[],7,0)","v":3.5000000000000001E-3},{"$f":"'Gestão de Prazos'!$U24*'Gestão de Prazos'!$J24","v":437.5},null,null,"2603321901442338FALSO"]
[null,false,26033,219014,42339,{"$f":"IFERROR(VLOOKUP('Gestão de Prazos'!$E25,Tabela6[],2,0),\"Cadastrar produto na aba (Cadastro de Produtos)\")","v":"EXEMPLO 29"},{"$f":"IFERROR(VLOOKUP('Gestão de Prazos'!$E25,Tabela6[],6,0),\"Cadastrar\")","v":0},"2021-05-07",125000,125000,250,{"$f":"IFERROR('Gestão de Prazos'!$J118/'Gestão de Prazos'!$K118,\"-\")","v":"-"},1000,{"$f":"ROUNDUP('Gestão de Prazos'!$J25/'Gestão de Prazos'!$M25,0)","v":125},"SP ","2021-06-11",null,null,"2021-06-11",null,{"$f":"VLOOKUP('Gestão de Prazos'!$E25,Tabela6[],7,0)","v":3.5000000000000001E-3},{"$f":"'Gestão de Prazos'!$U25*'Gestão de Prazos'!$J25","v":437.5},null,null,"2603321901442339FALSO"]
[null,false,25826,216228,39811,{"$f":"IFERROR(VLOOKUP('Gestão de Prazos'!$E26,Tabela6[],2,0),\"Cadastrar produto na aba (Cadastro de Produtos)\")","v":"EXEMPLO 22"},{"$f":"IFERROR(VLOOKUP('Gestão de Prazos'!$E26,Tabela6[],6,0),\"Cadastrar\")","v":0},"2021-04-14",3000000,3000000,"-",{"$f":"IFERROR('Gestão de Prazos'!$J77/'Gestão de Prazos'!$K77,\"-\")","v":"-"},2000,{"$f":"ROUNDUP('Gestão de Prazos'!$J26/'Gestão de Prazos'!$M26,0)","v":1500},"RS","2021-06-04",null,null,"2021-06-04",null,{"$f":"VLOOKUP('Gestão de Prazos'!$E26,Tabela6[],7,0)","v":3.5000000000000001E-3},{"$f":"'Gestão de Prazos'!$U26*'Gestão de Prazos'!$J26","v":10500},null,null,"2582621622839811FALSO"]
[null,false,25824,216228,39810,{"$f":"IFERROR(VLOOKUP('Gestão de Prazos'!$E27,Tabela6[],2,0),\"Cadastrar produto na aba (Cadastro de Produtos)\")","v":"EXEMPLO 21"},{"$f":"IFERROR(VLOOKUP('Gestão de Prazos'!$E27,Tabela6[],6,0),\"Cadastrar\")","v":0},"2021-04-14",2000000,2000000,"-",{"$f":"IFERROR('Gestão de Prazos'!$J88/'Gestão de Prazos'!$K88,\"-\")","v":"-"},2000,{"$f":"ROUNDUP('Gestão de Prazos'!$J27/'Gestão de Prazos'!$M27,0)","v":1000},"RS","2021-06-04",null,null,"2021-06-04",null,{"$f":"VLOOKUP('Gestão de Prazos'!$E27,Tabela6[],7,0)","v":3.5000000000000001E-3},{"$f":"'Gestão de Prazos'!$U27*'Gestão de Prazos'!$J27","v":7000},null,null,"2582421622839810FALSO"]
[null,false,25820,216222,39810,{"$f":"IFERROR(VLOOKUP('Gestão de Prazos'!$E28,Tabela6[],2,0),\"Cadastrar produto na aba (Cadastro de Produtos)\")","v":"EXEMPLO 21"},{"$f":"IFERROR(VLOOKUP('Gestão de Prazos'!$E28,Tabela6[],6,0),\"Cadastrar\")","v":0},"2021-04-14",2064000,2064000,"-",{"$f":"IFERROR('Gestão de Prazos'!$J87/'Gestão de Prazos'!$K87,\"-\")","v":"-"},2000,{"$f":"ROUNDUP('Gestão de Prazos'!$J28/'Gestão de Prazos'!$M28,0)","v":1032},"RS","2021-05-17",null,null,"2021-05-17",null,{"$f":"VLOOKUP('Gestão de Prazos'!$E28,Tabela6[],7,0)","v":3.5000000000000001E-3},{"$f":"'Gestão de Prazos'!$U28*'Gestão de Prazos'!$J28","v":7224},null,null,"2582021622239810FALSO"]
[null,false,25238,210796,39227,{"$f":"IFERROR(VLOOKUP('Gestão de Prazos'!$E29,Tabela6[],2,0),\"Cadastrar produto na aba (Cadastro de Produtos)\")","v":"EXEMPLO 49"},{"$f":"IFERROR(VLOOKUP('Gestão de Prazos'!$E29,Tabela6[],6,0),\"Cadastrar\")","v":0},"2021-02-19",2000,2000,"-",{"$f":"IFERROR('Gestão de Prazos'!$J38/'Gestão de Prazos'!$K38,\"-\")","v":300},20,{"$f":"ROUNDUP('Gestão de Prazos'!$J29/'Gestão de Prazos'!$M29,0)","v":100},"RS","2021-05-15",null,null,"2021-05-15",null,{"$f":"VLOOKUP('Gestão de Prazos'!$E29,Tabela6[],7,0)","v":0.112},{"$f":"'Gestão de Prazos'!$U29*'Gestão de Prazos'!$J29","v":224},null,null,"2523821079639227FALSO"]
[null,false,25239,210796,39225,{"$f":"IFERROR(VLOOKUP('Gestão de Prazos'!$E30,Tabela6[],2,0),\"Cadastrar produto na aba (Cadastro de Produtos)\")","v":"EXEMPLO 48"},{"$f":"IFERROR(VLOOKUP('Gestão de Prazos'!$E30,Tabela6[],6,0),\"Cadastrar\")","v":0},"-",1000,1000,"-",{"$f":"IFERROR('Gestão de Prazos'!$J52/'Gestão de Prazos'!$K52,\"-\")","v":350},20,{"$f":"ROUNDUP('Gestão de Prazos'!$J30/'Gestão de Prazos'!$M30,0)","v":50},"RS","2021-05-15",null,null,"2021-05-15",null,{"$f":"VLOOKUP('Gestão de Prazos'!$E30,Tabela6[],7,0)","v":0.17499999999999999},{"$f":"'Gestão de Prazos'!$U30*'Gestão de Prazos'!$J30","v":175},null,null,"2523921079639225FALSO"]
[null,false,25828,216013,39231,{"$f":"IFERROR(VLOOKUP('Gestão de Prazos'!$E31,Tabela6[],2,0),\"Cadastrar produto na aba (Cadastro de Produtos)\")","v":"EXEMPLO 53"},{"$f":"IFERROR(VLOOKUP('Gestão de Prazos'!$E31,Tabela6[],6,0),\"Cadastrar\")","v":0},"2021-04-13",5490,5490,"-",{"$f":"IFERROR('Gestão de Prazos'!$J60/'Gestão de Prazos'!$K60,\"-\")","v":"-"},30,{"$f":"ROUNDUP('Gestão de Prazos'!$J31/'Gestão de Prazos'!$M31,0)","v":183},"SP","2021-05-14",null,null,"2021-05-14",null,{"$f":"VLOOKUP('Gestão de Prazos'!$E31,Tabela6[],7,0)","v":0.112},{"$f":"'Gestão de Prazos'!$U31*'Gestão de Prazos'!$J31","v":614.88},null,null,"2582821601339231FALSO"]
[null,false,25497,212735,39227,{"$f":"IFERROR(VLOOKUP('Gestão de Prazos'!$E32,Tabela6[],2,0),\"Cadastrar produto na aba (Cadastro de Produtos)\")","v":"EXEMPLO 49"},{"$f":"IFERROR(VLOOKUP('Gestão de Prazos'!$E32,Tabela6[],6,0),\"Cadastrar\")","v":0},"2021-03-11",7380,7380,"-",{"$f":"IFERROR('Gestão de Prazos'!$J39/'Gestão de Prazos'!$K39,\"-\")","v":500},20,{"$f":"ROUNDUP('Gestão de Prazos'!$J32/'Gestão de Prazos'!$M32,0)","v":369},"SP","2021-05-13",null,null,"2021-05-13",null,{"$f":"VLOOKUP('Gestão de Prazos'!$E32,Tabela6[],7,0)","v":0.112},{"$f":"'Gestão de Prazos'!$U32*'Gestão de Prazos'!$J32","v":826.56000000000006},null,null,"2549721273539227FALSO"]
[null,false,25496,212735,39225,{"$f":"IFERROR(VLOOKUP('Gestão de Prazos'!$E33,Tabela6[],2,0),\"Cadastrar produto na aba (Cadastro de Produtos)\")","v":"EXEMPLO 48"},{"$f":"IFERROR(VLOOKUP('Gestão de Prazos'!$E33,Tabela6[],6,0),\"Cadastrar\")","v":0},"2021-03-11",2280,2280,"-",{"$f":"IFERROR('Gestão de Prazos'!$J53/'Gestão de Prazos'!$K53,\"-\")","v":600},20,{"$f":"ROUNDUP('Gestão de Prazos'!$J33/'Gestão de Prazos'!$M33,0)","v":114},"SP ","2021-05-13",null,null,"2021-05-13",null,{"$f":"VLOOKUP('Gestão de Prazos'!$E33,Tabela6[],7,0)","v":0.17499999999999999},{"$f":"'Gestão de Prazos'!$U33*'Gestão de Prazos'!$J33","v":399},null,null,"2549621273539225FALSO"]
[null,false,25498,212735,39231,{"$f":"IFERROR(VLOOKUP('Gestão de Prazos'!$E34,Tabela6[],2,0),\"Cadastrar produto na aba (Cadastro de Produtos)\")","v":"EXEMPLO 53"},{"$f":"IFERROR(VLOOKUP('Gestão de Prazos'!$E34,Tabela6[],6,0),\"Cadastrar\")","v":0},"2021-03-11",1290,1290,"-",{"$f":"IFERROR('Gestão de Prazos'!$J59/'Gestão de Prazos'!$K59,\"-\")","v":"-"},30,{"$f":"ROUNDUP('Gestão de Prazos'!$J34/'Gestão de Prazos'!$M34,0)","v":43},"SP","2021-05-13",null,null,"2021-05-13",null,{"$f":"VLOOKUP('Gestão de Prazos'!$E34,Tabela6[],7,0)","v":0.112},{"$f":"'Gestão de Prazos'!$U34*'Gestão de Prazos'!$J34","v":144.47999999999999},null,null,"2549821273539231FALSO"]
[null,false,25150,210015,39225,{"$f":"IFERROR(VLOOKUP('Gestão de Prazos'!$E35,Tabela6[],2,0),\"Cadastrar produto na aba (Cadastro de Produtos)\")","v":"EXEMPLO 48"},{"$f":"IFERROR(VLOOKUP('Gestão de Prazos'!$E35,Tabela6[],6,0),\"Cadastrar\")","v":0},"2021-02-12",1400,1400,"-",{"$f":"IFERROR('Gestão de Prazos'!$J47/'Gestão de Prazos'!$K47,\"-\")","v":6000},20,{"$f":"ROUNDUP('Gestão de Prazos'!$J35/'Gestão de Prazos'!$M35,0)","v":70},"RS","2021-05-07",null,null,"2021-05-07",null,{"$f":"VLOOKUP('Gestão de Prazos'!$E35,Tabela6[],7,0)","v":0.17499999999999999},{"$f":"'Gestão de Prazos'!$U35*'Gestão de Prazos'!$J35","v":244.99999999999997},null,null,"2515021001539225FALSO"]
[null,false,25445,212457,39811,{"$f":"IFERROR(VLOOKUP('Gestão de Prazos'!$E36,Tabela6[],2,0),\"Cadastrar produto na aba (Cadastro de Produtos)\")","v":"EXEMPLO 22"},{"$f":"IFERROR(VLOOKUP('Gestão de Prazos'!$E36,Tabela6[],6,0),\"Cadastrar\")","v":0},"2021-03-10",5200000,5200000,"-",{"$f":"IFERROR('Gestão de Prazos'!$J76/'Gestão de Prazos'!$K76,\"-\")","v":"-"},2000,{"$f":"ROUNDUP('Gestão de Prazos'!$J36/'Gestão de Prazos'!$M36,0)","v":2600},"RS","2021-05-05",null,null,"2021-05-05",null,{"$f":"VLOOKUP('Gestão de Prazos'!$E36,Tabela6[],7,0)","v":3.5000000000000001E-3},{"$f":"'Gestão de Prazos'!$U36*'Gestão de Prazos'!$J36","v":18200},null,null,"2544521245739811FALSO"]
[null,false,25444,212457,39810,{"$f":"IFERROR(VLOOKUP('Gestão de Prazos'!$E37,Tabela6[],2,0),\"Cadastrar produto na aba (Cadastro de Produtos)\")","v":"EXEMPLO 21"},{"$f":"IFERROR(VLOOKUP('Gestão de Prazos'!$E37,Tabela6[],6,0),\"Cadastrar\")","v":0},"2021-03-10",1000000,1000000,"-",{"$f":"IFERROR('Gestão de Prazos'!$J85/'Gestão de Prazos'!$K85,\"-\")","v":"-"},2000,{"$f":"ROUNDUP('Gestão de Prazos'!$J37/'Gestão de Prazos'!$M37,0)","v":500},"RS","2021-05-05",null,null,"2021-05-05",null,{"$f":"VLOOKUP('Gestão de Prazos'!$E37,Tabela6[],7,0)","v":3.5000000000000001E-3},{"$f":"'Gestão de Prazos'!$U37*'Gestão de Prazos'!$J37","v":3500},null,null,"2544421245739810FALSO"]
[null,false,25429,212276,33470,{"$f":"IFERROR(VLOOKUP('Gestão de Prazos'!$E38,Tabela6[],2,0),\"Cadastrar produto na aba (Cadastro de Produtos)\")","v":"EXEMPLO 4"},{"$f":"IFERROR(VLOOKUP('Gestão de Prazos'!$E38,Tabela6[],6,0),\"Cadastrar\")","v":0},"2021-03-08",60000,60000,200,{"$f":"IFERROR('Gestão de Prazos'!$J126/'Gestão de Prazos'!$K126,\"-\")","v":"-"},5,{"$f":"ROUNDUP('Gestão de Prazos'!$J38/'Gestão de Prazos'!$M38,0)","v":12000},"RS","2021-05-05",null,null,"2021-05-05",null,{"$f":"VLOOKUP('Gestão de Prazos'!$E38,Tabela6[],7,0)","v":0},{"$f":"'Gestão de Prazos'!$U38*'Gestão de Prazos'!$J38","v":0},null,null,"2542921227633470FALSO"]
[null,false,26013,218466,42338,{"$f":"IFERROR(VLOOKUP('Gestão de Prazos'!$E39,Tabela6[],2,0),\"Cadastrar produto na aba (Cadastro de Produtos)\")","v":"EXEMPLO 28"},{"$f":"IFERROR(VLOOKUP('Gestão de Prazos'!$E39,Tabela6[],6,0),\"Cadastrar\")","v":0},"2021-05-04",125000,125000,250,{"$f":"IFERROR('Gestão de Prazos'!$J110/'Gestão de Prazos'!$K110,\"-\")","v":"-"},1000,{"$f":"ROUNDUP('Gestão de Prazos'!$J39/'Gestão de Prazos'!$M39,0)","v":125},"SP ","2021-05-04",null,null,"2021-05-04",null,{"$f":"VLOOKUP('Gestão de Prazos'!$E39,Tabela6[],7,0)","v":3.5000000000000001E-3},{"$f":"'Gestão de Prazos'!$U39*'Gestão de Prazos'!$J39","v":437.5},null,null,"2601321846642338FALSO"]
[null,false,25760,214310,39813,{"$f":"IFERROR(VLOOKUP('Gestão de Prazos'!$E40,Tabela6[],2,0),\"Cadastrar produto na aba (Cadastro de Produtos)\")","v":"EXEMPLO 24"},{"$f":"IFERROR(VLOOKUP('Gestão de Prazos'!$E40,Tabela6[],6,0),\"Cadastrar\")","v":0},null,160000,160000,"-",{"$f":"IFERROR('Gestão de Prazos'!$J120/'Gestão de Prazos'!$K120,\"-\")","v":"-"},2000,{"$f":"ROUNDUP('Gestão de Prazos'!$J40/'Gestão de Prazos'!$M40,0)","v":80},"RS","2021-05-03",null,null,"2021-05-03",null,{"$f":"VLOOKUP('Gestão de Prazos'!$E40,Tabela6[],7,0)","v":3.5000000000000001E-3},{"$f":"'Gestão de Prazos'!$U40*'Gestão de Prazos'!$J40","v":560},null,null,"2576021431039813FALSO"]
[null,false,25394,211730,33489,{"$f":"IFERROR(VLOOKUP('Gestão de Prazos'!$E41,Tabela6[],2,0),\"Cadastrar produto na aba (Cadastro de Produtos)\")","v":"EXEMPLO 7"},{"$f":"IFERROR(VLOOKUP('Gestão de Prazos'!$E41,Tabela6[],6,0),\"Cadastrar\")","v":0},"2021-03-04",50000,50000,200,{"$f":"IFERROR('Gestão de Prazos'!$J134/'Gestão de Prazos'!$K134,\"-\")","v":"-"},5,{"$f":"ROUNDUP('Gestão de Prazos'!$J41/'Gestão de Prazos'!$M41,0)","v":10000},"RS","2021-05-03",null,null,"2021-05-03",null,{"$f":"VLOOKUP('Gestão de Prazos'!$E41,Tabela6[],7,0)","v":0},{"$f":"'Gestão de Prazos'!$U41*'Gestão de Prazos'!$J41","v":0},null,null,"2539421173033489FALSO"]
[null,false,25392,211747,33490,{"$f":"IFERROR(VLOOKUP('Gestão de Prazos'!$E42,Tabela6[],2,0),\"Cadastrar produto na aba (Cadastro de Produtos)\")","v":"EXEMPLO 8"},{"$f":"IFERROR(VLOOKUP('Gestão de Prazos'!$E42,Tabela6[],6,0),\"Cadastrar\")","v":0},"2021-03-04",20000,20000,200,{"$f":"IFERROR('Gestão de Prazos'!$J138/'Gestão de Prazos'!$K138,\"-\")","v":200},5,{"$f":"ROUNDUP('Gestão de Prazos'!$J42/'Gestão de Prazos'!$M42,0)","v":4000},"RS","2021-05-03",null,null,"2021-05-03",null,{"$f":"VLOOKUP('Gestão de Prazos'!$E42,Tabela6[],7,0)","v":0},{"$f":"'Gestão de Prazos'!$U42*'Gestão de Prazos'!$J42","v":0},null,null,"2539221174733490FALSO"]
[null,false,25492,212752,39227,{"$f":"IFERROR(VLOOKUP('Gestão de Prazos'!$E43,Tabela6[],2,0),\"Cadastrar produto na aba (Cadastro de Produtos)\")","v":"EXEMPLO 49"},{"$f":"IFERROR(VLOOKUP('Gestão de Prazos'!$E43,Tabela6[],6,0),\"Cadastrar\")","v":0},"2021-03-11",7380,7380,"-",{"$f":"IFERROR('Gestão de Prazos'!$J41/'Gestão de Prazos'!$K41,\"-\")","v":250},20,{"$f":"ROUNDUP('Gestão de Prazos'!$J43/'Gestão de Prazos'!$M43,0)","v":369},"SP","2021-04-27",null,null,"2021-04-27",null,{"$f":"VLOOKUP('Gestão de Prazos'!$E43,Tabela6[],7,0)","v":0.112},{"$f":"'Gestão de Prazos'!$U43*'Gestão de Prazos'!$J43","v":826.56000000000006},null,null,"2549221275239227FALSO"]
[null,false,25153,209974,39227,{"$f":"IFERROR(VLOOKUP('Gestão de Prazos'!$E44,Tabela6[],2,0),\"Cadastrar produto na aba (Cadastro de Produtos)\")","v":"EXEMPLO 49"},{"$f":"IFERROR(VLOOKUP('Gestão de Prazos'!$E44,Tabela6[],6,0),\"Cadastrar\")","v":0},"2021-01-12",2000,2000,"-",{"$f":"IFERROR('Gestão de Prazos'!$J35/'Gestão de Prazos'!$K35,\"-\")","v":"-"},20,{"$f":"ROUNDUP('Gestão de Prazos'!$J44/'Gestão de Prazos'!$M44,0)","v":100},"RS","2021-04-20",null,null,"2021-04-20",null,{"$f":"VLOOKUP('Gestão de Prazos'!$E44,Tabela6[],7,0)","v":0.112},{"$f":"'Gestão de Prazos'!$U44*'Gestão de Prazos'!$J44","v":224},null,null,"2515320997439227FALSO"]
[null,false,25152,209974,39225,{"$f":"IFERROR(VLOOKUP('Gestão de Prazos'!$E45,Tabela6[],2,0),\"Cadastrar produto na aba (Cadastro de Produtos)\")","v":"EXEMPLO 48"},{"$f":"IFERROR(VLOOKUP('Gestão de Prazos'!$E45,Tabela6[],6,0),\"Cadastrar\")","v":0},"2021-02-12",1400,1400,"-",{"$f":"IFERROR('Gestão de Prazos'!$J48/'Gestão de Prazos'!$K48,\"-\")","v":10000},20,{"$f":"ROUNDUP('Gestão de Prazos'!$J45/'Gestão de Prazos'!$M45,0)","v":70},"RS","2021-04-20",null,null,"2021-04-20",null,{"$f":"VLOOKUP('Gestão de Prazos'!$E45,Tabela6[],7,0)","v":0.17499999999999999},{"$f":"'Gestão de Prazos'!$U45*'Gestão de Prazos'!$J45","v":244.99999999999997},null,null,"2515220997439225FALSO"]
[null,false,25237,210800,12654,{"$f":"IFERROR(VLOOKUP('Gestão de Prazos'!$E46,Tabela6[],2,0),\"Cadastrar produto na aba (Cadastro de Produtos)\")","v":"EXEMPLO 32"},{"$f":"IFERROR(VLOOKUP('Gestão de Prazos'!$E46,Tabela6[],6,0),\"Cadastrar\")","v":0},"2021-02-19",141000,141000,"-",{"$f":"IFERROR('Gestão de Prazos'!$J19/'Gestão de Prazos'!$K19,\"-\")","v":"-"},3000,{"$f":"ROUNDUP('Gestão de Prazos'!$J46/'Gestão de Prazos'!$M46,0)","v":47},"SP","2021-04-12",null,null,"2021-04-12",null,{"$f":"VLOOKUP('Gestão de Prazos'!$E46,Tabela6[],7,0)","v":4.4999999999999997E-3},{"$f":"'Gestão de Prazos'!$U46*'Gestão de Prazos'!$J46","v":634.5},null,null,"2523721080012654FALSO"]
[null,false,25581,212895,42424,{"$f":"IFERROR(VLOOKUP('Gestão de Prazos'!$E47,Tabela6[],2,0),\"Cadastrar produto na aba (Cadastro de Produtos)\")","v":"EXEMPLO 39"},{"$f":"IFERROR(VLOOKUP('Gestão de Prazos'!$E47,Tabela6[],6,0),\"Cadastrar\")","v":0},"2021-03-12",60000,60000,10,{"$f":"IFERROR('Gestão de Prazos'!$J23/'Gestão de Prazos'!$K23,\"-\")","v":1000},100,{"$f":"ROUNDUP('Gestão de Prazos'!$J47/'Gestão de Prazos'!$M47,0)","v":600},"SP","2021-04-12",null,null,"2021-04-12",null,{"$f":"VLOOKUP('Gestão de Prazos'!$E47,Tabela6[],7,0)","v":4.4999999999999997E-3},{"$f":"'Gestão de Prazos'!$U47*'Gestão de Prazos'!$J47","v":270},null,null,"2558121289542424FALSO"]
[null,false,25722,217468,42632,{"$f":"IFERROR(VLOOKUP('Gestão de Prazos'!$E48,Tabela6[],2,0),\"Cadastrar produto na aba (Cadastro de Produtos)\")","v":"EXEMPLO 30"},{"$f":"IFERROR(VLOOKUP('Gestão de Prazos'!$E48,Tabela6[],6,0),\"Cadastrar\")","v":0},"2021-03-12",50000,50000,5,{"$f":"IFERROR('Gestão de Prazos'!$J119/'Gestão de Prazos'!$K119,\"-\")","v":"-"},500,{"$f":"ROUNDUP('Gestão de Prazos'!$J48/'Gestão de Prazos'!$M48,0)","v":100},"SP ","2021-04-12",null,null,"2021-04-12",null,{"$f":"VLOOKUP('Gestão de Prazos'!$E48,Tabela6[],7,0)","v":3.5000000000000001E-3},{"$f":"'Gestão de Prazos'!$U48*'Gestão de Prazos'!$J48","v":175},null,null,"2572221746842632FALSO"]
[null,false,25491,212821,42338,{"$f":"IFERROR(VLOOKUP('Gestão de Prazos'!$E49,Tabela6[],2,0),\"Cadastrar produto na aba (Cadastro de Produtos)\")","v":"EXEMPLO 28"},{"$f":"IFERROR(VLOOKUP('Gestão de Prazos'!$E49,Tabela6[],6,0),\"Cadastrar\")","v":0},"2021-03-12",175000,175000,250,{"$f":"IFERROR('Gestão de Prazos'!$J109/'Gestão de Prazos'!$K109,\"-\")","v":"-"},1000,{"$f":"ROUNDUP('Gestão de Prazos'!$J49/'Gestão de Prazos'!$M49,0)","v":175},"SP ","2021-04-09",null,null,"2021-04-09",null,{"$f":"VLOOKUP('Gestão de Prazos'!$E49,Tabela6[],7,0)","v":3.5000000000000001E-3},{"$f":"'Gestão de Prazos'!$U49*'Gestão de Prazos'!$J49","v":612.5},null,null,"2549121282142338FALSO"]
[null,false,25488,212822,42339,{"$f":"IFERROR(VLOOKUP('Gestão de Prazos'!$E50,Tabela6[],2,0),\"Cadastrar produto na aba (Cadastro de Produtos)\")","v":"EXEMPLO 29"},{"$f":"IFERROR(VLOOKUP('Gestão de Prazos'!$E50,Tabela6[],6,0),\"Cadastrar\")","v":0},"2021-03-10",175000,175000,250,{"$f":"IFERROR('Gestão de Prazos'!$J117/'Gestão de Prazos'!$K117,\"-\")","v":350},1000,{"$f":"ROUNDUP('Gestão de Prazos'!$J50/'Gestão de Prazos'!$M50,0)","v":175},"SP ","2021-04-09",null,null,"2021-04-09",null,{"$f":"VLOOKUP('Gestão de Prazos'!$E50,Tabela6[],7,0)","v":3.5000000000000001E-3},{"$f":"'Gestão de Prazos'!$U50*'Gestão de Prazos'!$J50","v":612.5},null,null,"2548821282242339FALSO"]
[null,false,21408,212259,42369,{"$f":"IFERROR(VLOOKUP('Gestão de Prazos'!$E51,Tabela6[],2,0),\"Cadastrar produto na aba (Cadastro de Produtos)\")","v":"EXEMPLO 12"},{"$f":"IFERROR(VLOOKUP('Gestão de Prazos'!$E51,Tabela6[],6,0),\"Cadastrar\")","v":0},"2021-03-08",120000,120000,200,{"$f":"IFERROR('Gestão de Prazos'!$J141/'Gestão de Prazos'!$K141,\"-\")","v":"-"},5,{"$f":"ROUNDUP('Gestão de Prazos'!$J51/'Gestão de Prazos'!$M51,0)","v":24000},"RS","2021-04-09",null,null,"2021-04-09",null,{"$f":"VLOOKUP('Gestão de Prazos'!$E51,Tabela6[],7,0)","v":0},{"$f":"'Gestão de Prazos'!$U51*'Gestão de Prazos'!$J51","v":0},null,null,"2140821225942369FALSO"]
[null,false,25426,212387,42369,{"$f":"IFERROR(VLOOKUP('Gestão de Prazos'!$E52,Tabela6[],2,0),\"Cadastrar produto na aba (Cadastro de Produtos)\")","v":"EXEMPLO 12"},{"$f":"IFERROR(VLOOKUP('Gestão de Prazos'!$E52,Tabela6[],6,0),\"Cadastrar\")","v":0},"2021-03-09",70000,70000,200,{"$f":"IFERROR('Gestão de Prazos'!$J142/'Gestão de Prazos'!$K142,\"-\")","v":100},5,{"$f":"ROUNDUP('Gestão de Prazos'!$J52/'Gestão de Prazos'!$M52,0)","v":14000},"RS","2021-04-09",null,null,"2021-04-09",null,{"$f":"VLOOKUP('Gestão de Prazos'!$E52,Tabela6[],7,0)","v":0},{"$f":"'Gestão de Prazos'!$U52*'Gestão de Prazos'!$J52","v":0},null,null,"2542621238742369FALSO"]
[null,false,25408,212259,42369,{"$f":"IFERROR(VLOOKUP('Gestão de Prazos'!$E53,Tabela6[],2,0),\"Cadastrar produto na aba (Cadastro de Produtos)\")","v":"EXEMPLO 12"},{"$f":"IFERROR(VLOOKUP('Gestão de Prazos'!$E53,Tabela6[],6,0),\"Cadastrar\")","v":0},"2021-03-08",120000,120000,200,{"$f":"IFERROR('Gestão de Prazos'!$J143/'Gestão de Prazos'!$K143,\"-\")","v":"-"},5,{"$f":"ROUNDUP('Gestão de Prazos'!$J53/'Gestão de Prazos'!$M53,0)","v":24000},"RS","2021-04-09",null,null,"2021-04-09",null,{"$f":"VLOOKUP('Gestão de Prazos'!$E53,Tabela6[],7,0)","v":0},{"$f":"'Gestão de Prazos'!$U53*'Gestão de Prazos'!$J53","v":0},null,null,"2540821225942369FALSO"]
[null,false,25427,212248,42368,{"$f":"IFERROR(VLOOKUP('Gestão de Prazos'!$E54,Tabela6[],2,0),\"Cadastrar produto na aba (Cadastro de Produtos)\")","v":"EXEMPLO 11"},{"$f":"IFERROR(VLOOKUP('Gestão de Prazos'!$E54,Tabela6[],6,0),\"Cadastrar\")","v":0},"2021-03-08",100000,100000,200,{"$f":"IFERROR('Gestão de Prazos'!$J146/'Gestão de Prazos'!$K146,\"-\")","v":200},5,{"$f":"ROUNDUP('Gestão de Prazos'!$J54/'Gestão de Prazos'!$M54,0)","v":20000},"RS","2021-04-09",null,null,"2021-04-09",null,{"$f":"VLOOKUP('Gestão de Prazos'!$E54,Tabela6[],7,0)","v":0},{"$f":"'Gestão de Prazos'!$U54*'Gestão de Prazos'!$J54","v":0},null,null,"2542721224842368FALSO"]
[null,false,25481,212887,42368,{"$f":"IFERROR(VLOOKUP('Gestão de Prazos'!$E55,Tabela6[],2,0),\"Cadastrar produto na aba (Cadastro de Produtos)\")","v":"EXEMPLO 11"},{"$f":"IFERROR(VLOOKUP('Gestão de Prazos'!$E55,Tabela6[],6,0),\"Cadastrar\")","v":0},"2021-03-12",140000,140000,200,{"$f":"IFERROR('Gestão de Prazos'!$J147/'Gestão de Prazos'!$K147,\"-\")","v":400},5,{"$f":"ROUNDUP('Gestão de Prazos'!$J55/'Gestão de Prazos'!$M55,0)","v":28000},"RS","2021-04-09",null,null,"2021-04-09",null,{"$f":"VLOOKUP('Gestão de Prazos'!$E55,Tabela6[],7,0)","v":0},{"$f":"'Gestão de Prazos'!$U55*'Gestão de Prazos'!$J55","v":0},null,null,"2548121288742368FALSO"]
[null,false,25428,212270,42367,{"$f":"IFERROR(VLOOKUP('Gestão de Prazos'!$E56,Tabela6[],2,0),\"Cadastrar produto na aba (Cadastro de Produtos)\")","v":"EXEMPLO 10"},{"$f":"IFERROR(VLOOKUP('Gestão de Prazos'!$E56,Tabela6[],6,0),\"Cadastrar\")","v":0},"2021-03-08",90000,90000,200,{"$f":"IFERROR('Gestão de Prazos'!$J150/'Gestão de Prazos'!$K150,\"-\")","v":"-"},5,{"$f":"ROUNDUP('Gestão de Prazos'!$J56/'Gestão de Prazos'!$M56,0)","v":18000},"RS","2021-04-09",null,null,"2021-04-09",null,{"$f":"VLOOKUP('Gestão de Prazos'!$E56,Tabela6[],7,0)","v":0},{"$f":"'Gestão de Prazos'!$U56*'Gestão de Prazos'!$J56","v":0},null,null,"2542821227042367FALSO"]
[null,false,25480,212887,42367,{"$f":"IFERROR(VLOOKUP('Gestão de Prazos'!$E57,Tabela6[],2,0),\"Cadastrar produto na aba (Cadastro de Produtos)\")","v":"EXEMPLO 10"},{"$f":"IFERROR(VLOOKUP('Gestão de Prazos'!$E57,Tabela6[],6,0),\"Cadastrar\")","v":0},"2021-03-12",140000,140000,200,{"$f":"IFERROR('Gestão de Prazos'!$J151/'Gestão de Prazos'!$K151,\"-\")","v":"-"},5,{"$f":"ROUNDUP('Gestão de Prazos'!$J57/'Gestão de Prazos'!$M57,0)","v":28000},"RS","2021-04-09",null,null,"2021-04-09",null,{"$f":"VLOOKUP('Gestão de Prazos'!$E57,Tabela6[],7,0)","v":0},{"$f":"'Gestão de Prazos'!$U57*'Gestão de Prazos'!$J57","v":0},null,null,"2548021288742367FALSO"]
[null,false,25495,212742,39227,{"$f":"IFERROR(VLOOKUP('Gestão de Prazos'!$E58,Tabela6[],2,0),\"Cadastrar produto na aba (Cadastro de Produtos)\")","v":"EXEMPLO 49"},{"$f":"IFERROR(VLOOKUP('Gestão de Prazos'!$E58,Tabela6[],6,0),\"Cadastrar\")","v":0},"2021-03-11",7380,7380,"-",{"$f":"IFERROR('Gestão de Prazos'!$J40/'Gestão de Prazos'!$K40,\"-\")","v":"-"},20,{"$f":"ROUNDUP('Gestão de Prazos'!$J58/'Gestão de Prazos'!$M58,0)","v":369},"SP","2021-04-08",null,null,"2021-04-08",null,{"$f":"VLOOKUP('Gestão de Prazos'!$E58,Tabela6[],7,0)","v":0.112},{"$f":"'Gestão de Prazos'!$U58*'Gestão de Prazos'!$J58","v":826.56000000000006},null,null,"2549521274239227FALSO"]
[null,false,24950,208152,23293,{"$f":"IFERROR(VLOOKUP('Gestão de Prazos'!$E59,Tabela6[],2,0),\"Cadastrar produto na aba (Cadastro de Produtos)\")","v":"EXEMPLO 42"},{"$f":"IFERROR(VLOOKUP('Gestão de Prazos'!$E59,Tabela6[],6,0),\"Cadastrar\")","v":0},"2021-01-26",1500,1500,"-",{"$f":"IFERROR('Gestão de Prazos'!$J66/'Gestão de Prazos'!$K66,\"-\")","v":200},10,{"$f":"ROUNDUP('Gestão de Prazos'!$J59/'Gestão de Prazos'!$M59,0)","v":150},"RS","2021-04-08",null,null,"2021-04-08",null,{"$f":"VLOOKUP('Gestão de Prazos'!$E59,Tabela6[],7,0)","v":0.19500000000000001},{"$f":"'Gestão de Prazos'!$U59*'Gestão de Prazos'!$J59","v":292.5},null,null,"2495020815223293FALSO"]
[null,false,25443,212456,39810,{"$f":"IFERROR(VLOOKUP('Gestão de Prazos'!$E60,Tabela6[],2,0),\"Cadastrar produto na aba (Cadastro de Produtos)\")","v":"EXEMPLO 21"},{"$f":"IFERROR(VLOOKUP('Gestão de Prazos'!$E60,Tabela6[],6,0),\"Cadastrar\")","v":0},"2021-03-10",1200000,1200000,"-",{"$f":"IFERROR('Gestão de Prazos'!$J86/'Gestão de Prazos'!$K86,\"-\")","v":"-"},2000,{"$f":"ROUNDUP('Gestão de Prazos'!$J60/'Gestão de Prazos'!$M60,0)","v":600},"RS","2021-04-07",null,null,"2021-04-07",null,{"$f":"VLOOKUP('Gestão de Prazos'!$E60,Tabela6[],7,0)","v":3.5000000000000001E-3},{"$f":"'Gestão de Prazos'!$U60*'Gestão de Prazos'!$J60","v":4200},null,null,"2544321245639810FALSO"]
[null,false,25442,212455,39814,{"$f":"IFERROR(VLOOKUP('Gestão de Prazos'!$E61,Tabela6[],2,0),\"Cadastrar produto na aba (Cadastro de Produtos)\")","v":"EXEMPLO 25"},{"$f":"IFERROR(VLOOKUP('Gestão de Prazos'!$E61,Tabela6[],6,0),\"Cadastrar\")","v":0},"2021-03-10",600000,600000,"-",{"$f":"IFERROR('Gestão de Prazos'!$J93/'Gestão de Prazos'!$K93,\"-\")","v":400},1000,{"$f":"ROUNDUP('Gestão de Prazos'!$J61/'Gestão de Prazos'!$M61,0)","v":600},"RS","2021-04-07",null,null,"2021-04-07",null,{"$f":"VLOOKUP('Gestão de Prazos'!$E61,Tabela6[],7,0)","v":3.5000000000000001E-3},{"$f":"'Gestão de Prazos'!$U61*'Gestão de Prazos'!$J61","v":2100},null,null,"2544221245539814FALSO"]
[null,false,25154,209965,39225,{"$f":"IFERROR(VLOOKUP('Gestão de Prazos'!$E62,Tabela6[],2,0),\"Cadastrar produto na aba (Cadastro de Produtos)\")","v":"EXEMPLO 48"},{"$f":"IFERROR(VLOOKUP('Gestão de Prazos'!$E62,Tabela6[],6,0),\"Cadastrar\")","v":0},"2021-02-12",1480,1480,"-",{"$f":"IFERROR('Gestão de Prazos'!$J49/'Gestão de Prazos'!$K49,\"-\")","v":700},20,{"$f":"ROUNDUP('Gestão de Prazos'!$J62/'Gestão de Prazos'!$M62,0)","v":74},"RS","2021-04-06",null,null,"2021-04-06",null,{"$f":"VLOOKUP('Gestão de Prazos'!$E62,Tabela6[],7,0)","v":0.17499999999999999},{"$f":"'Gestão de Prazos'!$U62*'Gestão de Prazos'!$J62","v":259},null,null,"2515420996539225FALSO"]
[null,false,25352,211377,42338,{"$f":"IFERROR(VLOOKUP('Gestão de Prazos'!$E63,Tabela6[],2,0),\"Cadastrar produto na aba (Cadastro de Produtos)\")","v":"EXEMPLO 28"},{"$f":"IFERROR(VLOOKUP('Gestão de Prazos'!$E63,Tabela6[],6,0),\"Cadastrar\")","v":0},"2021-03-02",75000,75000,250,{"$f":"IFERROR('Gestão de Prazos'!$J108/'Gestão de Prazos'!$K108,\"-\")","v":"-"},1000,{"$f":"ROUNDUP('Gestão de Prazos'!$J63/'Gestão de Prazos'!$M63,0)","v":75},"SP ","2021-04-05",null,null,"2021-04-05",null,{"$f":"VLOOKUP('Gestão de Prazos'!$E63,Tabela6[],7,0)","v":3.5000000000000001E-3},{"$f":"'Gestão de Prazos'!$U63*'Gestão de Prazos'!$J63","v":262.5},null,null,"2535221137742338FALSO"]
[null,false,25350,211374,42339,{"$f":"IFERROR(VLOOKUP('Gestão de Prazos'!$E64,Tabela6[],2,0),\"Cadastrar produto na aba (Cadastro de Produtos)\")","v":"EXEMPLO 29"},{"$f":"IFERROR(VLOOKUP('Gestão de Prazos'!$E64,Tabela6[],6,0),\"Cadastrar\")","v":0},"2021-03-02",75000,75000,250,{"$f":"IFERROR('Gestão de Prazos'!$J116/'Gestão de Prazos'!$K116,\"-\")","v":200},1000,{"$f":"ROUNDUP('Gestão de Prazos'!$J64/'Gestão de Prazos'!$M64,0)","v":75},"SP ","2021-04-05",null,null,"2021-04-05",null,{"$f":"VLOOKUP('Gestão de Prazos'!$E64,Tabela6[],7,0)","v":3.5000000000000001E-3},{"$f":"'Gestão de Prazos'!$U64*'Gestão de Prazos'!$J64","v":262.5},null,null,"2535021137442339FALSO"]
[null,false,25147,210139,33470,{"$f":"IFERROR(VLOOKUP('Gestão de Prazos'!$E65,Tabela6[],2,0),\"Cadastrar produto na aba (Cadastro de Produtos)\")","v":"EXEMPLO 4"},{"$f":"IFERROR(VLOOKUP('Gestão de Prazos'!$E65,Tabela6[],6,0),\"Cadastrar\")","v":0},"2021-02-12",60000,60000,200,{"$f":"IFERROR('Gestão de Prazos'!$J125/'Gestão de Prazos'!$K125,\"-\")","v":150},5,{"$f":"ROUNDUP('Gestão de Prazos'!$J65/'Gestão de Prazos'!$M65,0)","v":12000},"RS","2021-04-05",null,null,"2021-04-05",null,{"$f":"VLOOKUP('Gestão de Prazos'!$E65,Tabela6[],7,0)","v":0},{"$f":"'Gestão de Prazos'!$U65*'Gestão de Prazos'!$J65","v":0},null,null,"2514721013933470FALSO"]
[null,false,25105,209679,33489,{"$f":"IFERROR(VLOOKUP('Gestão de Prazos'!$E66,Tabela6[],2,0),\"Cadastrar produto na aba (Cadastro de Produtos)\")","v":"EXEMPLO 7"},{"$f":"IFERROR(VLOOKUP('Gestão de Prazos'!$E66,Tabela6[],6,0),\"Cadastrar\")","v":0},"2021-02-08",40000,40000,200,{"$f":"IFERROR('Gestão de Prazos'!$J133/'Gestão de Prazos'!$K133,\"-\")","v":"-"},5,{"$f":"ROUNDUP('Gestão de Prazos'!$J66/'Gestão de Prazos'!$M66,0)","v":8000},"RS","2021-04-05",null,null,"2021-04-05",null,{"$f":"VLOOKUP('Gestão de Prazos'!$E66,Tabela6[],7,0)","v":0},{"$f":"'Gestão de Prazos'!$U66*'Gestão de Prazos'!$J66","v":0},null,null,"2510520967933489FALSO"]
[null,false,24951,208149,39227,{"$f":"IFERROR(VLOOKUP('Gestão de Prazos'!$E67,Tabela6[],2,0),\"Cadastrar produto na aba (Cadastro de Produtos)\")","v":"EXEMPLO 49"},{"$f":"IFERROR(VLOOKUP('Gestão de Prazos'!$E67,Tabela6[],6,0),\"Cadastrar\")","v":0},"2021-01-26",2000,2000,"-",{"$f":"IFERROR('Gestão de Prazos'!$J34/'Gestão de Prazos'!$K34,\"-\")","v":"-"},20,{"$f":"ROUNDUP('Gestão de Prazos'!$J67/'Gestão de Prazos'!$M67,0)","v":100},"RS","2021-03-26",null,null,"2021-03-26",null,{"$f":"VLOOKUP('Gestão de Prazos'!$E67,Tabela6[],7,0)","v":0.112},{"$f":"'Gestão de Prazos'!$U67*'Gestão de Prazos'!$J67","v":224},null,null,"2495120814939227FALSO"]
[null,false,25693,212736,7961,{"$f":"IFERROR(VLOOKUP('Gestão de Prazos'!$E68,Tabela6[],2,0),\"Cadastrar produto na aba (Cadastro de Produtos)\")","v":"EXEMPLO 31"},{"$f":"IFERROR(VLOOKUP('Gestão de Prazos'!$E68,Tabela6[],6,0),\"Cadastrar\")","v":0},"-",27000,27000,3000,{"$f":"IFERROR('Gestão de Prazos'!$J15/'Gestão de Prazos'!$K15,\"-\")","v":"-"},3000,{"$f":"ROUNDUP('Gestão de Prazos'!$J68/'Gestão de Prazos'!$M68,0)","v":9},"SP","2021-03-26",null,null,"2021-03-26",null,{"$f":"VLOOKUP('Gestão de Prazos'!$E68,Tabela6[],7,0)","v":4.4999999999999997E-3},{"$f":"'Gestão de Prazos'!$U68*'Gestão de Prazos'!$J68","v":121.49999999999999},null,null,"256932127367961FALSO"]
[null,false,25477,212736,39227,{"$f":"IFERROR(VLOOKUP('Gestão de Prazos'!$E69,Tabela6[],2,0),\"Cadastrar produto na aba (Cadastro de Produtos)\")","v":"EXEMPLO 49"},{"$f":"IFERROR(VLOOKUP('Gestão de Prazos'!$E69,Tabela6[],6,0),\"Cadastrar\")","v":0},"2021-03-11",6940,6940,"-",{"$f":"IFERROR('Gestão de Prazos'!$J42/'Gestão de Prazos'!$K42,\"-\")","v":100},20,{"$f":"ROUNDUP('Gestão de Prazos'!$J69/'Gestão de Prazos'!$M69,0)","v":347},"SP","2021-03-26",null,null,"2021-03-26",null,{"$f":"VLOOKUP('Gestão de Prazos'!$E69,Tabela6[],7,0)","v":0.112},{"$f":"'Gestão de Prazos'!$U69*'Gestão de Prazos'!$J69","v":777.28},null,null,"2547721273639227FALSO"]
[null,false,25202,210390,39227,{"$f":"IFERROR(VLOOKUP('Gestão de Prazos'!$E70,Tabela6[],2,0),\"Cadastrar produto na aba (Cadastro de Produtos)\")","v":"EXEMPLO 49"},{"$f":"IFERROR(VLOOKUP('Gestão de Prazos'!$E70,Tabela6[],6,0),\"Cadastrar\")","v":0},"2021-02-19",8000,8000,"-",{"$f":"IFERROR('Gestão de Prazos'!$J36/'Gestão de Prazos'!$K36,\"-\")","v":"-"},20,{"$f":"ROUNDUP('Gestão de Prazos'!$J70/'Gestão de Prazos'!$M70,0)","v":400},"SP","2021-03-25",null,null,"2021-03-25",null,{"$f":"VLOOKUP('Gestão de Prazos'!$E70,Tabela6[],7,0)","v":0.112},{"$f":"'Gestão de Prazos'!$U70*'Gestão de Prazos'!$J70","v":896},null,null,"2520221039039227FALSO"]
[null,false,25241,210777,39227,{"$f":"IFERROR(VLOOKUP('Gestão de Prazos'!$E71,Tabela6[],2,0),\"Cadastrar produto na aba (Cadastro de Produtos)\")","v":"EXEMPLO 49"},{"$f":"IFERROR(VLOOKUP('Gestão de Prazos'!$E71,Tabela6[],6,0),\"Cadastrar\")","v":0},"2021-02-19",6000,6000,"-",{"$f":"IFERROR('Gestão de Prazos'!$J37/'Gestão de Prazos'!$K37,\"-\")","v":"-"},20,{"$f":"ROUNDUP('Gestão de Prazos'!$J71/'Gestão de Prazos'!$M71,0)","v":300},"SP","2021-03-25",null,null,"2021-03-25",null,{"$f":"VLOOKUP('Gestão de Prazos'!$E71,Tabela6[],7,0)","v":0.112},{"$f":"'Gestão de Prazos'!$U71*'Gestão de Prazos'!$J71","v":672},null,null,"2524121077739227FALSO"]
[null,false,25201,210390,39225,{"$f":"IFERROR(VLOOKUP('Gestão de Prazos'!$E72,Tabela6[],2,0),\"Cadastrar produto na aba (Cadastro de Produtos)\")","v":"EXEMPLO 48"},{"$f":"IFERROR(VLOOKUP('Gestão de Prazos'!$E72,Tabela6[],6,0),\"Cadastrar\")","v":0},"-",4000,4000,"-",{"$f":"IFERROR('Gestão de Prazos'!$J50/'Gestão de Prazos'!$K50,\"-\")","v":700},20,{"$f":"ROUNDUP('Gestão de Prazos'!$J72/'Gestão de Prazos'!$M72,0)","v":200},"SP ","2021-03-25",null,null,"2021-03-25",null,{"$f":"VLOOKUP('Gestão de Prazos'!$E72,Tabela6[],7,0)","v":0.17499999999999999},{"$f":"'Gestão de Prazos'!$U72*'Gestão de Prazos'!$J72","v":700},null,null,"2520121039039225FALSO"]
[null,false,25240,210777,39225,{"$f":"IFERROR(VLOOKUP('Gestão de Prazos'!$E73,Tabela6[],2,0),\"Cadastrar produto na aba (Cadastro de Produtos)\")","v":"EXEMPLO 48"},{"$f":"IFERROR(VLOOKUP('Gestão de Prazos'!$E73,Tabela6[],6,0),\"Cadastrar\")","v":0},"-",2860,2860,"-",{"$f":"IFERROR('Gestão de Prazos'!$J51/'Gestão de Prazos'!$K51,\"-\")","v":600},20,{"$f":"ROUNDUP('Gestão de Prazos'!$J73/'Gestão de Prazos'!$M73,0)","v":143},"SP ","2021-03-25",null,null,"2021-03-25",null,{"$f":"VLOOKUP('Gestão de Prazos'!$E73,Tabela6[],7,0)","v":0.17499999999999999},{"$f":"'Gestão de Prazos'!$U73*'Gestão de Prazos'!$J73","v":500.49999999999994},null,null,"2524021077739225FALSO"]
[null,false,25351,211377,42338,{"$f":"IFERROR(VLOOKUP('Gestão de Prazos'!$E74,Tabela6[],2,0),\"Cadastrar produto na aba (Cadastro de Produtos)\")","v":"EXEMPLO 28"},{"$f":"IFERROR(VLOOKUP('Gestão de Prazos'!$E74,Tabela6[],6,0),\"Cadastrar\")","v":0},"2021-03-02",25000,25000,250,{"$f":"IFERROR('Gestão de Prazos'!$J107/'Gestão de Prazos'!$K107,\"-\")","v":"-"},1000,{"$f":"ROUNDUP('Gestão de Prazos'!$J74/'Gestão de Prazos'!$M74,0)","v":25},"SP ","2021-03-22",null,null,"2021-03-22",null,{"$f":"VLOOKUP('Gestão de Prazos'!$E74,Tabela6[],7,0)","v":3.5000000000000001E-3},{"$f":"'Gestão de Prazos'!$U74*'Gestão de Prazos'!$J74","v":87.5},null,null,"2535121137742338FALSO"]
[null,false,25349,211372,42339,{"$f":"IFERROR(VLOOKUP('Gestão de Prazos'!$E75,Tabela6[],2,0),\"Cadastrar produto na aba (Cadastro de Produtos)\")","v":"EXEMPLO 29"},{"$f":"IFERROR(VLOOKUP('Gestão de Prazos'!$E75,Tabela6[],6,0),\"Cadastrar\")","v":0},"2021-03-02",70250,70250,250,{"$f":"IFERROR('Gestão de Prazos'!$J115/'Gestão de Prazos'!$K115,\"-\")","v":400},1000,{"$f":"ROUNDUP('Gestão de Prazos'!$J75/'Gestão de Prazos'!$M75,0)","v":71},"SP ","2021-03-22",null,null,"2021-03-22",null,{"$f":"VLOOKUP('Gestão de Prazos'!$E75,Tabela6[],7,0)","v":3.5000000000000001E-3},{"$f":"'Gestão de Prazos'!$U75*'Gestão de Prazos'!$J75","v":245.875},null,null,"2534921137242339FALSO"]
[null,false,25204,210400,36689,{"$f":"IFERROR(VLOOKUP('Gestão de Prazos'!$E76,Tabela6[],2,0),\"Cadastrar produto na aba (Cadastro de Produtos)\")","v":"EXEMPLO 35"},{"$f":"IFERROR(VLOOKUP('Gestão de Prazos'!$E76,Tabela6[],6,0),\"Cadastrar\")","v":0},"2021-02-19",10000,10000,"-",{"$f":"IFERROR('Gestão de Prazos'!$J14/'Gestão de Prazos'!$K14,\"-\")","v":"-"},2000,{"$f":"ROUNDUP('Gestão de Prazos'!$J76/'Gestão de Prazos'!$M76,0)","v":5},"SP","2021-03-15",null,null,"2021-03-15",null,{"$f":"VLOOKUP('Gestão de Prazos'!$E76,Tabela6[],7,0)","v":7.0000000000000001E-3},{"$f":"'Gestão de Prazos'!$U76*'Gestão de Prazos'!$J76","v":70},null,null,"2520421040036689FALSO"]
[null,false,25203,210400,12654,{"$f":"IFERROR(VLOOKUP('Gestão de Prazos'!$E77,Tabela6[],2,0),\"Cadastrar produto na aba (Cadastro de Produtos)\")","v":"EXEMPLO 32"},{"$f":"IFERROR(VLOOKUP('Gestão de Prazos'!$E77,Tabela6[],6,0),\"Cadastrar\")","v":0},"2021-02-19",141000,141000,"-",{"$f":"IFERROR('Gestão de Prazos'!$J18/'Gestão de Prazos'!$K18,\"-\")","v":"-"},3000,{"$f":"ROUNDUP('Gestão de Prazos'!$J77/'Gestão de Prazos'!$M77,0)","v":47},"SP","2021-03-15",null,null,"2021-03-15",null,{"$f":"VLOOKUP('Gestão de Prazos'!$E77,Tabela6[],7,0)","v":4.4999999999999997E-3},{"$f":"'Gestão de Prazos'!$U77*'Gestão de Prazos'!$J77","v":634.5},null,null,"2520321040012654FALSO"]
[null,false,25205,210385,36693,{"$f":"IFERROR(VLOOKUP('Gestão de Prazos'!$E78,Tabela6[],2,0),\"Cadastrar produto na aba (Cadastro de Produtos)\")","v":"EXEMPLO 36"},{"$f":"IFERROR(VLOOKUP('Gestão de Prazos'!$E78,Tabela6[],6,0),\"Cadastrar\")","v":0},"2021-02-19",150000,150000,"-",{"$f":"IFERROR('Gestão de Prazos'!$J21/'Gestão de Prazos'!$K21,\"-\")","v":"-"},1500,{"$f":"ROUNDUP('Gestão de Prazos'!$J78/'Gestão de Prazos'!$M78,0)","v":100},"SP","2021-03-15",null,null,"2021-03-15",null,{"$f":"VLOOKUP('Gestão de Prazos'!$E78,Tabela6[],7,0)","v":4.4999999999999997E-3},{"$f":"'Gestão de Prazos'!$U78*'Gestão de Prazos'!$J78","v":675},null,null,"2520521038536693FALSO"]
[null,false,25148,209908,42541,{"$f":"IFERROR(VLOOKUP('Gestão de Prazos'!$E79,Tabela6[],2,0),\"Cadastrar produto na aba (Cadastro de Produtos)\")","v":"EXEMPLO 40"},{"$f":"IFERROR(VLOOKUP('Gestão de Prazos'!$E79,Tabela6[],6,0),\"Cadastrar\")","v":0},"2021-01-12",155000,155000,25,{"$f":"IFERROR('Gestão de Prazos'!$J22/'Gestão de Prazos'!$K22,\"-\")","v":"-"},40,{"$f":"ROUNDUP('Gestão de Prazos'!$J79/'Gestão de Prazos'!$M79,0)","v":3875},"SP","2021-03-15",null,null,"2021-03-15",null,{"$f":"VLOOKUP('Gestão de Prazos'!$E79,Tabela6[],7,0)","v":4.4999999999999997E-3},{"$f":"'Gestão de Prazos'!$U79*'Gestão de Prazos'!$J79","v":697.5},null,null,{"$f":"CONCATENATE($C79,$D79,$E79,$B79)","v":"2514820990842541FALSO"}]
[null,false,24764,206089,39227,{"$f":"IFERROR(VLOOKUP('Gestão de Prazos'!$E80,Tabela6[],2,0),\"Cadastrar produto na aba (Cadastro de Produtos)\")","v":"EXEMPLO 49"},{"$f":"IFERROR(VLOOKUP('Gestão de Prazos'!$E80,Tabela6[],6,0),\"Cadastrar\")","v":0},"1909-11-08",3600,3600,"-",{"$f":"IFERROR('Gestão de Prazos'!$J32/'Gestão de Prazos'!$K32,\"-\")","v":"-"},20,{"$f":"ROUNDUP('Gestão de Prazos'!$J80/'Gestão de Prazos'!$M80,0)","v":180},"SP","2021-03-15",null,null,"2021-03-15",null,{"$f":"VLOOKUP('Gestão de Prazos'!$E80,Tabela6[],7,0)","v":0.112},{"$f":"'Gestão de Prazos'!$U80*'Gestão de Prazos'!$J80","v":403.2},null,null,"2476420608939227FALSO"]
[null,false,24765,206103,39227,{"$f":"IFERROR(VLOOKUP('Gestão de Prazos'!$E81,Tabela6[],2,0),\"Cadastrar produto na aba (Cadastro de Produtos)\")","v":"EXEMPLO 49"},{"$f":"IFERROR(VLOOKUP('Gestão de Prazos'!$E81,Tabela6[],6,0),\"Cadastrar\")","v":0},"2021-01-06",2000,2000,"-",{"$f":"IFERROR('Gestão de Prazos'!$J33/'Gestão de Prazos'!$K33,\"-\")","v":"-"},20,{"$f":"ROUNDUP('Gestão de Prazos'!$J81/'Gestão de Prazos'!$M81,0)","v":100},"SP","2021-03-15",null,null,"2021-03-15",null,{"$f":"VLOOKUP('Gestão de Prazos'!$E81,Tabela6[],7,0)","v":0.112},{"$f":"'Gestão de Prazos'!$U81*'Gestão de Prazos'!$J81","v":224},null,null,"2476520610339227FALSO"]
[null,false,24767,206089,39142,{"$f":"IFERROR(VLOOKUP('Gestão de Prazos'!$E82,Tabela6[],2,0),\"Cadastrar produto na aba (Cadastro de Produtos)\")","v":"EXEMPLO 47"},{"$f":"IFERROR(VLOOKUP('Gestão de Prazos'!$E82,Tabela6[],6,0),\"Cadastrar\")","v":0},"2021-01-06",1880,1880,"-",{"$f":"IFERROR('Gestão de Prazos'!$J43/'Gestão de Prazos'!$K43,\"-\")","v":"-"},20,{"$f":"ROUNDUP('Gestão de Prazos'!$J82/'Gestão de Prazos'!$M82,0)","v":94},"SP","2021-03-15",null,null,"2021-03-15",null,{"$f":"VLOOKUP('Gestão de Prazos'!$E82,Tabela6[],7,0)","v":0.112},{"$f":"'Gestão de Prazos'!$U82*'Gestão de Prazos'!$J82","v":210.56},null,null,"2476720608939142FALSO"]
[null,false,25310,209452,39142,{"$f":"IFERROR(VLOOKUP('Gestão de Prazos'!$E83,Tabela6[],2,0),\"Cadastrar produto na aba (Cadastro de Produtos)\")","v":"EXEMPLO 47"},{"$f":"IFERROR(VLOOKUP('Gestão de Prazos'!$E83,Tabela6[],6,0),\"Cadastrar\")","v":0},"2021-02-08",8600,8600,"-",{"$f":"IFERROR('Gestão de Prazos'!$J44/'Gestão de Prazos'!$K44,\"-\")","v":"-"},20,{"$f":"ROUNDUP('Gestão de Prazos'!$J83/'Gestão de Prazos'!$M83,0)","v":430},"SP","2021-03-15",null,null,"2021-03-15",null,{"$f":"VLOOKUP('Gestão de Prazos'!$E83,Tabela6[],7,0)","v":0.112},{"$f":"'Gestão de Prazos'!$U83*'Gestão de Prazos'!$J83","v":963.2},null,null,"2531020945239142FALSO"]
[null,false,25378,210390,39231,{"$f":"IFERROR(VLOOKUP('Gestão de Prazos'!$E84,Tabela6[],2,0),\"Cadastrar produto na aba (Cadastro de Produtos)\")","v":"EXEMPLO 53"},{"$f":"IFERROR(VLOOKUP('Gestão de Prazos'!$E84,Tabela6[],6,0),\"Cadastrar\")","v":0},"-",3000,3000,"-",{"$f":"IFERROR('Gestão de Prazos'!$J55/'Gestão de Prazos'!$K55,\"-\")","v":700},30,{"$f":"ROUNDUP('Gestão de Prazos'!$J84/'Gestão de Prazos'!$M84,0)","v":100},"SP","2021-03-15",null,null,"2021-03-15",null,{"$f":"VLOOKUP('Gestão de Prazos'!$E84,Tabela6[],7,0)","v":0.112},{"$f":"'Gestão de Prazos'!$U84*'Gestão de Prazos'!$J84","v":336},null,null,"2537821039039231FALSO"]
[null,false,25380,210400,39231,{"$f":"IFERROR(VLOOKUP('Gestão de Prazos'!$E85,Tabela6[],2,0),\"Cadastrar produto na aba (Cadastro de Produtos)\")","v":"EXEMPLO 53"},{"$f":"IFERROR(VLOOKUP('Gestão de Prazos'!$E85,Tabela6[],6,0),\"Cadastrar\")","v":0},"-",600,600,"-",{"$f":"IFERROR('Gestão de Prazos'!$J56/'Gestão de Prazos'!$K56,\"-\")","v":450},30,{"$f":"ROUNDUP('Gestão de Prazos'!$J85/'Gestão de Prazos'!$M85,0)","v":20},"SP","2021-03-15",null,null,"2021-03-15",null,{"$f":"VLOOKUP('Gestão de Prazos'!$E85,Tabela6[],7,0)","v":0.112},{"$f":"'Gestão de Prazos'!$U85*'Gestão de Prazos'!$J85","v":67.2},null,null,"2538021040039231FALSO"]
[null,false,25381,210772,39231,{"$f":"IFERROR(VLOOKUP('Gestão de Prazos'!$E86,Tabela6[],2,0),\"Cadastrar produto na aba (Cadastro de Produtos)\")","v":"EXEMPLO 53"},{"$f":"IFERROR(VLOOKUP('Gestão de Prazos'!$E86,Tabela6[],6,0),\"Cadastrar\")","v":0},"-",750,750,"-",{"$f":"IFERROR('Gestão de Prazos'!$J57/'Gestão de Prazos'!$K57,\"-\")","v":700},30,{"$f":"ROUNDUP('Gestão de Prazos'!$J86/'Gestão de Prazos'!$M86,0)","v":25},"RS","2021-03-15",null,null,"2021-03-15",null,{"$f":"VLOOKUP('Gestão de Prazos'!$E86,Tabela6[],7,0)","v":0.112},{"$f":"'Gestão de Prazos'!$U86*'Gestão de Prazos'!$J86","v":84},null,null,"2538121077239231FALSO"]
[null,false,24768,206103,39140,{"$f":"IFERROR(VLOOKUP('Gestão de Prazos'!$E87,Tabela6[],2,0),\"Cadastrar produto na aba (Cadastro de Produtos)\")","v":"EXEMPLO 45"},{"$f":"IFERROR(VLOOKUP('Gestão de Prazos'!$E87,Tabela6[],6,0),\"Cadastrar\")","v":0},"2021-01-06",20000,20000,"-",{"$f":"IFERROR('Gestão de Prazos'!$J61/'Gestão de Prazos'!$K61,\"-\")","v":"-"},20,{"$f":"ROUNDUP('Gestão de Prazos'!$J87/'Gestão de Prazos'!$M87,0)","v":1000},"SP","2021-03-15",null,null,"2021-03-15",null,{"$f":"VLOOKUP('Gestão de Prazos'!$E87,Tabela6[],7,0)","v":0.26500000000000001},{"$f":"'Gestão de Prazos'!$U87*'Gestão de Prazos'!$J87","v":5300},null,null,"2476820610339140FALSO"]
[null,false,25311,209452,39141,{"$f":"IFERROR(VLOOKUP('Gestão de Prazos'!$E88,Tabela6[],2,0),\"Cadastrar produto na aba (Cadastro de Produtos)\")","v":"EXEMPLO 46"},{"$f":"IFERROR(VLOOKUP('Gestão de Prazos'!$E88,Tabela6[],6,0),\"Cadastrar\")","v":0},"2021-02-08",1000,1000,"-",{"$f":"IFERROR('Gestão de Prazos'!$J62/'Gestão de Prazos'!$K62,\"-\")","v":"-"},20,{"$f":"ROUNDUP('Gestão de Prazos'!$J88/'Gestão de Prazos'!$M88,0)","v":50},"SP","2021-03-15",null,null,"2021-03-15",null,{"$f":"VLOOKUP('Gestão de Prazos'!$E88,Tabela6[],7,0)","v":"Pesar"},{"$f":"'Gestão de Prazos'!$U88*'Gestão de Prazos'!$J88","v":{"$error":"#VALUE!"}},null,null,"2531120945239141FALSO"]
[null,false,24458,204412,36686,{"$f":"IFERROR(VLOOKUP('Gestão de Prazos'!$E89,Tabela6[],2,0),\"Cadastrar produto na aba (Cadastro de Produtos)\")","v":"EXEMPLO 34"},{"$f":"IFERROR(VLOOKUP('Gestão de Prazos'!$E89,Tabela6[],6,0),\"Cadastrar\")","v":0},"2020-12-16",100000,100000,"-",{"$f":"IFERROR('Gestão de Prazos'!$J20/'Gestão de Prazos'!$K20,\"-\")","v":"-"},2000,{"$f":"ROUNDUP('Gestão de Prazos'!$J89/'Gestão de Prazos'!$M89,0)","v":50},"RS","2021-03-10",null,null,"2021-03-10",null,{"$f":"VLOOKUP('Gestão de Prazos'!$E89,Tabela6[],7,0)","v":4.4999999999999997E-3},{"$f":"'Gestão de Prazos'!$U89*'Gestão de Prazos'!$J89","v":449.99999999999994},null,null,"2445820441236686FALSO"]
[null,false,24457,204412,23293,{"$f":"IFERROR(VLOOKUP('Gestão de Prazos'!$E90,Tabela6[],2,0),\"Cadastrar produto na aba (Cadastro de Produtos)\")","v":"EXEMPLO 42"},{"$f":"IFERROR(VLOOKUP('Gestão de Prazos'!$E90,Tabela6[],6,0),\"Cadastrar\")","v":0},"2020-12-16",1220,1220,"-",{"$f":"IFERROR('Gestão de Prazos'!$J65/'Gestão de Prazos'!$K65,\"-\")","v":300},10,{"$f":"ROUNDUP('Gestão de Prazos'!$J90/'Gestão de Prazos'!$M90,0)","v":122},"RS","2021-03-10",null,null,"2021-03-10",null,{"$f":"VLOOKUP('Gestão de Prazos'!$E90,Tabela6[],7,0)","v":0.19500000000000001},{"$f":"'Gestão de Prazos'!$U90*'Gestão de Prazos'!$J90","v":237.9},null,null,"2445720441223293FALSO"]
[null,false,25149,209993,42367,{"$f":"IFERROR(VLOOKUP('Gestão de Prazos'!$E91,Tabela6[],2,0),\"Cadastrar produto na aba (Cadastro de Produtos)\")","v":"EXEMPLO 10"},{"$f":"IFERROR(VLOOKUP('Gestão de Prazos'!$E91,Tabela6[],6,0),\"Cadastrar\")","v":0},"2021-01-12",30000,30000,200,{"$f":"IFERROR('Gestão de Prazos'!$J149/'Gestão de Prazos'!$K149,\"-\")","v":"-"},5,{"$f":"ROUNDUP('Gestão de Prazos'!$J91/'Gestão de Prazos'!$M91,0)","v":6000},"RS","2021-03-08",null,null,"2021-03-08",null,{"$f":"VLOOKUP('Gestão de Prazos'!$E91,Tabela6[],7,0)","v":0},{"$f":"'Gestão de Prazos'!$U91*'Gestão de Prazos'!$J91","v":0},null,null,"2514920999342367FALSO"]
[null,false,24706,206230,33470,{"$f":"IFERROR(VLOOKUP('Gestão de Prazos'!$E92,Tabela6[],2,0),\"Cadastrar produto na aba (Cadastro de Produtos)\")","v":"EXEMPLO 4"},{"$f":"IFERROR(VLOOKUP('Gestão de Prazos'!$E92,Tabela6[],6,0),\"Cadastrar\")","v":0},"2021-01-06",70000,70000,200,{"$f":"IFERROR('Gestão de Prazos'!$J124/'Gestão de Prazos'!$K124,\"-\")","v":400},5,{"$f":"ROUNDUP('Gestão de Prazos'!$J92/'Gestão de Prazos'!$M92,0)","v":14000},"RS","2021-03-05",null,null,"2021-03-05",null,{"$f":"VLOOKUP('Gestão de Prazos'!$E92,Tabela6[],7,0)","v":0},{"$f":"'Gestão de Prazos'!$U92*'Gestão de Prazos'!$J92","v":0},null,null,"2470620623033470FALSO"]
[null,false,24708,206338,33487,{"$f":"IFERROR(VLOOKUP('Gestão de Prazos'!$E93,Tabela6[],2,0),\"Cadastrar produto na aba (Cadastro de Produtos)\")","v":"EXEMPLO 5"},{"$f":"IFERROR(VLOOKUP('Gestão de Prazos'!$E93,Tabela6[],6,0),\"Cadastrar\")","v":0},"2021-01-06",80000,80000,200,{"$f":"IFERROR('Gestão de Prazos'!$J129/'Gestão de Prazos'!$K129,\"-\")","v":"-"},5,{"$f":"ROUNDUP('Gestão de Prazos'!$J93/'Gestão de Prazos'!$M93,0)","v":16000},"RS","2021-03-05",null,null,"2021-03-05",null,{"$f":"VLOOKUP('Gestão de Prazos'!$E93,Tabela6[],7,0)","v":0},{"$f":"'Gestão de Prazos'!$U93*'Gestão de Prazos'!$J93","v":0},null,null,"2470820633833487FALSO"]
[null,false,24709,206292,33489,{"$f":"IFERROR(VLOOKUP('Gestão de Prazos'!$E94,Tabela6[],2,0),\"Cadastrar produto na aba (Cadastro de Produtos)\")","v":"EXEMPLO 7"},{"$f":"IFERROR(VLOOKUP('Gestão de Prazos'!$E94,Tabela6[],6,0),\"Cadastrar\")","v":0},"2021-01-06",40000,40000,200,{"$f":"IFERROR('Gestão de Prazos'!$J132/'Gestão de Prazos'!$K132,\"-\")","v":"-"},5,{"$f":"ROUNDUP('Gestão de Prazos'!$J94/'Gestão de Prazos'!$M94,0)","v":8000},"RS","2021-03-05",null,null,"2021-03-05",null,{"$f":"VLOOKUP('Gestão de Prazos'!$E94,Tabela6[],7,0)","v":0},{"$f":"'Gestão de Prazos'!$U94*'Gestão de Prazos'!$J94","v":0},null,null,"2470920629233489FALSO"]
[null,false,24707,206258,33468,{"$f":"IFERROR(VLOOKUP('Gestão de Prazos'!$E95,Tabela6[],2,0),\"Cadastrar produto na aba (Cadastro de Produtos)\")","v":"Exemplo 2"},{"$f":"IFERROR(VLOOKUP('Gestão de Prazos'!$E95,Tabela6[],6,0),\"Cadastrar\")","v":0},"2021-01-06",70000,70000,200,{"$f":"IFERROR('Gestão de Prazos'!$J137/'Gestão de Prazos'!$K137,\"-\")","v":"-"},5,{"$f":"ROUNDUP('Gestão de Prazos'!$J95/'Gestão de Prazos'!$M95,0)","v":14000},"RS","2021-03-05",null,null,"2021-03-05",null,{"$f":"VLOOKUP('Gestão de Prazos'!$E95,Tabela6[],7,0)","v":0},{"$f":"'Gestão de Prazos'!$U95*'Gestão de Prazos'!$J95","v":0},null,null,"2470720625833468FALSO"]
[null,false,24716,206333,42369,{"$f":"IFERROR(VLOOKUP('Gestão de Prazos'!$E96,Tabela6[],2,0),\"Cadastrar produto na aba (Cadastro de Produtos)\")","v":"EXEMPLO 12"},{"$f":"IFERROR(VLOOKUP('Gestão de Prazos'!$E96,Tabela6[],6,0),\"Cadastrar\")","v":0},"2021-01-06",20000,20000,200,{"$f":"IFERROR('Gestão de Prazos'!$J140/'Gestão de Prazos'!$K140,\"-\")","v":"-"},5,{"$f":"ROUNDUP('Gestão de Prazos'!$J96/'Gestão de Prazos'!$M96,0)","v":4000},"RS","2021-03-05",null,null,"2021-03-05",null,{"$f":"VLOOKUP('Gestão de Prazos'!$E96,Tabela6[],7,0)","v":0},{"$f":"'Gestão de Prazos'!$U96*'Gestão de Prazos'!$J96","v":0},null,null,"2471620633342369FALSO"]
[null,false,24715,206333,42368,{"$f":"IFERROR(VLOOKUP('Gestão de Prazos'!$E97,Tabela6[],2,0),\"Cadastrar produto na aba (Cadastro de Produtos)\")","v":"EXEMPLO 11"},{"$f":"IFERROR(VLOOKUP('Gestão de Prazos'!$E97,Tabela6[],6,0),\"Cadastrar\")","v":0},"2021-01-06",20000,20000,200,{"$f":"IFERROR('Gestão de Prazos'!$J145/'Gestão de Prazos'!$K145,\"-\")","v":450},5,{"$f":"ROUNDUP('Gestão de Prazos'!$J97/'Gestão de Prazos'!$M97,0)","v":4000},"RS","2021-03-05",null,null,"2021-03-05",null,{"$f":"VLOOKUP('Gestão de Prazos'!$E97,Tabela6[],7,0)","v":0},{"$f":"'Gestão de Prazos'!$U97*'Gestão de Prazos'!$J97","v":0},null,null,"2471520633342368FALSO"]
[null,false,24714,206333,42367,{"$f":"IFERROR(VLOOKUP('Gestão de Prazos'!$E98,Tabela6[],2,0),\"Cadastrar produto na aba (Cadastro de Produtos)\")","v":"EXEMPLO 10"},{"$f":"IFERROR(VLOOKUP('Gestão de Prazos'!$E98,Tabela6[],6,0),\"Cadastrar\")","v":0},"2021-01-06",20000,20000,200,{"$f":"IFERROR('Gestão de Prazos'!$J148/'Gestão de Prazos'!$K148,\"-\")","v":"-"},5,{"$f":"ROUNDUP('Gestão de Prazos'!$J98/'Gestão de Prazos'!$M98,0)","v":4000},"RS","2021-03-05",null,null,"2021-03-05",null,{"$f":"VLOOKUP('Gestão de Prazos'!$E98,Tabela6[],7,0)","v":0},{"$f":"'Gestão de Prazos'!$U98*'Gestão de Prazos'!$J98","v":0},null,null,"2471420633342367FALSO"]
[null,false,24250,"204828 - 11ª ENTREGA",42095,{"$f":"IFERROR(VLOOKUP('Gestão de Prazos'!$E99,Tabela6[],2,0),\"Cadastrar produto na aba (Cadastro de Produtos)\")","v":"EXEMPLO 27"},{"$f":"IFERROR(VLOOKUP('Gestão de Prazos'!$E99,Tabela6[],6,0),\"Cadastrar\")","v":0},"2020-12-22",2440000,2440000,"-",{"$f":"IFERROR('Gestão de Prazos'!$J105/'Gestão de Prazos'!$K105,\"-\")","v":"-"},1000,{"$f":"ROUNDUP('Gestão de Prazos'!$J99/'Gestão de Prazos'!$M99,0)","v":2440},"SP ","2021-03-02",null,null,"2021-03-02",null,{"$f":"VLOOKUP('Gestão de Prazos'!$E99,Tabela6[],7,0)","v":3.5000000000000001E-3},{"$f":"'Gestão de Prazos'!$U99*'Gestão de Prazos'!$J99","v":8540},null,null,"24250204828 - 11ª ENTREGA42095FALSO"]
[null,false,24455,204394,39227,{"$f":"IFERROR(VLOOKUP('Gestão de Prazos'!$E100,Tabela6[],2,0),\"Cadastrar produto na aba (Cadastro de Produtos)\")","v":"EXEMPLO 49"},{"$f":"IFERROR(VLOOKUP('Gestão de Prazos'!$E100,Tabela6[],6,0),\"Cadastrar\")","v":0},"2020-12-16",2000,2000,"-",{"$f":"IFERROR('Gestão de Prazos'!$J27/'Gestão de Prazos'!$K27,\"-\")","v":"-"},20,{"$f":"ROUNDUP('Gestão de Prazos'!$J100/'Gestão de Prazos'!$M100,0)","v":100},"RS","2021-03-01",null,null,"2021-03-01",null,{"$f":"VLOOKUP('Gestão de Prazos'!$E100,Tabela6[],7,0)","v":0.112},{"$f":"'Gestão de Prazos'!$U100*'Gestão de Prazos'!$J100","v":224},null,null,"2445520439439227FALSO"]
[null,false,24456,204394,39225,{"$f":"IFERROR(VLOOKUP('Gestão de Prazos'!$E101,Tabela6[],2,0),\"Cadastrar produto na aba (Cadastro de Produtos)\")","v":"EXEMPLO 48"},{"$f":"IFERROR(VLOOKUP('Gestão de Prazos'!$E101,Tabela6[],6,0),\"Cadastrar\")","v":0},"2020-12-16",1760,1760,"-",{"$f":"IFERROR('Gestão de Prazos'!$J46/'Gestão de Prazos'!$K46,\"-\")","v":"-"},20,{"$f":"ROUNDUP('Gestão de Prazos'!$J101/'Gestão de Prazos'!$M101,0)","v":88},"RS","2021-03-01",null,null,"2021-03-01",null,{"$f":"VLOOKUP('Gestão de Prazos'!$E101,Tabela6[],7,0)","v":0.17499999999999999},{"$f":"'Gestão de Prazos'!$U101*'Gestão de Prazos'!$J101","v":308},null,null,"2445620439439225FALSO"]
[null,false,24702,206183,27349,{"$f":"IFERROR(VLOOKUP('Gestão de Prazos'!$E102,Tabela6[],2,0),\"Cadastrar produto na aba (Cadastro de Produtos)\")","v":"EXEMPLO 15"},{"$f":"IFERROR(VLOOKUP('Gestão de Prazos'!$E102,Tabela6[],6,0),\"Cadastrar\")","v":0},"2021-01-06",5000000,5000000,"-",{"$f":"IFERROR('Gestão de Prazos'!$J69/'Gestão de Prazos'!$K69,\"-\")","v":"-"},2000,{"$f":"ROUNDUP('Gestão de Prazos'!$J102/'Gestão de Prazos'!$M102,0)","v":2500},"RS","2021-03-01",null,null,"2021-03-01",null,{"$f":"VLOOKUP('Gestão de Prazos'!$E102,Tabela6[],7,0)","v":3.3999999999999998E-3},{"$f":"'Gestão de Prazos'!$U102*'Gestão de Prazos'!$J102","v":17000},null,null,"2470220618327349FALSO"]
[null,false,24705,206182,27349,{"$f":"IFERROR(VLOOKUP('Gestão de Prazos'!$E103,Tabela6[],2,0),\"Cadastrar produto na aba (Cadastro de Produtos)\")","v":"EXEMPLO 15"},{"$f":"IFERROR(VLOOKUP('Gestão de Prazos'!$E103,Tabela6[],6,0),\"Cadastrar\")","v":0},"2021-01-06",2240000,2240000,"-",{"$f":"IFERROR('Gestão de Prazos'!$J70/'Gestão de Prazos'!$K70,\"-\")","v":"-"},2000,{"$f":"ROUNDUP('Gestão de Prazos'!$J103/'Gestão de Prazos'!$M103,0)","v":1120},"RS","2021-03-01",null,null,"2021-03-01",null,{"$f":"VLOOKUP('Gestão de Prazos'!$E103,Tabela6[],7,0)","v":3.3999999999999998E-3},{"$f":"'Gestão de Prazos'!$U103*'Gestão de Prazos'!$J103","v":7616},null,null,"2470520618227349FALSO"]
[null,false,24704,206182,27348,{"$f":"IFERROR(VLOOKUP('Gestão de Prazos'!$E104,Tabela6[],2,0),\"Cadastrar produto na aba (Cadastro de Produtos)\")","v":"EXEMPLO 14"},{"$f":"IFERROR(VLOOKUP('Gestão de Prazos'!$E104,Tabela6[],6,0),\"Cadastrar\")","v":0},"2021-01-06",1470000,1470000,"-",{"$f":"IFERROR('Gestão de Prazos'!$J71/'Gestão de Prazos'!$K71,\"-\")","v":"-"},2000,{"$f":"ROUNDUP('Gestão de Prazos'!$J104/'Gestão de Prazos'!$M104,0)","v":735},"RS","2021-03-01",null,null,"2021-03-01",null,{"$f":"VLOOKUP('Gestão de Prazos'!$E104,Tabela6[],7,0)","v":3.3999999999999998E-3},{"$f":"'Gestão de Prazos'!$U104*'Gestão de Prazos'!$J104","v":4998},null,null,"2470420618227348FALSO"]
[null,false,24702,206183,39811,{"$f":"IFERROR(VLOOKUP('Gestão de Prazos'!$E105,Tabela6[],2,0),\"Cadastrar produto na aba (Cadastro de Produtos)\")","v":"EXEMPLO 22"},{"$f":"IFERROR(VLOOKUP('Gestão de Prazos'!$E105,Tabela6[],6,0),\"Cadastrar\")","v":0},"2021-01-07",5000000,5000000,"-",{"$f":"IFERROR('Gestão de Prazos'!$J74/'Gestão de Prazos'!$K74,\"-\")","v":100},2000,{"$f":"ROUNDUP('Gestão de Prazos'!$J105/'Gestão de Prazos'!$M105,0)","v":2500},"RS","2021-03-01",null,null,"2021-03-01",null,{"$f":"VLOOKUP('Gestão de Prazos'!$E105,Tabela6[],7,0)","v":3.5000000000000001E-3},{"$f":"'Gestão de Prazos'!$U105*'Gestão de Prazos'!$J105","v":17500},null,null,"2470220618339811FALSO"]
[null,false,24705,206182,39811,{"$f":"IFERROR(VLOOKUP('Gestão de Prazos'!$E106,Tabela6[],2,0),\"Cadastrar produto na aba (Cadastro de Produtos)\")","v":"EXEMPLO 22"},{"$f":"IFERROR(VLOOKUP('Gestão de Prazos'!$E106,Tabela6[],6,0),\"Cadastrar\")","v":0},"2021-01-07",2240000,2240000,"-",{"$f":"IFERROR('Gestão de Prazos'!$J75/'Gestão de Prazos'!$K75,\"-\")","v":281},2000,{"$f":"ROUNDUP('Gestão de Prazos'!$J106/'Gestão de Prazos'!$M106,0)","v":1120},"RS","2021-03-01",null,null,"2021-03-01",null,{"$f":"VLOOKUP('Gestão de Prazos'!$E106,Tabela6[],7,0)","v":3.5000000000000001E-3},{"$f":"'Gestão de Prazos'!$U106*'Gestão de Prazos'!$J106","v":7840},null,null,"2470520618239811FALSO"]
[null,false,24704,206182,39810,{"$f":"IFERROR(VLOOKUP('Gestão de Prazos'!$E107,Tabela6[],2,0),\"Cadastrar produto na aba (Cadastro de Produtos)\")","v":"EXEMPLO 21"},{"$f":"IFERROR(VLOOKUP('Gestão de Prazos'!$E107,Tabela6[],6,0),\"Cadastrar\")","v":0},"2021-01-06",2000000,2000000,"-",{"$f":"IFERROR('Gestão de Prazos'!$J84/'Gestão de Prazos'!$K84,\"-\")","v":"-"},2000,{"$f":"ROUNDUP('Gestão de Prazos'!$J107/'Gestão de Prazos'!$M107,0)","v":1000},"RS","2021-03-01",null,null,"2021-03-01",null,{"$f":"VLOOKUP('Gestão de Prazos'!$E107,Tabela6[],7,0)","v":3.5000000000000001E-3},{"$f":"'Gestão de Prazos'!$U107*'Gestão de Prazos'!$J107","v":7000},null,null,"2470420618239810FALSO"]
[null,false,24703,206182,39814,{"$f":"IFERROR(VLOOKUP('Gestão de Prazos'!$E108,Tabela6[],2,0),\"Cadastrar produto na aba (Cadastro de Produtos)\")","v":"EXEMPLO 25"},{"$f":"IFERROR(VLOOKUP('Gestão de Prazos'!$E108,Tabela6[],6,0),\"Cadastrar\")","v":0},"2021-01-06",500000,500000,"-",{"$f":"IFERROR('Gestão de Prazos'!$J92/'Gestão de Prazos'!$K92,\"-\")","v":350},1000,{"$f":"ROUNDUP('Gestão de Prazos'!$J108/'Gestão de Prazos'!$M108,0)","v":500},"RS","2021-03-01",null,null,"2021-03-01",null,{"$f":"VLOOKUP('Gestão de Prazos'!$E108,Tabela6[],7,0)","v":3.5000000000000001E-3},{"$f":"'Gestão de Prazos'!$U108*'Gestão de Prazos'!$J108","v":1750},null,null,"2470320618239814FALSO"]
[null,false,24250,"204828 - 10ª ENTREGA",42095,{"$f":"IFERROR(VLOOKUP('Gestão de Prazos'!$E109,Tabela6[],2,0),\"Cadastrar produto na aba (Cadastro de Produtos)\")","v":"EXEMPLO 27"},{"$f":"IFERROR(VLOOKUP('Gestão de Prazos'!$E109,Tabela6[],6,0),\"Cadastrar\")","v":0},"2020-12-22",4400000,1960000,"-",{"$f":"IFERROR('Gestão de Prazos'!$J104/'Gestão de Prazos'!$K104,\"-\")","v":"-"},1000,{"$f":"ROUNDUP('Gestão de Prazos'!$J109/'Gestão de Prazos'!$M109,0)","v":1960},"SP ","2021-03-01",null,null,"2021-03-01",null,{"$f":"VLOOKUP('Gestão de Prazos'!$E109,Tabela6[],7,0)","v":3.5000000000000001E-3},{"$f":"'Gestão de Prazos'!$U109*'Gestão de Prazos'!$J109","v":6860},null,null,"24250204828 - 10ª ENTREGA42095FALSO"]
[null,false,25382,210789,39231,{"$f":"IFERROR(VLOOKUP('Gestão de Prazos'!$E110,Tabela6[],2,0),\"Cadastrar produto na aba (Cadastro de Produtos)\")","v":"EXEMPLO 53"},{"$f":"IFERROR(VLOOKUP('Gestão de Prazos'!$E110,Tabela6[],6,0),\"Cadastrar\")","v":0},"-",1680,1680,"-",{"$f":"IFERROR('Gestão de Prazos'!$J58/'Gestão de Prazos'!$K58,\"-\")","v":"-"},30,{"$f":"ROUNDUP('Gestão de Prazos'!$J110/'Gestão de Prazos'!$M110,0)","v":56},"RS","2021-02-26",null,null,"2021-02-26",null,{"$f":"VLOOKUP('Gestão de Prazos'!$E110,Tabela6[],7,0)","v":0.112},{"$f":"'Gestão de Prazos'!$U110*'Gestão de Prazos'!$J110","v":188.16},null,null,"2538221078939231FALSO"]
[null,false,24250,"204828 - 9ª ENTREGA",42095,{"$f":"IFERROR(VLOOKUP('Gestão de Prazos'!$E111,Tabela6[],2,0),\"Cadastrar produto na aba (Cadastro de Produtos)\")","v":"EXEMPLO 27"},{"$f":"IFERROR(VLOOKUP('Gestão de Prazos'!$E111,Tabela6[],6,0),\"Cadastrar\")","v":0},"2020-12-22",6360000,1960000,"-",{"$f":"IFERROR('Gestão de Prazos'!$J103/'Gestão de Prazos'!$K103,\"-\")","v":"-"},1000,{"$f":"ROUNDUP('Gestão de Prazos'!$J111/'Gestão de Prazos'!$M111,0)","v":1960},"SP ","2021-02-22",null,null,"2021-02-22",null,{"$f":"VLOOKUP('Gestão de Prazos'!$E111,Tabela6[],7,0)","v":3.5000000000000001E-3},{"$f":"'Gestão de Prazos'!$U111*'Gestão de Prazos'!$J111","v":6860},null,null,"24250204828 - 9ª ENTREGA42095FALSO"]
[null,false,24697,206181,27349,{"$f":"IFERROR(VLOOKUP('Gestão de Prazos'!$E112,Tabela6[],2,0),\"Cadastrar produto na aba (Cadastro de Produtos)\")","v":"EXEMPLO 15"},{"$f":"IFERROR(VLOOKUP('Gestão de Prazos'!$E112,Tabela6[],6,0),\"Cadastrar\")","v":0},"2021-01-06",2400000,2400000,"-",{"$f":"IFERROR('Gestão de Prazos'!$J68/'Gestão de Prazos'!$K68,\"-\")","v":9},2000,{"$f":"ROUNDUP('Gestão de Prazos'!$J112/'Gestão de Prazos'!$M112,0)","v":1200},"RS","2021-02-15",null,null,"2021-02-15",null,{"$f":"VLOOKUP('Gestão de Prazos'!$E112,Tabela6[],7,0)","v":3.3999999999999998E-3},{"$f":"'Gestão de Prazos'!$U112*'Gestão de Prazos'!$J112","v":8160},null,null,"2469720618127349FALSO"]
[null,false,24697,206181,39811,{"$f":"IFERROR(VLOOKUP('Gestão de Prazos'!$E113,Tabela6[],2,0),\"Cadastrar produto na aba (Cadastro de Produtos)\")","v":"EXEMPLO 22"},{"$f":"IFERROR(VLOOKUP('Gestão de Prazos'!$E113,Tabela6[],6,0),\"Cadastrar\")","v":0},"2021-01-07",2400000,2400000,"-",{"$f":"IFERROR('Gestão de Prazos'!$J73/'Gestão de Prazos'!$K73,\"-\")","v":"-"},2000,{"$f":"ROUNDUP('Gestão de Prazos'!$J113/'Gestão de Prazos'!$M113,0)","v":1200},"RS","2021-02-15",null,null,"2021-02-15",null,{"$f":"VLOOKUP('Gestão de Prazos'!$E113,Tabela6[],7,0)","v":3.5000000000000001E-3},{"$f":"'Gestão de Prazos'!$U113*'Gestão de Prazos'!$J113","v":8400},null,null,"2469720618139811FALSO"]
[null,false,24700,206318,33470,{"$f":"IFERROR(VLOOKUP('Gestão de Prazos'!$E114,Tabela6[],2,0),\"Cadastrar produto na aba (Cadastro de Produtos)\")","v":"EXEMPLO 4"},{"$f":"IFERROR(VLOOKUP('Gestão de Prazos'!$E114,Tabela6[],6,0),\"Cadastrar\")","v":0},"2021-01-06",70000,70000,200,{"$f":"IFERROR('Gestão de Prazos'!$J123/'Gestão de Prazos'!$K123,\"-\")","v":"-"},5,{"$f":"ROUNDUP('Gestão de Prazos'!$J114/'Gestão de Prazos'!$M114,0)","v":14000},"RS","2021-02-08",null,null,"2021-02-08",null,{"$f":"VLOOKUP('Gestão de Prazos'!$E114,Tabela6[],7,0)","v":0},{"$f":"'Gestão de Prazos'!$U114*'Gestão de Prazos'!$J114","v":0},null,null,"2470020631833470FALSO"]
[null,false,24699,206274,33487,{"$f":"IFERROR(VLOOKUP('Gestão de Prazos'!$E115,Tabela6[],2,0),\"Cadastrar produto na aba (Cadastro de Produtos)\")","v":"EXEMPLO 5"},{"$f":"IFERROR(VLOOKUP('Gestão de Prazos'!$E115,Tabela6[],6,0),\"Cadastrar\")","v":0},"2021-01-06",80000,80000,200,{"$f":"IFERROR('Gestão de Prazos'!$J128/'Gestão de Prazos'!$K128,\"-\")","v":"-"},5,{"$f":"ROUNDUP('Gestão de Prazos'!$J115/'Gestão de Prazos'!$M115,0)","v":16000},"RS","2021-02-08",null,null,"2021-02-08",null,{"$f":"VLOOKUP('Gestão de Prazos'!$E115,Tabela6[],7,0)","v":0},{"$f":"'Gestão de Prazos'!$U115*'Gestão de Prazos'!$J115","v":0},null,null,"2469920627433487FALSO"]
[null,false,24698,206224,33489,{"$f":"IFERROR(VLOOKUP('Gestão de Prazos'!$E116,Tabela6[],2,0),\"Cadastrar produto na aba (Cadastro de Produtos)\")","v":"EXEMPLO 7"},{"$f":"IFERROR(VLOOKUP('Gestão de Prazos'!$E116,Tabela6[],6,0),\"Cadastrar\")","v":0},"2021-01-06",40000,40000,200,{"$f":"IFERROR('Gestão de Prazos'!$J131/'Gestão de Prazos'!$K131,\"-\")","v":"-"},5,{"$f":"ROUNDUP('Gestão de Prazos'!$J116/'Gestão de Prazos'!$M116,0)","v":8000},"RS","2021-02-08",null,null,"2021-02-08",null,{"$f":"VLOOKUP('Gestão de Prazos'!$E116,Tabela6[],7,0)","v":0},{"$f":"'Gestão de Prazos'!$U116*'Gestão de Prazos'!$J116","v":0},null,null,"2469820622433489FALSO"]
[null,false,24701,206217,33468,{"$f":"IFERROR(VLOOKUP('Gestão de Prazos'!$E117,Tabela6[],2,0),\"Cadastrar produto na aba (Cadastro de Produtos)\")","v":"Exemplo 2"},{"$f":"IFERROR(VLOOKUP('Gestão de Prazos'!$E117,Tabela6[],6,0),\"Cadastrar\")","v":0},"2021-01-06",70000,70000,200,{"$f":"IFERROR('Gestão de Prazos'!$J136/'Gestão de Prazos'!$K136,\"-\")","v":"-"},5,{"$f":"ROUNDUP('Gestão de Prazos'!$J117/'Gestão de Prazos'!$M117,0)","v":14000},"RS","2021-02-08",null,null,"2021-02-08",null,{"$f":"VLOOKUP('Gestão de Prazos'!$E117,Tabela6[],7,0)","v":0},{"$f":"'Gestão de Prazos'!$U117*'Gestão de Prazos'!$J117","v":0},null,null,"2470120621733468FALSO"]
[null,false,24452,204381,39227,{"$f":"IFERROR(VLOOKUP('Gestão de Prazos'!$E118,Tabela6[],2,0),\"Cadastrar produto na aba (Cadastro de Produtos)\")","v":"EXEMPLO 49"},{"$f":"IFERROR(VLOOKUP('Gestão de Prazos'!$E118,Tabela6[],6,0),\"Cadastrar\")","v":0},"2020-12-16",2000,2000,"-",{"$f":"IFERROR('Gestão de Prazos'!$J26/'Gestão de Prazos'!$K26,\"-\")","v":"-"},20,{"$f":"ROUNDUP('Gestão de Prazos'!$J118/'Gestão de Prazos'!$M118,0)","v":100},"RS","2021-02-05",null,null,"2021-02-05",null,{"$f":"VLOOKUP('Gestão de Prazos'!$E118,Tabela6[],7,0)","v":0.112},{"$f":"'Gestão de Prazos'!$U118*'Gestão de Prazos'!$J118","v":224},null,null,"2445220438139227FALSO"]
[null,false,24454,204381,39225,{"$f":"IFERROR(VLOOKUP('Gestão de Prazos'!$E119,Tabela6[],2,0),\"Cadastrar produto na aba (Cadastro de Produtos)\")","v":"EXEMPLO 48"},{"$f":"IFERROR(VLOOKUP('Gestão de Prazos'!$E119,Tabela6[],6,0),\"Cadastrar\")","v":0},"2020-12-16",1660,1660,"-",{"$f":"IFERROR('Gestão de Prazos'!$J45/'Gestão de Prazos'!$K45,\"-\")","v":"-"},20,{"$f":"ROUNDUP('Gestão de Prazos'!$J119/'Gestão de Prazos'!$M119,0)","v":83},"RS","2021-02-05",null,null,"2021-02-05",null,{"$f":"VLOOKUP('Gestão de Prazos'!$E119,Tabela6[],7,0)","v":0.17499999999999999},{"$f":"'Gestão de Prazos'!$U119*'Gestão de Prazos'!$J119","v":290.5},null,null,"2445420438139225FALSO"]
[null,false,24453,204381,23293,{"$f":"IFERROR(VLOOKUP('Gestão de Prazos'!$E120,Tabela6[],2,0),\"Cadastrar produto na aba (Cadastro de Produtos)\")","v":"EXEMPLO 42"},{"$f":"IFERROR(VLOOKUP('Gestão de Prazos'!$E120,Tabela6[],6,0),\"Cadastrar\")","v":0},"2020-12-16",1210,1210,"-",{"$f":"IFERROR('Gestão de Prazos'!$J64/'Gestão de Prazos'!$K64,\"-\")","v":300},10,{"$f":"ROUNDUP('Gestão de Prazos'!$J120/'Gestão de Prazos'!$M120,0)","v":121},"RS","2021-02-05",null,null,"2021-02-05",null,{"$f":"VLOOKUP('Gestão de Prazos'!$E120,Tabela6[],7,0)","v":0.19500000000000001},{"$f":"'Gestão de Prazos'!$U120*'Gestão de Prazos'!$J120","v":235.95000000000002},null,null,"2445320438123293FALSO"]
[null,false,24416,204057,39811,{"$f":"IFERROR(VLOOKUP('Gestão de Prazos'!$E121,Tabela6[],2,0),\"Cadastrar produto na aba (Cadastro de Produtos)\")","v":"EXEMPLO 22"},{"$f":"IFERROR(VLOOKUP('Gestão de Prazos'!$E121,Tabela6[],6,0),\"Cadastrar\")","v":0},"2020-12-14",5000000,5000000,"-",{"$f":"IFERROR('Gestão de Prazos'!$J72/'Gestão de Prazos'!$K72,\"-\")","v":"-"},2000,{"$f":"ROUNDUP('Gestão de Prazos'!$J121/'Gestão de Prazos'!$M121,0)","v":2500},"RS","2021-02-01",null,null,"2021-02-01",null,{"$f":"VLOOKUP('Gestão de Prazos'!$E121,Tabela6[],7,0)","v":3.5000000000000001E-3},{"$f":"'Gestão de Prazos'!$U121*'Gestão de Prazos'!$J121","v":17500},null,null,"2441620405739811FALSO"]
[null,false,24415,204057,39810,{"$f":"IFERROR(VLOOKUP('Gestão de Prazos'!$E122,Tabela6[],2,0),\"Cadastrar produto na aba (Cadastro de Produtos)\")","v":"EXEMPLO 21"},{"$f":"IFERROR(VLOOKUP('Gestão de Prazos'!$E122,Tabela6[],6,0),\"Cadastrar\")","v":0},"2020-12-14",1600000,1600000,"-",{"$f":"IFERROR('Gestão de Prazos'!$J83/'Gestão de Prazos'!$K83,\"-\")","v":"-"},2000,{"$f":"ROUNDUP('Gestão de Prazos'!$J122/'Gestão de Prazos'!$M122,0)","v":800},"RS","2021-02-01",null,null,"2021-02-01",null,{"$f":"VLOOKUP('Gestão de Prazos'!$E122,Tabela6[],7,0)","v":3.5000000000000001E-3},{"$f":"'Gestão de Prazos'!$U122*'Gestão de Prazos'!$J122","v":5600},null,null,"2441520405739810FALSO"]
[null,false,24252,202652,20137,{"$f":"IFERROR(VLOOKUP('Gestão de Prazos'!$E123,Tabela6[],2,0),\"Cadastrar produto na aba (Cadastro de Produtos)\")","v":"EXEMPLO 13"},{"$f":"IFERROR(VLOOKUP('Gestão de Prazos'!$E123,Tabela6[],6,0),\"Cadastrar\")","v":0},"2020-12-01",20000,20000,"-",{"$f":"IFERROR('Gestão de Prazos'!$J94/'Gestão de Prazos'!$K94,\"-\")","v":200},1000,{"$f":"ROUNDUP('Gestão de Prazos'!$J123/'Gestão de Prazos'!$M123,0)","v":20},"RS","2021-02-01",null,null,"2021-02-01",null,{"$f":"VLOOKUP('Gestão de Prazos'!$E123,Tabela6[],7,0)","v":3.5000000000000001E-3},{"$f":"'Gestão de Prazos'!$U123*'Gestão de Prazos'!$J123","v":70},null,null,"2425220265220137FALSO"]
[null,false,24725,206703,42338,{"$f":"IFERROR(VLOOKUP('Gestão de Prazos'!$E124,Tabela6[],2,0),\"Cadastrar produto na aba (Cadastro de Produtos)\")","v":"EXEMPLO 28"},{"$f":"IFERROR(VLOOKUP('Gestão de Prazos'!$E124,Tabela6[],6,0),\"Cadastrar\")","v":0},"2021-01-08",100000,100000,250,{"$f":"IFERROR('Gestão de Prazos'!$J106/'Gestão de Prazos'!$K106,\"-\")","v":"-"},1000,{"$f":"ROUNDUP('Gestão de Prazos'!$J124/'Gestão de Prazos'!$M124,0)","v":100},"SP ","2021-01-29",null,null,"2021-01-29",null,{"$f":"VLOOKUP('Gestão de Prazos'!$E124,Tabela6[],7,0)","v":3.5000000000000001E-3},{"$f":"'Gestão de Prazos'!$U124*'Gestão de Prazos'!$J124","v":350},null,null,"2472520670342338FALSO"]
[null,false,24726,206704,42339,{"$f":"IFERROR(VLOOKUP('Gestão de Prazos'!$E125,Tabela6[],2,0),\"Cadastrar produto na aba (Cadastro de Produtos)\")","v":"EXEMPLO 29"},{"$f":"IFERROR(VLOOKUP('Gestão de Prazos'!$E125,Tabela6[],6,0),\"Cadastrar\")","v":0},"2021-01-08",37500,37500,250,{"$f":"IFERROR('Gestão de Prazos'!$J114/'Gestão de Prazos'!$K114,\"-\")","v":350},1000,{"$f":"ROUNDUP('Gestão de Prazos'!$J125/'Gestão de Prazos'!$M125,0)","v":38},"SP ","2021-01-29",null,null,"2021-01-29",null,{"$f":"VLOOKUP('Gestão de Prazos'!$E125,Tabela6[],7,0)","v":3.5000000000000001E-3},{"$f":"'Gestão de Prazos'!$U125*'Gestão de Prazos'!$J125","v":131.25},null,null,"2472620670442339FALSO"]
[null,false,24676,205970,39227,{"$f":"IFERROR(VLOOKUP('Gestão de Prazos'!$E126,Tabela6[],2,0),\"Cadastrar produto na aba (Cadastro de Produtos)\")","v":"EXEMPLO 49"},{"$f":"IFERROR(VLOOKUP('Gestão de Prazos'!$E126,Tabela6[],6,0),\"Cadastrar\")","v":0},"2021-01-06",5160,5160,"-",{"$f":"IFERROR('Gestão de Prazos'!$J30/'Gestão de Prazos'!$K30,\"-\")","v":"-"},20,{"$f":"ROUNDUP('Gestão de Prazos'!$J126/'Gestão de Prazos'!$M126,0)","v":258},"SP","2021-01-25",null,null,"2021-01-25",null,{"$f":"VLOOKUP('Gestão de Prazos'!$E126,Tabela6[],7,0)","v":0.112},{"$f":"'Gestão de Prazos'!$U126*'Gestão de Prazos'!$J126","v":577.91999999999996},null,null,"2467620597039227FALSO"]
[null,false,24250,"204828 - 8ª ENTREGA ",42095,{"$f":"IFERROR(VLOOKUP('Gestão de Prazos'!$E127,Tabela6[],2,0),\"Cadastrar produto na aba (Cadastro de Produtos)\")","v":"EXEMPLO 27"},{"$f":"IFERROR(VLOOKUP('Gestão de Prazos'!$E127,Tabela6[],6,0),\"Cadastrar\")","v":0},"2020-12-22",8320000,1960000,"-",{"$f":"IFERROR('Gestão de Prazos'!$J102/'Gestão de Prazos'!$K102,\"-\")","v":"-"},1000,{"$f":"ROUNDUP('Gestão de Prazos'!$J127/'Gestão de Prazos'!$M127,0)","v":1960},"SP ","2021-01-25",null,null,"2021-01-25",null,{"$f":"VLOOKUP('Gestão de Prazos'!$E127,Tabela6[],7,0)","v":3.5000000000000001E-3},{"$f":"'Gestão de Prazos'!$U127*'Gestão de Prazos'!$J127","v":6860},null,null,"24250204828 - 8ª ENTREGA 42095FALSO"]
[null,false,24769,207066,39228,{"$f":"IFERROR(VLOOKUP('Gestão de Prazos'!$E128,Tabela6[],2,0),\"Cadastrar produto na aba (Cadastro de Produtos)\")","v":"EXEMPLO 50"},{"$f":"IFERROR(VLOOKUP('Gestão de Prazos'!$E128,Tabela6[],6,0),\"Cadastrar\")","v":0},"2021-01-12",2000,2000,"-",{"$f":"IFERROR('Gestão de Prazos'!$J54/'Gestão de Prazos'!$K54,\"-\")","v":500},20,{"$f":"ROUNDUP('Gestão de Prazos'!$J128/'Gestão de Prazos'!$M128,0)","v":100},"SP","2021-01-22",null,null,"2021-01-22",null,{"$f":"VLOOKUP('Gestão de Prazos'!$E128,Tabela6[],7,0)","v":"Pesar"},{"$f":"'Gestão de Prazos'!$U128*'Gestão de Prazos'!$J128","v":{"$error":"#VALUE!"}},null,null,"2476920706639228FALSO"]
[null,false,24766,206118,12654,{"$f":"IFERROR(VLOOKUP('Gestão de Prazos'!$E129,Tabela6[],2,0),\"Cadastrar produto na aba (Cadastro de Produtos)\")","v":"EXEMPLO 32"},{"$f":"IFERROR(VLOOKUP('Gestão de Prazos'!$E129,Tabela6[],6,0),\"Cadastrar\")","v":0},"2021-01-06",135000,135000,"-",{"$f":"IFERROR('Gestão de Prazos'!$J17/'Gestão de Prazos'!$K17,\"-\")","v":1000},3000,{"$f":"ROUNDUP('Gestão de Prazos'!$J129/'Gestão de Prazos'!$M129,0)","v":45},"SP","2021-01-21",null,null,"2021-01-21",null,{"$f":"VLOOKUP('Gestão de Prazos'!$E129,Tabela6[],7,0)","v":4.4999999999999997E-3},{"$f":"'Gestão de Prazos'!$U129*'Gestão de Prazos'!$J129","v":607.5},null,null,"2476620611812654FALSO"]
[null,false,24763,206118,39227,{"$f":"IFERROR(VLOOKUP('Gestão de Prazos'!$E130,Tabela6[],2,0),\"Cadastrar produto na aba (Cadastro de Produtos)\")","v":"EXEMPLO 49"},{"$f":"IFERROR(VLOOKUP('Gestão de Prazos'!$E130,Tabela6[],6,0),\"Cadastrar\")","v":0},"2021-01-06",5420,5420,"-",{"$f":"IFERROR('Gestão de Prazos'!$J31/'Gestão de Prazos'!$K31,\"-\")","v":"-"},20,{"$f":"ROUNDUP('Gestão de Prazos'!$J130/'Gestão de Prazos'!$M130,0)","v":271},"SP","2021-01-21",null,null,"2021-01-21",null,{"$f":"VLOOKUP('Gestão de Prazos'!$E130,Tabela6[],7,0)","v":0.112},{"$f":"'Gestão de Prazos'!$U130*'Gestão de Prazos'!$J130","v":607.04},null,null,"2476320611839227FALSO"]
[null,false,24448,204411,39227,{"$f":"IFERROR(VLOOKUP('Gestão de Prazos'!$E131,Tabela6[],2,0),\"Cadastrar produto na aba (Cadastro de Produtos)\")","v":"EXEMPLO 49"},{"$f":"IFERROR(VLOOKUP('Gestão de Prazos'!$E131,Tabela6[],6,0),\"Cadastrar\")","v":0},"2020-12-16",2000,2000,"-",{"$f":"IFERROR('Gestão de Prazos'!$J25/'Gestão de Prazos'!$K25,\"-\")","v":500},20,{"$f":"ROUNDUP('Gestão de Prazos'!$J131/'Gestão de Prazos'!$M131,0)","v":100},"RS","2021-01-20",null,null,"2021-01-20",null,{"$f":"VLOOKUP('Gestão de Prazos'!$E131,Tabela6[],7,0)","v":0.112},{"$f":"'Gestão de Prazos'!$U131*'Gestão de Prazos'!$J131","v":224},null,null,"2444820441139227FALSO"]
[null,false,24544,204961,39227,{"$f":"IFERROR(VLOOKUP('Gestão de Prazos'!$E132,Tabela6[],2,0),\"Cadastrar produto na aba (Cadastro de Produtos)\")","v":"EXEMPLO 49"},{"$f":"IFERROR(VLOOKUP('Gestão de Prazos'!$E132,Tabela6[],6,0),\"Cadastrar\")","v":0},"2020-12-22",4400,4400,"-",{"$f":"IFERROR('Gestão de Prazos'!$J29/'Gestão de Prazos'!$K29,\"-\")","v":"-"},20,{"$f":"ROUNDUP('Gestão de Prazos'!$J132/'Gestão de Prazos'!$M132,0)","v":220},"SP","2021-01-20",null,null,"2021-01-20",null,{"$f":"VLOOKUP('Gestão de Prazos'!$E132,Tabela6[],7,0)","v":0.112},{"$f":"'Gestão de Prazos'!$U132*'Gestão de Prazos'!$J132","v":492.8},null,null,"2454420496139227FALSO"]
[null,false,"Comp",204411,18952,{"$f":"IFERROR(VLOOKUP('Gestão de Prazos'!$E133,Tabela6[],2,0),\"Cadastrar produto na aba (Cadastro de Produtos)\")","v":"EXEMPLO 41"},{"$f":"IFERROR(VLOOKUP('Gestão de Prazos'!$E133,Tabela6[],6,0),\"Cadastrar\")","v":0},"2020-12-16",60,60,"-",{"$f":"IFERROR('Gestão de Prazos'!$J63/'Gestão de Prazos'!$K63,\"-\")","v":300},30,{"$f":"ROUNDUP('Gestão de Prazos'!$J133/'Gestão de Prazos'!$M133,0)","v":2},"RS","2021-01-20",null,null,"2021-01-20",null,{"$f":"VLOOKUP('Gestão de Prazos'!$E133,Tabela6[],7,0)","v":"Pesar"},{"$f":"'Gestão de Prazos'!$U133*'Gestão de Prazos'!$J133","v":{"$error":"#VALUE!"}},null,null,"Comp20441118952FALSO"]
[null,false,24250,"204828 - 7ª ENTREGA",42095,{"$f":"IFERROR(VLOOKUP('Gestão de Prazos'!$E134,Tabela6[],2,0),\"Cadastrar produto na aba (Cadastro de Produtos)\")","v":"EXEMPLO 27"},{"$f":"IFERROR(VLOOKUP('Gestão de Prazos'!$E134,Tabela6[],6,0),\"Cadastrar\")","v":0},"2020-12-22",10280000,1960000,"-",{"$f":"IFERROR('Gestão de Prazos'!$J101/'Gestão de Prazos'!$K101,\"-\")","v":"-"},1000,{"$f":"ROUNDUP('Gestão de Prazos'!$J134/'Gestão de Prazos'!$M134,0)","v":1960},"SP ","2021-01-20",null,null,"2021-01-20",null,{"$f":"VLOOKUP('Gestão de Prazos'!$E134,Tabela6[],7,0)","v":3.5000000000000001E-3},{"$f":"'Gestão de Prazos'!$U134*'Gestão de Prazos'!$J134","v":6860},null,null,"24250204828 - 7ª ENTREGA42095FALSO"]
[null,false,24250,"204828 - 6ª ENTREGA",42095,{"$f":"IFERROR(VLOOKUP('Gestão de Prazos'!$E135,Tabela6[],2,0),\"Cadastrar produto na aba (Cadastro de Produtos)\")","v":"EXEMPLO 27"},{"$f":"IFERROR(VLOOKUP('Gestão de Prazos'!$E135,Tabela6[],6,0),\"Cadastrar\")","v":0},"2020-12-22",12240000,1960000,"-",{"$f":"IFERROR('Gestão de Prazos'!$J100/'Gestão de Prazos'!$K100,\"-\")","v":"-"},1000,{"$f":"ROUNDUP('Gestão de Prazos'!$J135/'Gestão de Prazos'!$M135,0)","v":1960},"SP ","2021-01-18",null,null,"2021-01-18",null,{"$f":"VLOOKUP('Gestão de Prazos'!$E135,Tabela6[],7,0)","v":3.5000000000000001E-3},{"$f":"'Gestão de Prazos'!$U135*'Gestão de Prazos'!$J135","v":6860},null,null,"24250204828 - 6ª ENTREGA42095FALSO"]
[null,false,24414,204056,39814,{"$f":"IFERROR(VLOOKUP('Gestão de Prazos'!$E136,Tabela6[],2,0),\"Cadastrar produto na aba (Cadastro de Produtos)\")","v":"EXEMPLO 25"},{"$f":"IFERROR(VLOOKUP('Gestão de Prazos'!$E136,Tabela6[],6,0),\"Cadastrar\")","v":0},"2020-12-14",555000,555000,"-",{"$f":"IFERROR('Gestão de Prazos'!$J91/'Gestão de Prazos'!$K91,\"-\")","v":150},1000,{"$f":"ROUNDUP('Gestão de Prazos'!$J136/'Gestão de Prazos'!$M136,0)","v":555},"RS","2021-01-15",null,null,"2021-01-15",null,{"$f":"VLOOKUP('Gestão de Prazos'!$E136,Tabela6[],7,0)","v":3.5000000000000001E-3},{"$f":"'Gestão de Prazos'!$U136*'Gestão de Prazos'!$J136","v":1942.5},null,null,"2441420405639814FALSO"]
[null,false,24250,"204828 - 5ª ENTREGA",42095,{"$f":"IFERROR(VLOOKUP('Gestão de Prazos'!$E137,Tabela6[],2,0),\"Cadastrar produto na aba (Cadastro de Produtos)\")","v":"EXEMPLO 27"},{"$f":"IFERROR(VLOOKUP('Gestão de Prazos'!$E137,Tabela6[],6,0),\"Cadastrar\")","v":0},"2020-12-22",14200000,1960000,"-",{"$f":"IFERROR('Gestão de Prazos'!$J99/'Gestão de Prazos'!$K99,\"-\")","v":"-"},1000,{"$f":"ROUNDUP('Gestão de Prazos'!$J137/'Gestão de Prazos'!$M137,0)","v":1960},"SP ","2021-01-15",null,null,"2021-01-15",null,{"$f":"VLOOKUP('Gestão de Prazos'!$E137,Tabela6[],7,0)","v":3.5000000000000001E-3},{"$f":"'Gestão de Prazos'!$U137*'Gestão de Prazos'!$J137","v":6860},null,null,"24250204828 - 5ª ENTREGA42095FALSO"]
[null,false,24438,204255,42368,{"$f":"IFERROR(VLOOKUP('Gestão de Prazos'!$E138,Tabela6[],2,0),\"Cadastrar produto na aba (Cadastro de Produtos)\")","v":"EXEMPLO 11"},{"$f":"IFERROR(VLOOKUP('Gestão de Prazos'!$E138,Tabela6[],6,0),\"Cadastrar\")","v":0},"2020-12-15",40000,40000,200,{"$f":"IFERROR('Gestão de Prazos'!$J144/'Gestão de Prazos'!$K144,\"-\")","v":550},5,{"$f":"ROUNDUP('Gestão de Prazos'!$J138/'Gestão de Prazos'!$M138,0)","v":8000},"RS","2021-01-15",null,null,"2021-01-15",null,{"$f":"VLOOKUP('Gestão de Prazos'!$E138,Tabela6[],7,0)","v":0},{"$f":"'Gestão de Prazos'!$U138*'Gestão de Prazos'!$J138","v":0},null,null,"2443820425542368FALSO"]
[null,false,24250,"204828 - 1ª ENTREGA ",42095,{"$f":"IFERROR(VLOOKUP('Gestão de Prazos'!$E139,Tabela6[],2,0),\"Cadastrar produto na aba (Cadastro de Produtos)\")","v":"EXEMPLO 27"},{"$f":"IFERROR(VLOOKUP('Gestão de Prazos'!$E139,Tabela6[],6,0),\"Cadastrar\")","v":0},"2020-12-22",20080000,980000,"-",{"$f":"IFERROR('Gestão de Prazos'!$J95/'Gestão de Prazos'!$K95,\"-\")","v":350},1000,{"$f":"ROUNDUP('Gestão de Prazos'!$J139/'Gestão de Prazos'!$M139,0)","v":980},"SP ","2021-01-14",null,null,"2021-01-14",null,{"$f":"VLOOKUP('Gestão de Prazos'!$E139,Tabela6[],7,0)","v":3.5000000000000001E-3},{"$f":"'Gestão de Prazos'!$U139*'Gestão de Prazos'!$J139","v":3430},null,null,"24250204828 - 1ª ENTREGA 42095FALSO"]
[null,false,24250,"204828 - 2ª ENTREGA",42095,{"$f":"IFERROR(VLOOKUP('Gestão de Prazos'!$E140,Tabela6[],2,0),\"Cadastrar produto na aba (Cadastro de Produtos)\")","v":"EXEMPLO 27"},{"$f":"IFERROR(VLOOKUP('Gestão de Prazos'!$E140,Tabela6[],6,0),\"Cadastrar\")","v":0},"2020-12-22",19100000,980000,"-",{"$f":"IFERROR('Gestão de Prazos'!$J96/'Gestão de Prazos'!$K96,\"-\")","v":100},1000,{"$f":"ROUNDUP('Gestão de Prazos'!$J140/'Gestão de Prazos'!$M140,0)","v":980},"SP ","2021-01-14",null,null,"2021-01-14",null,{"$f":"VLOOKUP('Gestão de Prazos'!$E140,Tabela6[],7,0)","v":3.5000000000000001E-3},{"$f":"'Gestão de Prazos'!$U140*'Gestão de Prazos'!$J140","v":3430},null,null,"24250204828 - 2ª ENTREGA42095FALSO"]
[null,false,24250,"204828 - 4ª ENTREGA",42095,{"$f":"IFERROR(VLOOKUP('Gestão de Prazos'!$E141,Tabela6[],2,0),\"Cadastrar produto na aba (Cadastro de Produtos)\")","v":"EXEMPLO 27"},{"$f":"IFERROR(VLOOKUP('Gestão de Prazos'!$E141,Tabela6[],6,0),\"Cadastrar\")","v":0},"2020-12-22",16160000,1960000,"-",{"$f":"IFERROR('Gestão de Prazos'!$J98/'Gestão de Prazos'!$K98,\"-\")","v":100},1000,{"$f":"ROUNDUP('Gestão de Prazos'!$J141/'Gestão de Prazos'!$M141,0)","v":1960},"SP ","2021-01-14",null,null,"2021-01-14",null,{"$f":"VLOOKUP('Gestão de Prazos'!$E141,Tabela6[],7,0)","v":3.5000000000000001E-3},{"$f":"'Gestão de Prazos'!$U141*'Gestão de Prazos'!$J141","v":6860},null,null,"24250204828 - 4ª ENTREGA42095FALSO"]
[null,false,24424,204149,42369,{"$f":"IFERROR(VLOOKUP('Gestão de Prazos'!$E142,Tabela6[],2,0),\"Cadastrar produto na aba (Cadastro de Produtos)\")","v":"EXEMPLO 12"},{"$f":"IFERROR(VLOOKUP('Gestão de Prazos'!$E142,Tabela6[],6,0),\"Cadastrar\")","v":0},"2020-12-15",20000,20000,200,{"$f":"IFERROR('Gestão de Prazos'!$J139/'Gestão de Prazos'!$K139,\"-\")","v":"-"},5,{"$f":"ROUNDUP('Gestão de Prazos'!$J142/'Gestão de Prazos'!$M142,0)","v":4000},"RS","2021-01-14",null,null,"2021-01-14",null,{"$f":"VLOOKUP('Gestão de Prazos'!$E142,Tabela6[],7,0)","v":0},{"$f":"'Gestão de Prazos'!$U142*'Gestão de Prazos'!$J142","v":0},null,null,"2442420414942369FALSO"]
[null,false,24250,"204828 - 3ª ENTREGA",42095,{"$f":"IFERROR(VLOOKUP('Gestão de Prazos'!$E143,Tabela6[],2,0),\"Cadastrar produto na aba (Cadastro de Produtos)\")","v":"EXEMPLO 27"},{"$f":"IFERROR(VLOOKUP('Gestão de Prazos'!$E143,Tabela6[],6,0),\"Cadastrar\")","v":0},"2020-12-22",18120000,1960000,"-",{"$f":"IFERROR('Gestão de Prazos'!$J97/'Gestão de Prazos'!$K97,\"-\")","v":100},1000,{"$f":"ROUNDUP('Gestão de Prazos'!$J143/'Gestão de Prazos'!$M143,0)","v":1960},"SP ","2021-01-13",null,null,"2021-01-13",null,{"$f":"VLOOKUP('Gestão de Prazos'!$E143,Tabela6[],7,0)","v":3.5000000000000001E-3},{"$f":"'Gestão de Prazos'!$U143*'Gestão de Prazos'!$J143","v":6860},null,null,{"$f":"CONCATENATE($C143,$D143,$E143,$B143)","v":"24250204828 - 3ª ENTREGA42095FALSO"}]
[null,false,24376,203851,33470,{"$f":"IFERROR(VLOOKUP('Gestão de Prazos'!$E144,Tabela6[],2,0),\"Cadastrar produto na aba (Cadastro de Produtos)\")","v":"EXEMPLO 4"},{"$f":"IFERROR(VLOOKUP('Gestão de Prazos'!$E144,Tabela6[],6,0),\"Cadastrar\")","v":0},"2020-12-10",110000,110000,200,{"$f":"IFERROR('Gestão de Prazos'!$J122/'Gestão de Prazos'!$K122,\"-\")","v":"-"},5,{"$f":"ROUNDUP('Gestão de Prazos'!$J144/'Gestão de Prazos'!$M144,0)","v":22000},"RS","2021-01-08",null,null,"2021-01-08",null,{"$f":"VLOOKUP('Gestão de Prazos'!$E144,Tabela6[],7,0)","v":0},{"$f":"'Gestão de Prazos'!$U144*'Gestão de Prazos'!$J144","v":0},null,null,"2437620385133470FALSO"]
[null,false,24377,203851,33487,{"$f":"IFERROR(VLOOKUP('Gestão de Prazos'!$E145,Tabela6[],2,0),\"Cadastrar produto na aba (Cadastro de Produtos)\")","v":"EXEMPLO 5"},{"$f":"IFERROR(VLOOKUP('Gestão de Prazos'!$E145,Tabela6[],6,0),\"Cadastrar\")","v":0},"2020-12-10",90000,90000,200,{"$f":"IFERROR('Gestão de Prazos'!$J127/'Gestão de Prazos'!$K127,\"-\")","v":"-"},5,{"$f":"ROUNDUP('Gestão de Prazos'!$J145/'Gestão de Prazos'!$M145,0)","v":18000},"RS","2021-01-08",null,null,"2021-01-08",null,{"$f":"VLOOKUP('Gestão de Prazos'!$E145,Tabela6[],7,0)","v":0},{"$f":"'Gestão de Prazos'!$U145*'Gestão de Prazos'!$J145","v":0},null,null,"2437720385133487FALSO"]
[null,false,24378,203851,33489,{"$f":"IFERROR(VLOOKUP('Gestão de Prazos'!$E146,Tabela6[],2,0),\"Cadastrar produto na aba (Cadastro de Produtos)\")","v":"EXEMPLO 7"},{"$f":"IFERROR(VLOOKUP('Gestão de Prazos'!$E146,Tabela6[],6,0),\"Cadastrar\")","v":0},"2020-12-10",40000,40000,200,{"$f":"IFERROR('Gestão de Prazos'!$J130/'Gestão de Prazos'!$K130,\"-\")","v":"-"},5,{"$f":"ROUNDUP('Gestão de Prazos'!$J146/'Gestão de Prazos'!$M146,0)","v":8000},"RS","2021-01-08",null,null,"2021-01-08",null,{"$f":"VLOOKUP('Gestão de Prazos'!$E146,Tabela6[],7,0)","v":0},{"$f":"'Gestão de Prazos'!$U146*'Gestão de Prazos'!$J146","v":0},null,null,"2437820385133489FALSO"]
[null,false,24375,203851,33468,{"$f":"IFERROR(VLOOKUP('Gestão de Prazos'!$E147,Tabela6[],2,0),\"Cadastrar produto na aba (Cadastro de Produtos)\")","v":"Exemplo 2"},{"$f":"IFERROR(VLOOKUP('Gestão de Prazos'!$E147,Tabela6[],6,0),\"Cadastrar\")","v":0},"2020-12-10",80000,80000,200,{"$f":"IFERROR('Gestão de Prazos'!$J135/'Gestão de Prazos'!$K135,\"-\")","v":"-"},5,{"$f":"ROUNDUP('Gestão de Prazos'!$J147/'Gestão de Prazos'!$M147,0)","v":16000},"RS","2021-01-08",null,null,"2021-01-08",null,{"$f":"VLOOKUP('Gestão de Prazos'!$E147,Tabela6[],7,0)","v":0},{"$f":"'Gestão de Prazos'!$U147*'Gestão de Prazos'!$J147","v":0},null,null,"2437520385133468FALSO"]
[null,false,24543,204969,39227,{"$f":"IFERROR(VLOOKUP('Gestão de Prazos'!$E148,Tabela6[],2,0),\"Cadastrar produto na aba (Cadastro de Produtos)\")","v":"EXEMPLO 49"},{"$f":"IFERROR(VLOOKUP('Gestão de Prazos'!$E148,Tabela6[],6,0),\"Cadastrar\")","v":0},"2020-12-22",10180,10180,"-",{"$f":"IFERROR('Gestão de Prazos'!$J28/'Gestão de Prazos'!$K28,\"-\")","v":"-"},20,{"$f":"ROUNDUP('Gestão de Prazos'!$J148/'Gestão de Prazos'!$M148,0)","v":509},"SP","2021-01-05",null,null,"2021-01-05",null,{"$f":"VLOOKUP('Gestão de Prazos'!$E148,Tabela6[],7,0)","v":0.112},{"$f":"'Gestão de Prazos'!$U148*'Gestão de Prazos'!$J148","v":1140.1600000000001},null,null,"2454320496939227FALSO"]
[null,false,24003,200522,12654,{"$f":"IFERROR(VLOOKUP('Gestão de Prazos'!$E149,Tabela6[],2,0),\"Cadastrar produto na aba (Cadastro de Produtos)\")","v":"EXEMPLO 32"},{"$f":"IFERROR(VLOOKUP('Gestão de Prazos'!$E149,Tabela6[],6,0),\"Cadastrar\")","v":0},"2020-11-11",102000,102000,"-",{"$f":"IFERROR('Gestão de Prazos'!$J16/'Gestão de Prazos'!$K16,\"-\")","v":"-"},3000,{"$f":"ROUNDUP('Gestão de Prazos'!$J149/'Gestão de Prazos'!$M149,0)","v":34},"SP","2021-01-04",null,null,"2021-01-04",null,{"$f":"VLOOKUP('Gestão de Prazos'!$E149,Tabela6[],7,0)","v":4.4999999999999997E-3},{"$f":"'Gestão de Prazos'!$U149*'Gestão de Prazos'!$J149","v":458.99999999999994},null,null,"2400320052212654FALSO"]
[null,false,24002,200522,39227,{"$f":"IFERROR(VLOOKUP('Gestão de Prazos'!$E150,Tabela6[],2,0),\"Cadastrar produto na aba (Cadastro de Produtos)\")","v":"EXEMPLO 49"},{"$f":"IFERROR(VLOOKUP('Gestão de Prazos'!$E150,Tabela6[],6,0),\"Cadastrar\")","v":0},"2020-11-11",3580,3580,"-",{"$f":"IFERROR('Gestão de Prazos'!$J24/'Gestão de Prazos'!$K24,\"-\")","v":500},20,{"$f":"ROUNDUP('Gestão de Prazos'!$J150/'Gestão de Prazos'!$M150,0)","v":179},"SP","2021-01-04",null,null,"2021-01-04",null,{"$f":"VLOOKUP('Gestão de Prazos'!$E150,Tabela6[],7,0)","v":0.112},{"$f":"'Gestão de Prazos'!$U150*'Gestão de Prazos'!$J150","v":400.96000000000004},null,null,"2400220052239227FALSO"]
[null,false,23958,199686,27349,{"$f":"IFERROR(VLOOKUP('Gestão de Prazos'!$E151,Tabela6[],2,0),\"Cadastrar produto na aba (Cadastro de Produtos)\")","v":"EXEMPLO 15"},{"$f":"IFERROR(VLOOKUP('Gestão de Prazos'!$E151,Tabela6[],6,0),\"Cadastrar\")","v":0},"2020-11-03",5000000,5000000,"-",{"$f":"IFERROR('Gestão de Prazos'!$J67/'Gestão de Prazos'!$K67,\"-\")","v":"-"},2000,{"$f":"ROUNDUP('Gestão de Prazos'!$J151/'Gestão de Prazos'!$M151,0)","v":2500},"RS","2021-01-04",null,null,"2021-01-04",null,{"$f":"VLOOKUP('Gestão de Prazos'!$E151,Tabela6[],7,0)","v":3.3999999999999998E-3},{"$f":"'Gestão de Prazos'!$U151*'Gestão de Prazos'!$J151","v":17000},null,null,"2395819968627349FALSO"]

{"sheet":"CARROS (JANEIRO 2021)","index":3,"n_rows":46,"n_cols":14,"rows_kept":46,"cut":false,"hidden":true,"merged":[[3,2,3,12],[4,1,21,1],[22,2,22,12],[24,1,40,1]]}
[]
[]
[]
[null,null,"BR SUPPLY "]
[null,"CARRO 1","OP","OC","DESCRIÇÃO","Quantidade total do Pedido","PESO PRODUZIDO","DATA ENTREGA CLIENTE","REALIZAR AGENDAMENTO PARA:","EM ESTOQUE (SOBRA)","STATUS PRODUÇÃO ROTATEK","LOCAL DE ENTREGA","STATUS","AGENDAMENTO"]
[null,null,24003,200522,"Formulário Continuo Branco 80 colunas 1 via",102000,null,"2021-01-04","2021-01-04",null,null,null,"entregue"]
[null,null,24002,200522,"Bobina Papel Calculadora Go Office 57mmx30m c/ 20un",3580,null,"2021-01-04","2021-01-05",null,null,null,"entregue"]
[null,null,24543,204969,"Bobina Papel Calculadora Go Office 57mmx30m c/ 20un",10180,null,"2021-01-05","2021-01-28",null,null,null,"coleta dia 26/01"]
[null,null,24544,204961,"Bobina Papel Calculadora Go Office 57mmx30m c/ 20un",4400,null,"2021-01-20","2021-01-28",null,null,null,"coleta dia 20/01"]
[null,null,24725,206703,"Envelope ATM  Bradesco Acerto em Dinheiro PCT 250",100000,null,"2021-01-29",{"$f":"H10","v":"2021-01-29"}]
[null,null,24726,206704,"Envelope ATM Bradesco Entrega Cheque Custodia PCT 250",37500,null,"2021-01-29",{"$f":"H11","v":"2021-01-29"}]
[null,null,24250,"204828 - 1ª ENTREGA ","Envelope Multi Expresso Bradesco",980000,null,"2021-01-14","2021-01-14"]
[null,null,24250,"204828 - 2ª ENTREGA","Envelope Multi Expresso Bradesco",980000,null,"2021-01-14","2021-01-14"]
[null,null,24250,"204828 - 3ª ENTREGA","Envelope Multi Expresso Bradesco",1960000,null,"2021-01-13","2021-01-13"]
[null,null,24250,"204828 - 4ª ENTREGA","Envelope Multi Expresso Bradesco",1960000,null,"2021-01-14","2021-01-14"]
[null,null,24250,"204828 - 5ª ENTREGA","Envelope Multi Expresso Bradesco",1960000,null,"2021-01-15","2021-01-15"]
[null,null,24250,"204828 - 6ª ENTREGA","Envelope Multi Expresso Bradesco",1960000,null,"2021-01-18","2021-01-18"]
[null,null,24250,"204828 - 7ª ENTREGA","Envelope Multi Expresso Bradesco",1960000,null,"2021-01-20","2021-01-20"]
[null,null,24250,"204828 - 8ª ENTREGA ","Envelope Multi Expresso Bradesco",1960000,null,"2021-01-25","2021-01-25"]
[null,null,24250,"204828 - 9ª ENTREGA","Envelope Multi Expresso Bradesco",1960000,null,"2021-01-27","2021-01-27"]
[null,null,24250,"204828 - 10ª ENTREGA","Envelope Multi Expresso Bradesco",1960000,null,"2021-01-29","2021-01-29"]
[]
[null,null,{"$f":"SUM(G22:G22)","v":0}]
[]
[null,"CARRO 1","OP","OC","DESCRIÇÃO","Quantidade total do Pedido","PESO PRODUZIDO","DATA ENTREGA CLIENTE","REALIZAR AGENDAMENTO PARA:","EM ESTOQUE (SOBRA)","STATUS PRODUÇÃO ROTATEK","LOCAL DE ENTREGA","STATUS","AGENDAMENTO"]
[null,null,24448,204411,"Bobina Papel Calculadora Go Office 57mmx30m c/ 20un",2000,null,"2021-01-20","2020-01-25",null,null,null,"coleta dia 20/01"]
[null,null,"COMP",204411,"Bobina para Fax 216mmx30m c/1",60,null,"2021-01-20","2020-01-25"]
[null,null,23958,199686,"Envelope ATM Dinheiro Sicred 2000 um",5000000,null,"2021-01-04","15/01/2021 - apenas 24 paletes"]
[null,null,23958,199686,"Envelope ATM Dinheiro Sicred 2000 um",5000000,null,"2021-01-04","25/01/2021 - 18 paletes restantes"]
[null,null,24414,204056,"Envelope Sangria Raia Drogasil Pct 1.000 IND",555000,null,"2021-01-15","2020-01-25"]
[null,null,24376,203851,"Prop de Adesão ao Crédito Pessoal Agibank Pct 200 fls",110000,null,"2021-01-08","2021-01-15"]
[null,null,24375,203851,"Prop Adesão ao Credito Pessoal Consig Agibank Pct 200",80000,null,"2021-01-08","2021-01-15"]
[null,null,24377,203851,"Autorização de Debito Agibank Pct 200 fls",90000,null,"2021-01-08","2021-01-15"]
[null,null,24378,203851,"Prop de abertura de conta corrente PF Agibank Pct 200",40000,null,"2021-01-08","2021-01-15"]
[null,null,24424,204149,"Termo de Consentimento Cartão de Crédito Consig PCT 200fls",20000,null,"2021-01-14","2021-01-15"]
[null,null,24438,204255,"Autor de Saque Via Cartão de Crédito Cons Agibank PCT 200fls",40000,null,"2021-01-15","2021-01-15"]
[]
[]
[]
[]
[]
[]
[null,null,"LEGENDA:"]
[null,null,null,null,"                                                    OPs que já entraram em produção e estão aguardando algum processo."]
[null,null,null,null,"OP's já finalizadas, aguardando entrega."]
[null,null,null,null,"OP's em branco já estão em programação. "]

{"sheet":"CARROS (FEVEREIRO 2021)","index":4,"n_rows":36,"n_cols":13,"rows_kept":36,"cut":false,"hidden":true,"merged":[[3,2,3,11],[4,1,11,1],[12,2,12,11],[14,1,30,1]]}
[]
[]
[]
[null,null,"BR SUPPLY "]
[null,"CARRO 1","OP","OC","DESCRIÇÃO","Quantidade total do Pedido","DATA ENTREGA CLIENTE","REALIZAR AGENDAMENTO PARA:","EM ESTOQUE (SOBRA)","STATUS PRODUÇÃO ROTATEK","LOCAL DE ENTREGA","STATUS","AGENDAMENTO"]
[null,null,24676,205970,"Bobina Papel Calculadora Go Office 57mmx30m c/ 20un",5160,"2021-01-25","2021-02-05",null,null,"SP","coleta na manuseadora dia 03/02"]
[null,null,24250,"204828 - 11ª ENTREGA","Envelope Multi Expresso Bradesco",2440000,"2021-02-01",{"$f":"G7","v":"2021-02-01"},null,null,"SP"]
[null,null,24763,206118,"BR SUPPLY - BOBINA PDV PAPEL CALCULADORA GO OFFICE (MOD 039227) - PDV - PEDIDO 206118 - TRIBUTADO",5420,"2021-01-21","2021-02-05",null,null,"SP","coleta na manuseadora dia 03/02"]
[null,null,24769,207066,"BR SUPPLY - BOBINA PDV PAPEL CALCULADORA - GO OFFICE - 039228 - TRIBUTADO - Pedido 207066 - TRIBUTADO",2000,"2021-01-22","2021-02-05",null,null,"SP","coleta na manuseadora dia 03/02"]
[null,null,24766,206118,"Formulário Continuo Branco 80 colunas 1 via",135000,"2021-01-21","2021-02-05",null,null,"SP","finalizado"]
[]
[]
[]
[]
[null,"CARRO 1","OP","OC","DESCRIÇÃO","Quantidade total do Pedido","DATA ENTREGA CLIENTE","REALIZAR AGENDAMENTO PARA:","EM ESTOQUE (SOBRA)","STATUS PRODUÇÃO ROTATEK","LOCAL DE ENTREGA","STATUS","AGENDAMENTO"]
[null,null,24452,204381,"Bobina Papel Calculadora Go Office 57mmx30m c/ 20un",2000,null,null,null,null,"RS","finalizado"]
[null,null,24453,204381,"Bobina Papel Calculadora Go Office 57mmx30m c/ 10un",1210,null,null,null,null,"RS","finalizado"]
[null,null,24454,204381,"Bobina Térmica Cotepe Go Office80mmx40m c/20un",1660,null,null,null,null,"RS","finalizado"]
[null,null,24252,202652,"Envelope de Segurança Sicredi",20000,"2021-02-01",null,null,null,"RS","coleta 01/03"]
[null,null,24416,204057,"Envelope Depósito ATM em Dinheiro Sicred IND",5000000,"2021-02-01",null,null,null,"RS"]
[null,null,24697,206181,"Envelope ATM Dinheiro Sicred 2000 um",2400000,"2021-02-15",null,null,null,"RS"]
[null,null,24415,204057,"Envelope Depósito ATM em Cheque Sicred IND",1600000,"2021-02-01","2021-02-01",null,null,"RS","finalizado"]
[null,null,24698,206224,"Prop de abertura de conta corrente PF Agibank Pct 200",40000,"2021-02-08","2021-02-01",null,null,"RS","finalizado"]
[null,null,24699,206274,"Autorização de Debito Agibank Pct 200 fls",80000,"2021-02-08","2021-02-01",null,null,"RS","finalizado"]
[null,null,24700,206318,"Prop de Adesão ao Crédito Pessoal Agibank Pct 200 fls",70000,"2021-02-08","2021-02-01",null,null,"RS","finalizado"]
[null,null,24701,206217,"Prop Adesão ao Credito Pessoal Consig Agibank Pct 200",70000,"2021-02-08","2021-02-01",null,null,"RS","finalizado"]
[null,null,24414,204056,"Envelope Sangria Raia Drogasil Pct 1.000 IND",555000,"2021-01-15","2021-02-01",null,null,"RS","finalizado"]
[null,null,24438,204255,"Autor de Saque Via Cartão de Crédito Cons Agibank PCT 200fls",40000,"2021-01-15","2021-02-01",null,null,"RS","finalizado"]
[]
[]
[]
[]
[null,null,"LEGENDA:"]
[null,null,null,null,"                                                    OPs que já entraram em produção e estão aguardando algum processo."]
[null,null,null,null,"OP's já finalizadas, aguardando entrega."]
[null,null,null,null,"OP's em branco já estão em programação. "]

{"sheet":"CARROS (MARÇO 2021)","index":5,"n_rows":49,"n_cols":12,"rows_kept":49,"cut":false,"hidden":true,"merged":[[0,2,0,10],[1,1,19,1],[20,2,20,10],[22,1,43,1]]}
[null,null,"BR SUPPLY "]
[null,"CARRO 1","OP","OC","DESCRIÇÃO","Quantidade total do Pedido","DATA ENTREGA CLIENTE","REALIZAR AGENDAMENTO PARA:","STATUS PRODUÇÃO","LOCAL DE ENTREGA","STATUS","AGENDAMENTO"]
[null,null,25148,209908,"Carta de Boas Vindas Dental ",155000,"2021-03-10","2021-03-10","finalizado","SP","EXPEDIDO"]
[null,null,24764,206089,"Bobina Papel Calculadora Go Office 57mmx30m c/ 20un",3600,"2021-02-12","2021-03-05","finalizado","SP","EXPEDIDO"]
[null,null,24767,206089,"Bobina Papel Calculadora Itau 57mm x 75m c/20",1880,"2021-02-12","2021-03-05","finalizado","SP","EXPEDIDO"]
[null,null,24765,206103,"Bobina Papel Calculadora Go Office 57mmx30m c/ 20un",2000,"2021-02-24","2021-03-01","finalizado","SP","EXPEDIDO"]
[null,null,"24768/25400",206103,"Bobina Calc Olivetti Itau 41A43 01 via",20000,"2021-02-24","2021-03-25","finalizado","SP","EXPEDIDO"]
[null,null,25201,210390,"Bobina Térmica Cotepe Go Office80mmx40m c/20un",4000,"2021-03-01","2021-03-25","finalizado","SP","EXPEDIDO"]
[null,null,25202,210390,"Bobina Papel Calculadora Go Office 57mmx30m c/ 20un",8000,"2021-03-01","2021-03-25","finalizado","SP","EXPEDIDO"]
[null,null,25378,210390,"Bobina Autocopiativa PDV Go Office76mmx20m c/ 30un",3000,"2021-03-01","2021-03-25","finalizado","SP","EXPEDIDO"]
[null,null,25241,210777,"Bobina Papel Calculadora Go Office 57mmx30m c/ 20un",6000,"2021-03-10","2021-03-25","finalizado","SP","EXPEDIDO"]
[null,null,25240,210777,"Bobina Térmica Cotepe Go Office80mmx40m c/20un",2860,"2021-03-10","2021-03-25","finalizado","SP","EXPEDIDO"]
[null,null,25310,209452,"Bobina Papel Calculadora Itau 57mm x 75m c/20",8600,"2021-02-22","2021-03-10","finalizado","SP","EXPEDIDO"]
[null,null,25311,209452,"Bobina Papel Calculadora Itau - Cx 20un",1000,"2021-02-22","2021-03-10","finalizado","SP","EXPEDIDO"]
[null,null,25380,210400,"Bobina Autocopiativa PDV Go Office76mmx20m c/ 30un",600,"2021-03-10","2021-03-25","finalizado","SP","EXPEDIDO"]
[null,null,25203,210400,"Formulário Continuo Branco 80 colunas 1 via",141000,"2021-03-10","2021-03-10","finalizado","SP","EXPEDIDO"]
[null,null,25204,210400,"Formulário Continuo Razão Esdeva, 3 vias, 80 colunas, 56g/m2",10000,"2021-03-10","2021-03-29","finalizado","SP","EXPEDIDO"]
[null,null,25205,210385,"Form Cont Branco 2 vias 80 colunas autocop Staples",150000,"2021-03-15","pendencia de papel e AGUARDANDO MANUSEIO","Passando para p carro de Abril","SP"]
[null,null,25349,211372,"Envelope ATM Bradesco Entrega Cheque Custodia PCT 250",70250,"2021-03-22","2021-03-26","falta shirink","SP","EXPEDIDO"]
[null,null,25351,211377,"Envelope ATM  Bradesco Acerto em Dinheiro PCT 250",25000,"2021-03-22","2021-03-26","falta shirink","SP","EXPEDIDO"]
[]
[]
[null,"CARRO 1","OP","OC","DESCRIÇÃO","Quantidade total do Pedido","DATA ENTREGA CLIENTE","REALIZAR AGENDAMENTO PARA:","STATUS PRODUÇÃO","LOCAL DE ENTREGA","STATUS","AGENDAMENTO"]
[null,null,24458,204412,"Formulário Continuo Recibo de Pagamento c/bloq Autoc 3vias",100000,"2021-03-10","16/03 - DEPENDE DE PAPEL E MANUSEIO","Passando para p carro de Abril","RS"]
[null,null,24702,206183,"Envelope ATM Dinheiro Sicred 2000 um",3584000,"2021-03-01","2021-03-05","finalizado","RS"]
[null,null,24706,206230,"Prop de Adesão ao Crédito Pessoal Agibank Pct 200 fls",70000,"2021-03-05","2021-03-12","finalizado","RS","EXPEDIDO"]
[null,null,24707,206258,"Prop Adesão ao Credito Pessoal Consig Agibank Pct 200",70000,"2021-03-05","2021-03-12","finalizado","RS","EXPEDIDO"]
[null,null,24708,206338,"Autorização de Debito Agibank Pct 200 fls",80000,"2021-03-05","2021-03-12","finalizado","RS","EXPEDIDO"]
[null,null,24709,206292,"Prop de abertura de conta corrente PF Agibank Pct 200",40000,"2021-03-05","2021-03-12","finalizado","RS","EXPEDIDO"]
[null,null,24714,206333,"Prop de Adesão Cartão de Crédito Consi Agibank PCT 200fls",20000,"2021-03-05","2021-03-12","finalizado","RS","EXPEDIDO"]
[null,null,24715,206333,"Autor de Saque Via Cartão de Crédito Cons Agibank PCT 200fls",20000,"2021-03-05","2021-03-12","finalizado","RS","EXPEDIDO"]
[null,null,24716,206333,"Termo de Consentimento Cartão de Crédito Consig PCT 200fls",20000,"2021-03-05","2021-03-12","finalizado","RS","EXPEDIDO"]
[null,null,25149,209993,"Prop de Adesão Cartão de Crédito Consi Agibank PCT 200fls",30000,"2021-03-08","2021-03-12","finalizado","RS","EXPEDIDO"]
[null,null,24704,206182,"Envelope ATM Cheque Sicred 2000 um",1470000,"2021-03-01","2021-03-12","finalizado","RS","EXPEDIDO"]
[null,null,24452,204381,"Bobina Papel Calculadora Go Office 57mmx30m c/ 20un",2000,null,"2021-03-10","finalizado","RS","EXPEDIDO"]
[null,null,24453,204381,"Bobina Papel Calculadora Go Office 57mmx30m c/ 10un",1210,null,"2021-03-10","finalizado","RS","EXPEDIDO"]
[null,null,24454,204381,"Bobina Térmica Cotepe Go Office80mmx40m c/20un",1660,null,"2021-03-10","finalizado","RS","EXPEDIDO"]
[null,null,24455,204394,"Bobina Papel Calculadora Go Office 57mmx30m c/ 20un",2000,"2021-03-01","2021-03-10","finalizado","RS","CARRO DE 20/ABRIL"]
[null,null,24457,204412,"Bobina Papel Calculadora Go Office 57mmx30m c/ 10un",1220,"2021-03-10","2021-03-10","finalizado","RS","EXPEDIDO"]
[null,null,24703,206182,"Envelope para dinheiro Drogra Raia  Drogasil  Pct 1.000 IND",500000,"2021-03-01","2021-03-10","finalizado","RS","EXPEDIDO"]
[null,null,24456,204394,"Bobina Térmica Cotepe Go Office80mmx40m c/20un",1760,"2021-03-01","2021-03-10","finalizado","RS","EXPEDIDO"]
[null,null,24702,206183,"Envelope ATM Dinheiro Sicred 2000 um",{"$f":"5000000-F25","v":1416000},"2021-03-01","2021-03-10","finalizado","RS","EXPEDIDO"]
[null,null,"COMP",204411,"Bobina para Fax 216mmx30m c/1",60,null,"2021-03-10","finalizado","RS","finalizado"]
[null,null,24252,202652,"Envelope de Segurança Sicredi",20000,"2021-02-01","2021-03-10","finalizado","RS","EXPEDIDO"]
[]
[null,null,"LEGENDA:"]
[null,null,null,null,"                                                    OPs que já entraram em produção e estão aguardando algum processo."]
[null,null,null,null,"OP's já finalizadas, aguardando entrega."]
[null,null,null,null,"OP's em branco já estão em programação. "]

{"sheet":"CARROS (ABRIL 2021)","index":6,"n_rows":47,"n_cols":12,"rows_kept":47,"cut":false,"hidden":true,"merged":[[0,2,0,10],[1,1,18,1],[19,2,19,10],[21,1,41,1],[10,6,13,6]]}
[null,null,"BR SUPPLY "]
[null,"CARRO 1","OP","OC","DESCRIÇÃO","Quantidade total do Pedido","DATA ENTREGA CLIENTE","REALIZAR AGENDAMENTO PARA:","STATUS PRODUÇÃO ROTATEK","LOCAL DE ENTREGA","STATUS","AGENDAMENTO"]
[null,null,25495,212742,"Bobina Papel Calculadora Go Office 57mmx30m c/ 20un",7380,"2021-04-08","2021-04-27","finalizado","SP"]
[null,null,25492,212752,"Bobina Papel Calculadora Go Office 57mmx30m c/ 20un",7380,"2021-04-27","2021-04-27","finalizado","SP"]
[null,null,25477,212736,"Bobina Papel Calculadora Go Office 57mmx30m c/ 20un",6940,"2021-03-26","2021-04-27","finalizado","SP"]
[null,null,25352,211377,"Envelope ATM  Bradesco Acerto em Dinheiro PCT 250",75000,"2021-04-05","2021-04-05","finalizado","SP","EXPEDIDO"]
[null,null,25491,212821,"Envelope ATM  Bradesco Acerto em Dinheiro PCT 250",175000,"2021-04-09","2021-04-09","finalizado","SP","EXPEDIDO"]
[null,null,25350,211374,"Envelope ATM Bradesco Entrega Cheque Custodia PCT 250",75000,"2021-04-05","2021-04-05","finalizado","SP","EXPEDIDO"]
[null,null,25488,212822,"Envelope ATM Bradesco Entrega Cheque Custodia PCT 250",175000,"2021-04-09","2021-04-09","finalizado","SP","EXPEDIDO"]
[null,null,25205,210385,"Form Cont Branco 2 vias 80 colunas autocop Staples",150000,"2021-03-15","2021-04-30","coleta manuseadora dia 28/04","SP"]
[null,null,24766,206118,"Formulário Contínuo Esdeva Branco  1 via",135000,"Não foram expedido de acordo com os carros anteriores","2021-04-12","finalizado","SP","EXPEDIDO"]
[null,null,25203,210400,"Formulário Contínuo Branco 80 colunas",15000,null,"2021-04-12","finalizado","SP","EXPEDIDO"]
[null,null,24769,207066,"Bobina de Papel Go Office para Calculadora",2000,null,"2021-04-12","finalizado","SP","EXPEDIDO"]
[null,null,25378,210390,"Bobina Autocopiativa Go Office PDV",3000,null,"2021-04-12","finalizado","SP","EXPEDIDO"]
[null,null,25237,210800,"Formulário Continuo Branco 80 colunas 1 via",141000,"2021-04-12","2021-04-12","finalizado","SP","EXPEDIDO"]
[null,null,25693,212736,"Recibo de pagamento Esdeva LAB 02 s/ bloqueio cx c 3000jgs ",27000,"2021-03-26",null,"avaliando se iremos fazer na esdeva - aguardando retorno comercial","SP"]
[null,null,25581,212895,"Carta de Boas Vindas Saúde",60000,"2021-04-12","2021-04-19","impressão ok, aguardando shirink","SP","EXPEDIDO"]
[null,null,25722,217468,"Envelope Tamanho Ofício com Janela BVP PCT 5 - PRODUÇÃO EM SP",50000,"2021-04-12",null,"Vamos produzir em SP? Aguardando posicionamento Comercial.","SP"]
[]
[]
[]
[null,"CARRO 1","OP","OC","DESCRIÇÃO","Quantidade total do Pedido","DATA ENTREGA CLIENTE","REALIZAR AGENDAMENTO PARA:","STATUS PRODUÇÃO ROTATEK","LOCAL DE ENTREGA","STATUS","AGENDAMENTO"]
[null,null,25105,209679,"Prop de abertura de conta corrente PF Agibank Pct 200",40000,"2021-04-05","2021-04-08","finalizado","RS","EXPEDIDO"]
[null,null,25147,210139,"Prop de Adesão ao Crédito Pessoal Agibank Pct 200 fls",60000,"2021-04-05","2021-04-08","finalizado","RS","EXPEDIDO"]
[null,null,24705,206182,"Envelope ATM Dinheiro Sicred 2000 um",2240000,"2021-03-01","2021-04-08","finalizado","RS","EXPEDIDO"]
[null,null,25428,212270,"Prop de Adesão Cartão de Crédito Consi Agibank PCT 200fls",90000,"2021-04-09","2021-04-08","Impressão OK, falta acabamento","RS","EXPEDIDO"]
[null,null,25427,212248,"Autor de Saque Via Cartão de Crédito Cons Agibank PCT 200fls",100000,"2021-04-09","2021-04-08","Impressão OK, falta acabamento","RS","EXPEDIDO"]
[null,null,25426,212387,"Termo de Consentimento Cartão de Crédito Consig PCT 200fls",70000,"2021-04-09","2021-04-08","Impressão OK, falta acabamento","RS","EXPEDIDO"]
[null,null,25408,212259,"Termo de Consentimento Cartão de Crédito Consig PCT 200fls",120000,"2021-04-09","2021-04-08","Impressão OK, falta acabamento","RS","EXPEDIDO"]
[null,null,25480,212887,"Prop de Adesão Cartão de Crédito Consi Agibank PCT 200fls",140000,"2021-04-09","2021-04-08","Impressão OK, falta acabamento","RS","EXPEDIDO"]
[null,null,25481,212887,"Autor de Saque Via Cartão de Crédito Cons Agibank PCT 200fls",140000,"2021-04-09","2021-04-08","Impressão OK, falta acabamento","RS","EXPEDIDO"]
[null,null,25443,212456,"Envelope Depósito ATM em Cheque Sicred IND",1200000,"2021-04-07","2021-04-20","finalizado","RS","EXPEDIDO"]
[null,null,25442,212455,"Envelope para dinheiro Drogra Raia  Drogasil  Pct 1.000 IND",600000,"2021-04-07","2021-04-20","finalizado","RS","EXPEDIDO"]
[null,null,25153,209974,"Bobina Papel Calculadora Go Office 57mmx30m c/ 20un",2000,"2021-04-20","2021-04-20","finalizado","RS","EXPEDIDO"]
[null,null,25381,210772,"Bobina Autocopiativa PDV Go Office76mmx20m c/ 30un",750,"2021-03-15","2021-04-20","finalizado","RS","EXPEDIDO"]
[null,null,25382,210789,"Bobina Autocopiativa PDV Go Office76mmx20m c/ 30un",1680,"2021-02-26","2021-04-20","finalizado","RS","EXPEDIDO"]
[null,null,24950,208152,"Bobina Papel Calculadora Go Office 57mmx30m c/ 10un",1500,"2021-04-08","2021-04-20","finalizado","RS","EXPEDIDO"]
[null,null,24951,208149,"Bobina Papel Calculadora Go Office 57mmx30m c/ 20un",2000,"2021-03-26","2021-04-20","finalizado","RS","EXPEDIDO"]
[null,null,25152,209974,"Bobina Térmica Cotepe Go Office80mmx40m c/20un",1400,"2021-04-20","2021-04-20","finalizado","RS","EXPEDIDO"]
[null,null,25154,209965,"Bobina Térmica Cotepe Go Office80mmx40m c/20un",1480,"2021-04-06","2021-04-20","finalizado","RS","EXPEDIDO"]
[null,null,24458,204412,"Formulário Continuo Recibo de Pagamento c/bloq Autoc 3vias",100000,"2021-03-10","CANCELADO","coleta manuseadora dia 28/04","RS"]
[null,null,"24455/25634",204394,"Bobina Papel Calculadora Go Office 57mmx30m c/ 20un",2000,"2021-03-01","2021-04-20","finalizado","RS","EXPEDIDO 1760 DE ACORDO COM A MINUTA"]
[]
[null,null,"LEGENDA:"]
[null,null,null,null,"                                                    OPs que já entraram em produção e estão aguardando algum processo."]
[null,null,null,null,"OP's já finalizadas, aguardando entrega."]
[null,null,null,null,"OP's em branco já estão em programação. "]