{"text_format":"1","workbook":"xlsx","n_sheets":7,"sheets":["Base de Dados","Produtos","Gestão de Prazos","CARROS (JANEIRO 2021)","CARROS (FEVEREIRO 2021)","CARROS (MARÇO 2021)","CARROS (ABRIL 2021)"],"not_rendered":{"charts":0,"images":4,"macros":1,"external_links":0,"defined_names":12,"comments":0,"pivot_tables":0},"unopened":[],"bounds":{"document_bytes":16777216,"sheet_cells":100000,"rows_first":2000,"rows_last":500,"rows_between":2000,"halvings":0,"cell_chars":16384,"cell_head_chars":4096},"cells_cut":0,"cells_raw":0,"read":"whole","date_system":"1900"}

{"sheet":"Base de Dados","index":0,"n_rows":60,"n_cols":28,"rows_kept":60,"cut":false,"hidden":true,"merged":[]}
[null,null,null,null,null,null,null,null,null,null,null,null,null,null,null,null,null,null,null,null,null,null,null,null,null,null,null,"Pedido"]
[null,null,null,null,null,null,null,null,null,null,null,null,null,null,null,null,null,null,null,null,null,null,null,null,null,null,null,"Estoque"]
[]
[]
[null,"Cod. Prod.","Descrição","Ean","Dun","CO","Modelo","Peso"]
[null,33467,"EXEMPLO 1"]
[null,33468,"Exemplo 2"]
[null,33469,"EXEMPLO 3"]
[null,33470,"EXEMPLO 4"]
[null,33487,"EXEMPLO 5"]
[null,33488,"EXEMPLO 6"]
[null,33489,"EXEMPLO 7"]
[null,33490,"EXEMPLO 8"]
[null,33679,"EXEMPLO 9"]
[null,42367,"EXEMPLO 10"]
[null,42368,"EXEMPLO 11"]
[null,42369,"EXEMPLO 12"]
[null,20137,"EXEMPLO 13",null,null,null,null,3.5000000000000001E-3]
[null,27348,"EXEMPLO 14",null,null,null,null,3.3999999999999998E-3]
[null,27349,"EXEMPLO 15",null,null,null,null,3.3999999999999998E-3]
{"$rows_left_out":41}
{"sheet":"Produtos","index":1,"n_rows":8,"n_cols":28,"rows_kept":8,"cut":false,"hidden":true,"merged":[]}
[null,null,null,null,null,null,null,null,null,null,null,null,null,null,null,null,null,null,null,null,null,null,null,null,null,null,null,"Pedido"]
[null,null,null,null,null,null,null,null,null,null,null,null,null,null,null,null,null,null,null,null,null,null,null,null,null,null,null,"Estoque"]
[]
[null,null,"Produtos"]
[null,null,"Papelaria e Outros"]
[null,null,"PDV"]
[null,null,"Envelopes"]
[null,null,"Agibank"]

{"sheet":"Gestão de Prazos","index":2,"n_rows":151,"n_cols":31,"rows_kept":151,"cut":false,"hidden":false,"merged":[]}
[null,null,null,null,null,null,null,null,null,null,null,null,null,null,null,null,null,null,null,null,null,null,null,null,null,null,null,null,"Pedido",null,"Aguardando Impressão"]
[null,null,null,null,null,null,null,null,null,null,null,null,null,null,null,null,null,null,null,null,null,null,null,null,null,null,null,null,"Estoque",null,"Imprimindo"]
[null,null,null,null,null,null,null,null,null,null,null,null,null,null,null,null,null,null,null,null,null,null,null,null,null,null,null,null,null,null,"Finalizado"]
[null,null,"* Pra ativar o filtro basta digitar a informação nas caixas de texto abaixo"]
[]
[]
[]
[]
[]
[]
[]
["Código",null,"OP","OC","Cód. Produto","Descrição","Modelo","Data do pedido","Tiragem","Qtd. Total do pedido","Quantidade no Pacote\n(Shirink)","Volume de Pacotes","Quantidade de und na caixa","Vol. de caixa","Local Entrega","Data de entrega","Insumos ok?","Status","Data negociada","Agendado","Peso Unit\n(Kg)","Peso Total (Kg)","Quantidade Entregue","Status2"]
[null,null,null,null,null,null,null,null,null,null,null,null,null,null,null,null,null,null,null,null,null,null,null,null,{"$f":"CONCATENATE(AA13,AB13,AC13,Z13)","v":""}]
[null,false,26066,219543,39811,{"$f":"IFERROR(VLOOKUP('Gestão de Prazos'!$E14,Tabela6[],2,0),\"Cadastrar produto na aba (Cadastro de Produtos)\")","v":"EXEMPLO 22"},{"$f":"IFERROR(VLOOKUP('Gestão de Prazos'!$E14,Tabela6[],6,0),\"Cadastrar\")","v":0},"2021-05-11",3996000,3996000,"-",{"$f":"IFERROR('Gestão de Prazos'!$J82/'Gestão de Prazos'!$K82,\"-\")","v":"-"},2000,{"$f":"ROUNDUP('Gestão de Prazos'!$J14/'Gestão de Prazos'!$M14,0)","v":1998},"RS","-",null,null,"-",null,{"$f":"VLOOKUP('Gestão de Prazos'!$E14,Tabela6[],7,0)","v":3.5000000000000001E-3},{"$f":"'Gestão de Prazos'!$U14*'Gestão de Prazos'!$J14","v":13986},null,null,{"$f":"CONCATENATE($C14,$D14,$E14,$B14)","v":"2606621954339811FALSO"}]
[null,false,26065,219544,39811,{"$f":"IFERROR(VLOOKUP('Gestão de Prazos'!$E15,Tabela6[],2,0),\"Cadastrar produto na aba (Cadastro de Produtos)\")","v":"EXEMPLO 22"},{"$f":"IFERROR(VLOOKUP('Gestão de Prazos'!$E15,Tabela6[],6,0),\"Cadastrar\")","v":0},"2021-05-11",2000000,2000000,"-",{"$f":"IFERROR('Gestão de Prazos'!$J81/'Gestão de Prazos'!$K81,\"-\")","v":"-"},2000,{"$f":"ROUNDUP('Gestão de Prazos'!$J15/'Gestão de Prazos'!$M15,0)","v":1000},"RS","2021-07-05",null,null,"2021-07-05",null,{"$f":"VLOOKUP('Gestão de Prazos'!$E15,Tabela6[],7,0)","v":3.5000000000000001E-3},{"$f":"'Gestão de Prazos'!$U15*'Gestão de Prazos'!$J15","v":7000},null,null,{"$f":"CONCATENATE($C15,$D15,$E15,$B15)","v":"2606521954439811FALSO"}]
[null,false,26060,219542,39810,{"$f":"IFERROR(VLOOKUP('Gestão de Prazos'!$E16,Tabela6[],2,0),\"Cadastrar produto na aba (Cadastro de Produtos)\")","v":"EXEMPLO 21"},{"$f":"IFERROR(VLOOKUP('Gestão de Prazos'!$E16,Tabela6[],6,0),\"Cadastrar\")","v":0},"2021-05-11",1962000,1962000,"-",{"$f":"IFERROR('Gestão de Prazos'!$J89/'Gestão de Prazos'!$K89,\"-\")","v":"-"},2000,{"$f":"ROUNDUP('Gestão de Prazos'!$J16/'Gestão de Prazos'!$M16,0)","v":981},"RS","2021-07-05",null,null,"2021-07-05",null,{"$f":"VLOOKUP('Gestão de Prazos'!$E16,Tabela6[],7,0)","v":3.5000000000000001E-3},{"$f":"'Gestão de Prazos'!$U16*'Gestão de Prazos'!$J16","v":6867},null,null,"2606021954239810FALSO"]
[null,false,26067,219546,42338,{"$f":"IFERROR(VLOOKUP('Gestão de Prazos'!$E17,Tabela6[],2,0),\"Cadastrar produto na aba (Cadastro de Produtos)\")","v":"EXEMPLO 28"},{"$f":"IFERROR(VLOOKUP('Gestão de Prazos'!$E17,Tabela6[],6,0),\"Cadastrar\")","v":0},"2021-05-11",250000,250000,250,{"$f":"IFERROR('Gestão de Prazos'!$J113/'Gestão de Prazos'!$K113,\"-\")","v":"-"},1000,{"$f":"ROUNDUP('Gestão de Prazos'!$J17/'Gestão de Prazos'!$M17,0)","v":250},"SP ","2021-07-05",null,null,"2021-07-05",null,{"$f":"VLOOKUP('Gestão de Prazos'!$E17,Tabela6[],7,0)","v":3.5000000000000001E-3},{"$f":"'Gestão de Prazos'!$U17*'Gestão de Prazos'!$J17","v":875},null,null,"2606721954642338FALSO"]
[null,false,26045,219109,39811,{"$f":"IFERROR(VLOOKUP('Gestão de Prazos'!$E18,Tabela6[],2,0),\"Cadastrar produto na aba (Cadastro de Produtos)\")","v":"EXEMPLO 22"},{"$f":"IFERROR(VLOOKUP('Gestão de Prazos'!$E18,Tabela6[],6,0),\"Cadastrar\")","v":0},"2021-05-07",3130000,3130000,"-",{"$f":"IFERROR('Gestão de Prazos'!$J78/'Gestão de Prazos'!$K78,\"-\")","v":"-"},2000,{"$f":"ROUNDUP('Gestão de Prazos'!$J18/'Gestão de Prazos'!$M18,0)","v":1565},"RS","2021-06-14",null,null,"2021-06-14",null,{"$f":"VLOOKUP('Gestão de Prazos'!$E18,Tabela6[],7,0)","v":3.5000000000000001E-3},{"$f":"'Gestão de Prazos'!$U18*'Gestão de Prazos'!$J18","v":10955},null,null,"2604521910939811FALSO"]
[null,false,26046,219108,39811,{"$f":"IFERROR(VLOOKUP('Gestão de Prazos'!$E19,Tabela6[],2,0),\"Cadastrar produto na aba (Cadastro de Produtos)\")","v":"EXEMPLO 22"},{"$f":"IFERROR(VLOOKUP('Gestão de Prazos'!$E19,Tabela6[],6,0),\"Cadastrar\")","v":0},"2021-05-07",540000,540000,"-",{"$f":"IFERROR('Gestão de Prazos'!$J79/'Gestão de Prazos'!$K79,\"-\")","v":6200},2000,{"$f":"ROUNDUP('Gestão de Prazos'!$J19/'Gestão de Prazos'!$M19,0)","v":270},"RS","2021-06-14",null,null,"2021-06-14",null,{"$f":"VLOOKUP('Gestão de Prazos'!$E19,Tabela6[],7,0)","v":3.5000000000000001E-3},{"$f":"'Gestão de Prazos'!$U19*'Gestão de Prazos'!$J19","v":1890},null,null,"2604621910839811FALSO"]
[null,false,26044,219106,39811,{"$f":"IFERROR(VLOOKUP('Gestão de Prazos'!$E20,Tabela6[],2,0),\"Cadastrar produto na aba (Cadastro de Produtos)\")","v":"EXEMPLO 22"},{"$f":"IFERROR(VLOOKUP('Gestão de Prazos'!$E20,Tabela6[],6,0),\"Cadastrar\")","v":0},"2021-05-07",326000,326000,"-",{"$f":"IFERROR('Gestão de Prazos'!$J80/'Gestão de Prazos'!$K80,\"-\")","v":"-"},2000,{"$f":"ROUNDUP('Gestão de Prazos'!$J20/'Gestão de Prazos'!$M20,0)","v":163},"RS","2021-06-14",null,null,"2021-06-14",null,{"$f":"VLOOKUP('Gestão de Prazos'!$E20,Tabela6[],7,0)","v":3.5000000000000001E-3},{"$f":"'Gestão de Prazos'!$U20*'Gestão de Prazos'!$J20","v":1141},null,null,"2604421910639811FALSO"]
{"$rows_left_out":132}
{"sheet":"CARROS (JANEIRO 2021)","index":3,"n_rows":46,"n_cols":14,"rows_kept":46,"cut":false,"hidden":true,"merged":[[3,2,3,12],[4,1,21,1],[22,2,22,12],[24,1,40,1]]}
[]
[]
[]
[null,null,"BR SUPPLY "]
[null,"CARRO 1","OP","OC","DESCRIÇÃO","Quantidade total do Pedido","PESO PRODUZIDO","DATA ENTREGA CLIENTE","REALIZAR AGENDAMENTO PARA:","EM ESTOQUE (SOBRA)","STATUS PRODUÇÃO ROTATEK","LOCAL DE ENTREGA","STATUS","AGENDAMENTO"]
[null,null,24003,200522,"Formulário Continuo Branco 80 colunas 1 via",102000,null,"2021-01-04","2021-01-04",null,null,null,"entregue"]
[null,null,24002,200522,"Bobina Papel Calculadora Go Office 57mmx30m c/ 20un",3580,null,"2021-01-04","2021-01-05",null,null,null,"entregue"]
[null,null,24543,204969,"Bobina Papel Calculadora Go Office 57mmx30m c/ 20un",10180,null,"2021-01-05","2021-01-28",null,null,null,"coleta dia 26/01"]
[null,null,24544,204961,"Bobina Papel Calculadora Go Office 57mmx30m c/ 20un",4400,null,"2021-01-20","2021-01-28",null,null,null,"coleta dia 20/01"]
[null,null,24725,206703,"Envelope ATM  Bradesco Acerto em Dinheiro PCT 250",100000,null,"2021-01-29",{"$f":"H10","v":"2021-01-29"}]
[null,null,24726,206704,"Envelope ATM Bradesco Entrega Cheque Custodia PCT 250",37500,null,"2021-01-29",{"$f":"H11","v":"2021-01-29"}]
[null,null,24250,"204828 - 1ª ENTREGA ","Envelope Multi Expresso Bradesco",980000,null,"2021-01-14","2021-01-14"]
[null,null,24250,"204828 - 2ª ENTREGA","Envelope Multi Expresso Bradesco",980000,null,"2021-01-14","2021-01-14"]
[null,null,24250,"204828 - 3ª ENTREGA","Envelope Multi Expresso Bradesco",1960000,null,"2021-01-13","2021-01-13"]
[null,null,24250,"204828 - 4ª ENTREGA","Envelope Multi Expresso Bradesco",1960000,null,"2021-01-14","2021-01-14"]
[null,null,24250,"204828 - 5ª ENTREGA","Envelope Multi Expresso Bradesco",1960000,null,"2021-01-15","2021-01-15"]
[null,null,24250,"204828 - 6ª ENTREGA","Envelope Multi Expresso Bradesco",1960000,null,"2021-01-18","2021-01-18"]
[null,null,24250,"204828 - 7ª ENTREGA","Envelope Multi Expresso Bradesco",1960000,null,"2021-01-20","2021-01-20"]
[null,null,24250,"204828 - 8ª ENTREGA ","Envelope Multi Expresso Bradesco",1960000,null,"2021-01-25","2021-01-25"]
[null,null,24250,"204828 - 9ª ENTREGA","Envelope Multi Expresso Bradesco",1960000,null,"2021-01-27","2021-01-27"]
{"$rows_left_out":27}
{"sheet":"CARROS (FEVEREIRO 2021)","index":4,"n_rows":36,"n_cols":13,"rows_kept":36,"cut":false,"hidden":true,"merged":[[3,2,3,11],[4,1,11,1],[12,2,12,11],[14,1,30,1]]}
[]
[]
[]
[null,null,"BR SUPPLY "]
[null,"CARRO 1","OP","OC","DESCRIÇÃO","Quantidade total do Pedido","DATA ENTREGA CLIENTE","REALIZAR AGENDAMENTO PARA:","EM ESTOQUE (SOBRA)","STATUS PRODUÇÃO ROTATEK","LOCAL DE ENTREGA","STATUS","AGENDAMENTO"]
[null,null,24676,205970,"Bobina Papel Calculadora Go Office 57mmx30m c/ 20un",5160,"2021-01-25","2021-02-05",null,null,"SP","coleta na manuseadora dia 03/02"]
[null,null,24250,"204828 - 11ª ENTREGA","Envelope Multi Expresso Bradesco",2440000,"2021-02-01",{"$f":"G7","v":"2021-02-01"},null,null,"SP"]
[null,null,24763,206118,"BR SUPPLY - BOBINA PDV PAPEL CALCULADORA GO OFFICE (MOD 039227) - PDV - PEDIDO 206118 - TRIBUTADO",5420,"2021-01-21","2021-02-05",null,null,"SP","coleta na manuseadora dia 03/02"]
[null,null,24769,207066,"BR SUPPLY - BOBINA PDV PAPEL CALCULADORA - GO OFFICE - 039228 - TRIBUTADO - Pedido 207066 - TRIBUTADO",2000,"2021-01-22","2021-02-05",null,null,"SP","coleta na manuseadora dia 03/02"]
[null,null,24766,206118,"Formulário Continuo Branco 80 colunas 1 via",135000,"2021-01-21","2021-02-05",null,null,"SP","finalizado"]
[]
[]
[]
[]
[null,"CARRO 1","OP","OC","DESCRIÇÃO","Quantidade total do Pedido","DATA ENTREGA CLIENTE","REALIZAR AGENDAMENTO PARA:","EM ESTOQUE (SOBRA)","STATUS PRODUÇÃO ROTATEK","LOCAL DE ENTREGA","STATUS","AGENDAMENTO"]
[null,null,24452,204381,"Bobina Papel Calculadora Go Office 57mmx30m c/ 20un",2000,null,null,null,null,"RS","finalizado"]
[null,null,24453,204381,"Bobina Papel Calculadora Go Office 57mmx30m c/ 10un",1210,null,null,null,null,"RS","finalizado"]
[null,null,24454,204381,"Bobina Térmica Cotepe Go Office80mmx40m c/20un",1660,null,null,null,null,"RS","finalizado"]
[null,null,24252,202652,"Envelope de Segurança Sicredi",20000,"2021-02-01",null,null,null,"RS","coleta 01/03"]
[null,null,24416,204057,"Envelope Depósito ATM em Dinheiro Sicred IND",5000000,"2021-02-01",null,null,null,"RS"]
{"$rows_left_out":17}
{"sheet":"CARROS (MARÇO 2021)","index":5,"n_rows":49,"n_cols":12,"rows_kept":49,"cut":false,"hidden":true,"merged":[[0,2,0,10],[1,1,19,1],[20,2,20,10],[22,1,43,1]]}
[null,null,"BR SUPPLY "]
[null,"CARRO 1","OP","OC","DESCRIÇÃO","Quantidade total do Pedido","DATA ENTREGA CLIENTE","REALIZAR AGENDAMENTO PARA:","STATUS PRODUÇÃO","LOCAL DE ENTREGA","STATUS","AGENDAMENTO"]
[null,null,25148,209908,"Carta de Boas Vindas Dental ",155000,"2021-03-10","2021-03-10","finalizado","SP","EXPEDIDO"]
[null,null,24764,206089,"Bobina Papel Calculadora Go Office 57mmx30m c/ 20un",3600,"2021-02-12","2021-03-05","finalizado","SP","EXPEDIDO"]
[null,null,24767,206089,"Bobina Papel Calculadora Itau 57mm x 75m c/20",1880,"2021-02-12","2021-03-05","finalizado","SP","EXPEDIDO"]
[null,null,24765,206103,"Bobina Papel Calculadora Go Office 57mmx30m c/ 20un",2000,"2021-02-24","2021-03-01","finalizado","SP","EXPEDIDO"]
[null,null,"24768/25400",206103,"Bobina Calc Olivetti Itau 41A43 01 via",20000,"2021-02-24","2021-03-25","finalizado","SP","EXPEDIDO"]
[null,null,25201,210390,"Bobina Térmica Cotepe Go Office80mmx40m c/20un",4000,"2021-03-01","2021-03-25","finalizado","SP","EXPEDIDO"]
[null,null,25202,210390,"Bobina Papel Calculadora Go Office 57mmx30m c/ 20un",8000,"2021-03-01","2021-03-25","finalizado","SP","EXPEDIDO"]
[null,null,25378,210390,"Bobina Autocopiativa PDV Go Office76mmx20m c/ 30un",3000,"2021-03-01","2021-03-25","finalizado","SP","EXPEDIDO"]
[null,null,25241,210777,"Bobina Papel Calculadora Go Office 57mmx30m c/ 20un",6000,"2021-03-10","2021-03-25","finalizado","SP","EXPEDIDO"]
[null,null,25240,210777,"Bobina Térmica Cotepe Go Office80mmx40m c/20un",2860,"2021-03-10","2021-03-25","finalizado","SP","EXPEDIDO"]
[null,null,25310,209452,"Bobina Papel Calculadora Itau 57mm x 75m c/20",8600,"2021-02-22","2021-03-10","finalizado","SP","EXPEDIDO"]
[null,null,25311,209452,"Bobina Papel Calculadora Itau - Cx 20un",1000,"2021-02-22","2021-03-10","finalizado","SP","EXPEDIDO"]
[null,null,25380,210400,"Bobina Autocopiativa PDV Go Office76mmx20m c/ 30un",600,"2021-03-10","2021-03-25","finalizado","SP","EXPEDIDO"]
[null,null,25203,210400,"Formulário Continuo Branco 80 colunas 1 via",141000,"2021-03-10","2021-03-10","finalizado","SP","EXPEDIDO"]
[null,null,25204,210400,"Formulário Continuo Razão Esdeva, 3 vias, 80 colunas, 56g/m2",10000,"2021-03-10","2021-03-29","finalizado","SP","EXPEDIDO"]
[null,null,25205,210385,"Form Cont Branco 2 vias 80 colunas autocop Staples",150000,"2021-03-15","pendencia de papel e AGUARDANDO MANUSEIO","Passando para p carro de Abril","SP"]
[null,null,25349,211372,"Envelope ATM Bradesco Entrega Cheque Custodia PCT 250",70250,"2021-03-22","2021-03-26","falta shirink","SP","EXPEDIDO"]
[null,null,25351,211377,"Envelope ATM  Bradesco Acerto em Dinheiro PCT 250",25000,"2021-03-22","2021-03-26","falta shirink","SP","EXPEDIDO"]
{"$rows_left_out":30}
{"sheet":"CARROS (ABRIL 2021)","index":6,"n_rows":47,"n_cols":12,"rows_kept":47,"cut":false,"hidden":true,"merged":[[0,2,0,10],[1,1,18,1],[19,2,19,10],[21,1,41,1],[10,6,13,6]]}
[null,null,"BR SUPPLY "]
[null,"CARRO 1","OP","OC","DESCRIÇÃO","Quantidade total do Pedido","DATA ENTREGA CLIENTE","REALIZAR AGENDAMENTO PARA:","STATUS PRODUÇÃO ROTATEK","LOCAL DE ENTREGA","STATUS","AGENDAMENTO"]
[null,null,25495,212742,"Bobina Papel Calculadora Go Office 57mmx30m c/ 20un",7380,"2021-04-08","2021-04-27","finalizado","SP"]
[null,null,25492,212752,"Bobina Papel Calculadora Go Office 57mmx30m c/ 20un",7380,"2021-04-27","2021-04-27","finalizado","SP"]
[null,null,25477,212736,"Bobina Papel Calculadora Go Office 57mmx30m c/ 20un",6940,"2021-03-26","2021-04-27","finalizado","SP"]
[null,null,25352,211377,"Envelope ATM  Bradesco Acerto em Dinheiro PCT 250",75000,"2021-04-05","2021-04-05","finalizado","SP","EXPEDIDO"]
[null,null,25491,212821,"Envelope ATM  Bradesco Acerto em Dinheiro PCT 250",175000,"2021-04-09","2021-04-09","finalizado","SP","EXPEDIDO"]
[null,null,25350,211374,"Envelope ATM Bradesco Entrega Cheque Custodia PCT 250",75000,"2021-04-05","2021-04-05","finalizado","SP","EXPEDIDO"]
[null,null,25488,212822,"Envelope ATM Bradesco Entrega Cheque Custodia PCT 250",175000,"2021-04-09","2021-04-09","finalizado","SP","EXPEDIDO"]
[null,null,25205,210385,"Form Cont Branco 2 vias 80 colunas autocop Staples",150000,"2021-03-15","2021-04-30","coleta manuseadora dia 28/04","SP"]
[null,null,24766,206118,"Formulário Contínuo Esdeva Branco  1 via",135000,"Não foram expedido de acordo com os carros anteriores","2021-04-12","finalizado","SP","EXPEDIDO"]
[null,null,25203,210400,"Formulário Contínuo Branco 80 colunas",15000,null,"2021-04-12","finalizado","SP","EXPEDIDO"]
[null,null,24769,207066,"Bobina de Papel Go Office para Calculadora",2000,null,"2021-04-12","finalizado","SP","EXPEDIDO"]
[null,null,25378,210390,"Bobina Autocopiativa Go Office PDV",3000,null,"2021-04-12","finalizado","SP","EXPEDIDO"]
[null,null,25237,210800,"Formulário Continuo Branco 80 colunas 1 via",141000,"2021-04-12","2021-04-12","finalizado","SP","EXPEDIDO"]
[null,null,25693,212736,"Recibo de pagamento Esdeva LAB 02 s/ bloqueio cx c 3000jgs ",27000,"2021-03-26",null,"avaliando se iremos fazer na esdeva - aguardando retorno comercial","SP"]
[null,null,25581,212895,"Carta de Boas Vindas Saúde",60000,"2021-04-12","2021-04-19","impressão ok, aguardando shirink","SP","EXPEDIDO"]
[null,null,25722,217468,"Envelope Tamanho Ofício com Janela BVP PCT 5 - PRODUÇÃO EM SP",50000,"2021-04-12",null,"Vamos produzir em SP? Aguardando posicionamento Comercial.","SP"]
[]
[]
{"$rows_left_out":27}