{"text_format":"1","workbook":"xlsx","n_sheets":8,"sheets":["Configurações","Valores das Aulas","Comp. Ginástica - ALEXANDRA","Resumo - ALEXANDRA","Comp. Ginástica - JAQUELINE","Resumo - JAQUELINE","Comp. Ginástica - MARCELO","Resumo - MARCELO"],"not_rendered":{"charts":0,"images":0,"macros":1,"external_links":0,"defined_names":0,"comments":0,"pivot_tables":0},"unopened":[],"bounds":{"document_bytes":16777216,"sheet_cells":100000,"rows_first":2000,"rows_last":500,"rows_between":2000,"halvings":0,"cell_chars":16384,"cell_head_chars":4096},"cells_cut":0,"cells_raw":0,"read":"whole","date_system":"1900"}

{"sheet":"Configurações","index":0,"n_rows":24,"n_cols":23,"rows_kept":24,"cut":false,"hidden":false,"merged":[[1,9,1,14],[9,9,9,14],[17,9,17,13],[1,17,1,21]]}
[]
["Níveis",null,"Professores","Ginástica","Nat. Inf.","Nat. Ad","Hidrog","Registrado",null,"Valores da Ginástica",null,null,null,null,null,null,null,"Valores da Hidroginástica"]
["Nível A",null,"Alexandra Koerich da Silva","s","n","n","n",27,null,"Nível",0,"1 a 5","6 a 14","15 A 20","21 ou Mais",null,"Nível",0,"1 a 7","8 a 18","19 a 29","30 a 39","40 a 45"]
["Nível B",null,"Any Kelli Damasceno Motta","n","s","n","s",18,null,"Nível A",14.21,26.22,32.07,39.979999999999997,44.82,null,"Nível A",10.050000000000001,19.18,22.38,25.99,30.22,33.520000000000003]
["Nível C",null,"Cláudia de Bastos Ferreira","n","s","s","s",11.35,null,"Nível B",10.050000000000001,18.66,27.27,35.89,41.64,null,"Nível B",10.050000000000001,14.7,17.16,20.74,24.09,27.48]
["Nível D",null,"Felipe Kroetz Avelar","n","s","s","s",21,null,"Nível C",10.9,19.170000000000002,27.26,35.42,40.869999999999997,null,"Nível C",10.050000000000001,13.41,17.16,20.74,24.09,27.48]
["Nível E",null,"Jaqueline Iara da Silva","s","n","n","n",17,null,"Nível D",null,null,null,null,null,null,"Nível D"]
[null,null,"Luciano Silveira Nunes","n","s","s","n",14,null,"Nível E",null,null,null,null,null,null,"Nível E"]
[null,null,"Marcelo da Silva","s","s","s","s",15]
[null,null,null,null,null,null,null,null,null,"Valores da Natação Infantil"]
[null,null,null,null,null,null,null,null,null,"Nível",0,"1 a 3","4 a 6","7 a 12","13 a 20"]
[null,null,null,null,null,null,null,null,null,"Nível A",10.050000000000001,15.98,19.18,22.38,25.99]
[null,null,null,null,null,null,null,null,null,"Nível B",10.050000000000001,12.26,14.7,17.16,20.74,null,null,{"$f":"LEFT(C3,FIND(\" \",C3,1)-1)","v":"Alexandra"}]
[null,null,null,null,null,null,null,null,null,"Nível C",10.050000000000001,11.48,11.48,11.48,11.48,null,null,{"$f":"LEFT(C4,FIND(\" \",C4,1)-1)","v":"Any"}]
[null,null,null,null,null,null,null,null,null,"Nível D",null,null,null,null,null,null,null,"Cláudia"]
[null,null,null,null,null,null,null,null,null,"Nível E",null,null,null,null,null,null,null,"Felipe"]
[null,null,null,null,null,null,null,null,null,null,null,null,null,null,null,null,null,"Jaqueline"]
[null,null,null,null,null,null,null,null,null,"Valores da Natação Adulta",null,null,null,null,null,null,null,"Luciano"]
[null,null,null,null,null,null,null,null,null,"Nível",0,"1 a 3","4 a 5","6 a 8",null,null,null,"Marcelo"]
[null,null,null,null,null,null,null,null,null,"Nível A",10.050000000000001,15.98,19.18,22.38,null,null,null,{"$error":"#VALUE!"}]
{"$rows_left_out":5}
{"sheet":"Valores das Aulas","index":1,"n_rows":36,"n_cols":13,"rows_kept":36,"cut":false,"hidden":false,"merged":[[20,1,20,2],[29,1,29,2],[1,12,1,13],[1,1,1,8],[2,1,2,2],[11,1,11,2],[19,1,19,7],[3,1,3,2],[4,1,4,2],[5,1,5,2],[6,1,6,2],[8,1,8,2],[10,1,10,8],[28,1,28,9],[7,1,7,2],[12,1,12,2],[13,1,13,2],[14,1,14,2],[15,1,15,2],[16,1,16,2],[17,1,17,2],[21,1,21,2],[22,1,22,2],[23,1,23,2],[24,1,24,2],[25,1,25,2],[34,1,34,2],[35,1,35,2],[26,1,26,2],[30,1,30,2],[31,1,31,2],[32,1,32,2],[33,1,33,2]]}
[]
[null,"Valores de Aulas por Professor de Ginástica",null,null,null,null,null,null,null,null,"Mês de Referência",null,"2021-07-01"]
[null,"Professor / Aula",null,"Nível",{"$f":"Configurações!K3","v":0},{"$f":"Configurações!L3","v":"1 a 5"},{"$f":"Configurações!M3","v":"6 a 14"},{"$f":"Configurações!N3","v":"15 A 20"},{"$f":"Configurações!O3","v":"21 ou Mais"}]
[null,{"$f":"IFERROR(INDEX(Configurações!$C$3:$C$9,SMALL(IF(Configurações!$D$3:$D$9=\"S\",ROW(Configurações!$C$3:$C$9)-2),ROW($B1)),1),\"\")","v":"Alexandra Koerich da Silva"},null,"Nível A",{"$f":"IF($D$4<>\"\",VLOOKUP($D$4,Configurações!$J$4:$O$8,COLUMNS($D$4:D4)+1,0),0)","v":14.21},{"$f":"IF($D$4<>\"\",VLOOKUP($D$4,Configurações!$J$4:$O$8,COLUMNS($D$4:E4)+1,0),0)","v":26.22},{"$f":"IF($D$4<>\"\",VLOOKUP($D$4,Configurações!$J$4:$O$8,COLUMNS($D$4:F4)+1,0),0)","v":32.07},{"$f":"IF($D$4<>\"\",VLOOKUP($D$4,Configurações!$J$4:$O$8,COLUMNS($D$4:G4)+1,0),0)","v":39.979999999999997},{"$f":"IF($D$4<>\"\",VLOOKUP($D$4,Configurações!$J$4:$O$8,COLUMNS($D$4:H4)+1,0),0)","v":44.82}]
[null,{"$f":"IFERROR(INDEX(Configurações!$C$3:$C$9,SMALL(IF(Configurações!$D$3:$D$9=\"S\",ROW(Configurações!$C$3:$C$9)-2),ROW($B2)),1),\"\")","v":"Jaqueline Iara da Silva"},null,null,{"$f":"IF($D$5<>\"\",VLOOKUP($D$5,Configurações!$J$4:$O$8,COLUMNS($D$5:D5)+1,0),0)","v":0},{"$f":"IF($D$5<>\"\",VLOOKUP($D$5,Configurações!$J$4:$O$8,COLUMNS($D$5:E5)+1,0),0)","v":0},{"$f":"IF($D$5<>\"\",VLOOKUP($D$5,Configurações!$J$4:$O$8,COLUMNS($D$5:F5)+1,0),0)","v":0},{"$f":"IF($D$5<>\"\",VLOOKUP($D$5,Configurações!$J$4:$O$8,COLUMNS($D$5:G5)+1,0),0)","v":0},{"$f":"IF($D$5<>\"\",VLOOKUP($D$5,Configurações!$J$4:$O$8,COLUMNS($D$5:H5)+1,0),0)","v":0}]
[null,{"$f":"IFERROR(INDEX(Configurações!$C$3:$C$9,SMALL(IF(Configurações!$D$3:$D$9=\"S\",ROW(Configurações!$C$3:$C$9)-2),ROW($B3)),1),\"\")","v":"Marcelo da Silva"},null,null,{"$f":"IF($D$6<>\"\",VLOOKUP($D$6,Configurações!$J$4:$O$8,COLUMNS($D$6:D6)+1,0),0)","v":0},{"$f":"IF($D$6<>\"\",VLOOKUP($D$6,Configurações!$J$4:$O$8,COLUMNS($D$6:E6)+1,0),0)","v":0},{"$f":"IF($D$6<>\"\",VLOOKUP($D$6,Configurações!$J$4:$O$8,COLUMNS($D$6:F6)+1,0),0)","v":0},{"$f":"IF($D$6<>\"\",VLOOKUP($D$6,Configurações!$J$4:$O$8,COLUMNS($D$6:G6)+1,0),0)","v":0},{"$f":"IF($D$6<>\"\",VLOOKUP($D$6,Configurações!$J$4:$O$8,COLUMNS($D$6:H6)+1,0),0)","v":0}]
[null,{"$f":"IFERROR(INDEX(Configurações!$C$3:$C$9,SMALL(IF(Configurações!$D$3:$D$9=\"S\",ROW(Configurações!$C$3:$C$9)-2),ROW($B4)),1),\"\")","v":""},null,null,{"$f":"IF($D$7<>\"\",VLOOKUP($D$7,Configurações!$J$4:$O$8,COLUMNS($D$7:D7)+1,0),0)","v":0},{"$f":"IF($D$7<>\"\",VLOOKUP($D$7,Configurações!$J$4:$O$8,COLUMNS($D$7:E7)+1,0),0)","v":0},{"$f":"IF($D$7<>\"\",VLOOKUP($D$7,Configurações!$J$4:$O$8,COLUMNS($D$7:F7)+1,0),0)","v":0},{"$f":"IF($D$7<>\"\",VLOOKUP($D$7,Configurações!$J$4:$O$8,COLUMNS($D$7:G7)+1,0),0)","v":0},{"$f":"IF($D$7<>\"\",VLOOKUP($D$7,Configurações!$J$4:$O$8,COLUMNS($D$7:H7)+1,0),0)","v":0}]
[null,{"$f":"IFERROR(INDEX(Configurações!$C$3:$C$9,SMALL(IF(Configurações!$D$3:$D$9=\"S\",ROW(Configurações!$C$3:$C$9)-2),ROW($B5)),1),\"\")","v":""},null,null,{"$f":"IF($D$8<>\"\",VLOOKUP($D$8,Configurações!$J$4:$O$8,COLUMNS($D$8:D8)+1,0),0)","v":0},{"$f":"IF($D$8<>\"\",VLOOKUP($D$8,Configurações!$J$4:$O$8,COLUMNS($D$8:E8)+1,0),0)","v":0},{"$f":"IF($D$8<>\"\",VLOOKUP($D$8,Configurações!$J$4:$O$8,COLUMNS($D$8:F8)+1,0),0)","v":0},{"$f":"IF($D$8<>\"\",VLOOKUP($D$8,Configurações!$J$4:$O$8,COLUMNS($D$8:G8)+1,0),0)","v":0},{"$f":"IF($D$8<>\"\",VLOOKUP($D$8,Configurações!$J$4:$O$8,COLUMNS($D$8:H8)+1,0),0)","v":0}]
[null,{"$f":"IFERROR(INDEX(Configurações!$C$3:$C$9,SMALL(IF(Configurações!$D$3:$D$9=\"S\",ROW(Configurações!$C$3:$C$9)-2),ROW($B6)),1),\"\")","v":""},null,null,{"$f":"IF($D$9<>\"\",VLOOKUP($D$9,Configurações!$J$4:$O$8,COLUMNS($D$9:D9)+1,0),0)","v":0},{"$f":"IF($D$9<>\"\",VLOOKUP($D$9,Configurações!$J$4:$O$8,COLUMNS($D$9:E9)+1,0),0)","v":0},{"$f":"IF($D$9<>\"\",VLOOKUP($D$9,Configurações!$J$4:$O$8,COLUMNS($D$9:F9)+1,0),0)","v":0},{"$f":"IF($D$9<>\"\",VLOOKUP($D$9,Configurações!$J$4:$O$8,COLUMNS($D$9:G9)+1,0),0)","v":0},{"$f":"IF($D$9<>\"\",VLOOKUP($D$9,Configurações!$J$4:$O$8,COLUMNS($D$9:H9)+1,0),0)","v":0}]
[]
[null,"Valores de Aulas por Professor de Natação Infantil"]
[null,"Professor / Aula",null,"Nível",{"$f":"Configurações!K11","v":0},{"$f":"Configurações!L11","v":"1 a 3"},{"$f":"Configurações!M11","v":"4 a 6"},{"$f":"Configurações!N11","v":"7 a 12"},{"$f":"Configurações!O11","v":"13 a 20"}]
[null,{"$f":"IFERROR(INDEX(Configurações!$C$3:$C$9,SMALL(IF(Configurações!$E$3:$E$9=\"S\",ROW(Configurações!$C$3:$C$9)-2),ROW($B1)),1),\"\")","v":"Any Kelli Damasceno Motta"},null,null,{"$f":"IF($D$13<>\"\",VLOOKUP($D$13,Configurações!$J$12:$O$16,COLUMNS($D$13:D13)+1,0),0)","v":0},{"$f":"IF($D$13<>\"\",VLOOKUP($D$13,Configurações!$J$12:$O$16,COLUMNS($D$13:E13)+1,0),0)","v":0},{"$f":"IF($D$13<>\"\",VLOOKUP($D$13,Configurações!$J$12:$O$16,COLUMNS($D$13:F13)+1,0),0)","v":0},{"$f":"IF($D$13<>\"\",VLOOKUP($D$13,Configurações!$J$12:$O$16,COLUMNS($D$13:G13)+1,0),0)","v":0},{"$f":"IF($D$13<>\"\",VLOOKUP($D$13,Configurações!$J$12:$O$16,COLUMNS($D$13:H13)+1,0),0)","v":0}]
[null,{"$f":"IFERROR(INDEX(Configurações!$C$3:$C$9,SMALL(IF(Configurações!$E$3:$E$9=\"S\",ROW(Configurações!$C$3:$C$9)-2),ROW($B2)),1),\"\")","v":"Cláudia de Bastos Ferreira"},null,null,{"$f":"IF($D$14<>\"\",VLOOKUP($D$14,Configurações!$J$12:$O$16,COLUMNS($D$14:D14)+1,0),0)","v":0},{"$f":"IF($D$14<>\"\",VLOOKUP($D$14,Configurações!$J$12:$O$16,COLUMNS($D$14:E14)+1,0),0)","v":0},{"$f":"IF($D$14<>\"\",VLOOKUP($D$14,Configurações!$J$12:$O$16,COLUMNS($D$14:F14)+1,0),0)","v":0},{"$f":"IF($D$14<>\"\",VLOOKUP($D$14,Configurações!$J$12:$O$16,COLUMNS($D$14:G14)+1,0),0)","v":0},{"$f":"IF($D$14<>\"\",VLOOKUP($D$14,Configurações!$J$12:$O$16,COLUMNS($D$14:H14)+1,0),0)","v":0}]
[null,{"$f":"IFERROR(INDEX(Configurações!$C$3:$C$9,SMALL(IF(Configurações!$E$3:$E$9=\"S\",ROW(Configurações!$C$3:$C$9)-2),ROW($B3)),1),\"\")","v":"Felipe Kroetz Avelar"},null,null,{"$f":"IF($D$15<>\"\",VLOOKUP($D$15,Configurações!$J$12:$O$16,COLUMNS($D$15:D15)+1,0),0)","v":0},{"$f":"IF($D$15<>\"\",VLOOKUP($D$15,Configurações!$J$12:$O$16,COLUMNS($D$15:E15)+1,0),0)","v":0},{"$f":"IF($D$15<>\"\",VLOOKUP($D$15,Configurações!$J$12:$O$16,COLUMNS($D$15:F15)+1,0),0)","v":0},{"$f":"IF($D$15<>\"\",VLOOKUP($D$15,Configurações!$J$12:$O$16,COLUMNS($D$15:G15)+1,0),0)","v":0},{"$f":"IF($D$15<>\"\",VLOOKUP($D$15,Configurações!$J$12:$O$16,COLUMNS($D$15:H15)+1,0),0)","v":0}]
[null,{"$f":"IFERROR(INDEX(Configurações!$C$3:$C$9,SMALL(IF(Configurações!$E$3:$E$9=\"S\",ROW(Configurações!$C$3:$C$9)-2),ROW($B4)),1),\"\")","v":"Luciano Silveira Nunes"},null,null,{"$f":"IF($D$16<>\"\",VLOOKUP($D$16,Configurações!$J$12:$O$16,COLUMNS($D$16:D16)+1,0),0)","v":0},{"$f":"IF($D$16<>\"\",VLOOKUP($D$16,Configurações!$J$12:$O$16,COLUMNS($D$16:E16)+1,0),0)","v":0},{"$f":"IF($D$16<>\"\",VLOOKUP($D$16,Configurações!$J$12:$O$16,COLUMNS($D$16:F16)+1,0),0)","v":0},{"$f":"IF($D$16<>\"\",VLOOKUP($D$16,Configurações!$J$12:$O$16,COLUMNS($D$16:G16)+1,0),0)","v":0},{"$f":"IF($D$16<>\"\",VLOOKUP($D$16,Configurações!$J$12:$O$16,COLUMNS($D$16:H16)+1,0),0)","v":0}]
[null,{"$f":"IFERROR(INDEX(Configurações!$C$3:$C$9,SMALL(IF(Configurações!$E$3:$E$9=\"S\",ROW(Configurações!$C$3:$C$9)-2),ROW($B5)),1),\"\")","v":"Marcelo da Silva"},null,null,{"$f":"IF($D$17<>\"\",VLOOKUP($D$17,Configurações!$J$12:$O$16,COLUMNS($D$17:D17)+1,0),0)","v":0},{"$f":"IF($D$17<>\"\",VLOOKUP($D$17,Configurações!$J$12:$O$16,COLUMNS($D$17:E17)+1,0),0)","v":0},{"$f":"IF($D$17<>\"\",VLOOKUP($D$17,Configurações!$J$12:$O$16,COLUMNS($D$17:F17)+1,0),0)","v":0},{"$f":"IF($D$17<>\"\",VLOOKUP($D$17,Configurações!$J$12:$O$16,COLUMNS($D$17:G17)+1,0),0)","v":0},{"$f":"IF($D$17<>\"\",VLOOKUP($D$17,Configurações!$J$12:$O$16,COLUMNS($D$17:H17)+1,0),0)","v":0}]
[null,{"$f":"IFERROR(INDEX(Configurações!$C$3:$C$9,SMALL(IF(Configurações!$E$3:$E$9=\"S\",ROW(Configurações!$C$3:$C$9)-2),ROW($B6)),1),\"\")","v":""},null,null,{"$f":"IF($D$18<>\"\",VLOOKUP($D$18,Configurações!$J$12:$O$16,COLUMNS($D$18:D18)+1,0),0)","v":0},{"$f":"IF($D$18<>\"\",VLOOKUP($D$18,Configurações!$J$12:$O$16,COLUMNS($D$18:E18)+1,0),0)","v":0},{"$f":"IF($D$18<>\"\",VLOOKUP($D$18,Configurações!$J$12:$O$16,COLUMNS($D$18:F18)+1,0),0)","v":0},{"$f":"IF($D$18<>\"\",VLOOKUP($D$18,Configurações!$J$12:$O$16,COLUMNS($D$18:G18)+1,0),0)","v":0},{"$f":"IF($D$18<>\"\",VLOOKUP($D$18,Configurações!$J$12:$O$16,COLUMNS($D$18:H18)+1,0),0)","v":0}]
[]
[null,"Valores de Aulas por Professor de Natação Adulta"]
{"$rows_left_out":17}
{"sheet":"Comp. Ginástica - ALEXANDRA","index":2,"n_rows":101,"n_cols":19,"rows_kept":101,"cut":false,"hidden":false,"merged":[[10,4,10,10],[22,12,22,13],[1,11,1,12],[20,12,20,13],[21,12,21,13],[10,12,10,18],[9,4,9,18],[15,13,15,15],[16,13,16,15],[17,13,17,15],[3,4,3,9]]}
[]
[null,"Nr. Alunos",null,null,null,null,null,null,null,null,null,{"$f":"'Valores das Aulas'!M2","v":"2021-07-01"}]
[null,0]
[null,1,null,null,"TABELA DE EQUIVALÊNCIA"]
[null,2,null,null,"Nr. Alunos",{"$f":"Configurações!K3","v":0},{"$f":"Configurações!L3","v":"1 a 5"},{"$f":"Configurações!M3","v":"6 a 14"},{"$f":"Configurações!N3","v":"15 A 20"},{"$f":"Configurações!O3","v":"21 ou Mais"}]
[null,3,null,null,"Aulas",{"$f":"COUNTIF(B3:B99,\"=0\")","v":1},{"$f":"COUNTIF(B3:B99,\">=1\")-COUNTIF(B3:B99,\">5\")","v":5},{"$f":"COUNTIF(B3:B99,\">=6\")-COUNTIF(B3:B99,\">14\")","v":9},{"$f":"COUNTIF(B3:B99,\">=15\")-COUNTIF(B3:B99,\">20\")","v":6},{"$f":"COUNTIF(B3:B99,\">=21\")","v":4}]
[null,4]
[null,5]
[null,6]
[null,7,null,null,{"$f":"\"Ginástica - \"&'Valores das Aulas'!B4","v":"Ginástica - Alexandra Koerich da Silva"}]
[null,8,null,null,"Academia",null,null,null,null,null,null,null,"Contabilidade"]
[null,9,null,null,"Nr. de Alunos",null,{"$f":"F5","v":0},{"$f":"G5","v":"1 a 5"},"6 a 14","15 A 20","21 ou Mais",null,"Nr. de Alunos",null,{"$f":"F5","v":0},{"$f":"G5","v":"1 a 5"},"6 a 14","15 A 20","21 ou Mais"]
[null,10,null,null,"Valor da Aula",null,{"$f":"'Valores das Aulas'!E4","v":14.21},{"$f":"'Valores das Aulas'!F4","v":26.22},{"$f":"'Valores das Aulas'!G4","v":32.07},{"$f":"'Valores das Aulas'!H4","v":39.979999999999997},{"$f":"'Valores das Aulas'!I4","v":44.82},null,"Valor da Aula",null,{"$f":"IF(G13<=Configurações!$H$3,0,G13-Configurações!$H$3)","v":0},{"$f":"IF(H13<=Configurações!$H$3,0,H13-Configurações!$H$3)","v":0},{"$f":"IF(I13<=Configurações!$H$3,0,I13-Configurações!$H$3)","v":5.07},{"$f":"IF(J13<=Configurações!$H$3,0,J13-Configurações!$H$3)","v":12.98},{"$f":"IF(K13<=Configurações!$H$3,0,K13-Configurações!$H$3)","v":17.82}]
[null,11,null,null,"Nr. de Aulas",null,{"$f":"F6","v":1},{"$f":"G6","v":5},9,6,4,null,"Nr. de Aulas",null,{"$f":"G14","v":1},{"$f":"H14","v":5},9,6,4]
[null,12,null,null,"Valor",null,{"$f":"G13*G14","v":14.21},{"$f":"H13*H14","v":131.1},288.63,239.88,179.28,null,"Valor",null,{"$f":"O13*O14","v":0},{"$f":"P13*P14","v":0},45.63,77.88,71.28]
[null,13,null,null,null,"Total de Alunos",null,null,null,{"$f":"B101","v":452},null,null,null,"Total de Alunos",null,null,null,{"$f":"J16","v":452}]
[null,14,null,null,null,"Total de Aulas",null,null,null,{"$f":"G14+H14+I14+J14+K14","v":25},null,null,null,"Total de Aulas",null,null,null,{"$f":"J17","v":25}]
[null,15,null,null,null,"Total a Receber",null,null,null,{"$f":"G15+H15+I15+J15+K15","v":853.1},null,null,null,"Total a Receber",null,null,null,{"$f":"O15+P15+Q15+R15+S15","v":194.79}]
[null,16]
[null,17]
{"$rows_left_out":82}
{"sheet":"Resumo - ALEXANDRA","index":3,"n_rows":10,"n_cols":5,"rows_kept":10,"cut":false,"hidden":false,"merged":[[2,2,2,4]]}
[]
[]
[null,null,{"$f":"\"Resumo - \"&'Valores das Aulas'!B4","v":"Resumo - Alexandra Koerich da Silva"}]
[null,null,"Aula","Academia","Contabilidade"]
[null,null,"Ginástica",{"$f":"'Comp. Ginástica - ALEXANDRA'!J18","v":853.1},{"$f":"'Comp. Ginástica - ALEXANDRA'!R18","v":194.79}]
[null,null,"Hidroginástica",0,0]
[null,null,"Natação Adulta",0,0]
[null,null,"Natação Infantil",0,0]
[]
[null,null,"TOTAL",{"$f":"SUM(D5:D9)","v":853.1},{"$f":"SUM(E5:E9)","v":194.79}]

{"sheet":"Comp. Ginástica - JAQUELINE","index":4,"n_rows":101,"n_cols":19,"rows_kept":101,"cut":false,"hidden":false,"merged":[[16,13,16,15],[17,13,17,15],[20,12,20,13],[21,12,21,13],[22,12,22,13],[1,11,1,12],[3,4,3,9],[9,4,9,18],[10,4,10,10],[10,12,10,18],[15,13,15,15]]}
[]
[null,"Nr. Alunos",null,null,null,null,null,null,null,null,null,{"$f":"'Valores das Aulas'!M2","v":"2021-07-01"}]
[null,0]
[null,1,null,null,"TABELA DE EQUIVALÊNCIA"]
[null,2,null,null,"Nr. Alunos",{"$f":"Configurações!K3","v":0},{"$f":"Configurações!L3","v":"1 a 5"},{"$f":"Configurações!M3","v":"6 a 14"},{"$f":"Configurações!N3","v":"15 A 20"},{"$f":"Configurações!O3","v":"21 ou Mais"}]
[null,3,null,null,"Aulas",{"$f":"COUNTIF(B3:B99,\"=0\")","v":1},{"$f":"COUNTIF(B3:B99,\">=1\")-COUNTIF(B3:B99,\">5\")","v":5},{"$f":"COUNTIF(B3:B99,\">=6\")-COUNTIF(B3:B99,\">14\")","v":9},{"$f":"COUNTIF(B3:B99,\">=15\")-COUNTIF(B3:B99,\">20\")","v":6},{"$f":"COUNTIF(B3:B99,\">=21\")","v":4}]
[null,4]
[null,5]
[null,6]
[null,7,null,null,{"$f":"\"Ginástica - \"&'Valores das Aulas'!B5","v":"Ginástica - Jaqueline Iara da Silva"}]
[null,8,null,null,"Academia",null,null,null,null,null,null,null,"Contabilidade"]
[null,9,null,null,"Nr. de Alunos",null,{"$f":"F5","v":0},{"$f":"G5","v":"1 a 5"},"6 a 14","15 A 20","21 ou Mais",null,"Nr. de Alunos",null,{"$f":"F5","v":0},{"$f":"G5","v":"1 a 5"},"6 a 14","15 A 20","21 ou Mais"]
[null,10,null,null,"Valor da Aula",null,{"$f":"'Valores das Aulas'!E5","v":0},{"$f":"'Valores das Aulas'!F5","v":0},{"$f":"'Valores das Aulas'!G5","v":0},{"$f":"'Valores das Aulas'!H5","v":0},{"$f":"'Valores das Aulas'!I5","v":0},null,"Valor da Aula",null,{"$f":"IF(G13<=Configurações!$H$3,0,G13-Configurações!$H$3)","v":0},{"$f":"IF(H13<=Configurações!$H$3,0,H13-Configurações!$H$3)","v":0},{"$f":"IF(I13<=Configurações!$H$3,0,I13-Configurações!$H$3)","v":0},{"$f":"IF(J13<=Configurações!$H$3,0,J13-Configurações!$H$3)","v":0},{"$f":"IF(K13<=Configurações!$H$3,0,K13-Configurações!$H$3)","v":0}]
[null,11,null,null,"Nr. de Aulas",null,{"$f":"F6","v":1},{"$f":"G6","v":5},9,6,4,null,"Nr. de Aulas",null,{"$f":"G14","v":1},{"$f":"H14","v":5},9,6,4]
[null,12,null,null,"Valor",null,{"$f":"G13*G14","v":0},{"$f":"H13*H14","v":0},0,0,0,null,"Valor",null,{"$f":"O13*O14","v":0},{"$f":"P13*P14","v":0},0,0,0]
[null,13,null,null,null,"Total de Alunos",null,null,null,{"$f":"B101","v":452},null,null,null,"Total de Alunos",null,null,null,{"$f":"J16","v":452}]
[null,14,null,null,null,"Total de Aulas",null,null,null,{"$f":"G14+H14+I14+J14+K14","v":25},null,null,null,"Total de Aulas",null,null,null,{"$f":"J17","v":25}]
[null,15,null,null,null,"Total a Receber",null,null,null,{"$f":"G15+H15+I15+J15+K15","v":0},null,null,null,"Total a Receber",null,null,null,{"$f":"O15+P15+Q15+R15+S15","v":0}]
[null,16]
[null,17]
{"$rows_left_out":82}
{"sheet":"Resumo - JAQUELINE","index":5,"n_rows":10,"n_cols":5,"rows_kept":10,"cut":false,"hidden":false,"merged":[[2,2,2,4]]}
[]
[]
[null,null,{"$f":"\"Resumo - \"&'Valores das Aulas'!B5","v":"Resumo - Jaqueline Iara da Silva"}]
[null,null,"Aula","Academia","Contabilidade"]
[null,null,"Ginástica",{"$f":"'Comp. Ginástica - ALEXANDRA'!J18","v":853.1},{"$f":"'Comp. Ginástica - ALEXANDRA'!R18","v":194.79}]
[null,null,"Hidroginástica",0,0]
[null,null,"Natação Adulta",0,0]
[null,null,"Natação Infantil",0,0]
[]
[null,null,"TOTAL",{"$f":"SUM(D5:D9)","v":853.1},{"$f":"SUM(E5:E9)","v":194.79}]

{"sheet":"Comp. Ginástica - MARCELO","index":6,"n_rows":101,"n_cols":19,"rows_kept":101,"cut":false,"hidden":false,"merged":[[16,13,16,15],[17,13,17,15],[20,12,20,13],[21,12,21,13],[22,12,22,13],[1,11,1,12],[3,4,3,9],[9,4,9,18],[10,4,10,10],[10,12,10,18],[15,13,15,15]]}
[]
[null,"Nr. Alunos",null,null,null,null,null,null,null,null,null,{"$f":"'Valores das Aulas'!M2","v":"2021-07-01"}]
[null,0]
[null,1,null,null,"TABELA DE EQUIVALÊNCIA"]
[null,2,null,null,"Nr. Alunos",{"$f":"Configurações!K3","v":0},{"$f":"Configurações!L3","v":"1 a 5"},{"$f":"Configurações!M3","v":"6 a 14"},{"$f":"Configurações!N3","v":"15 A 20"},{"$f":"Configurações!O3","v":"21 ou Mais"}]
[null,3,null,null,"Aulas",{"$f":"COUNTIF(B3:B99,\"=0\")","v":1},{"$f":"COUNTIF(B3:B99,\">=1\")-COUNTIF(B3:B99,\">5\")","v":5},{"$f":"COUNTIF(B3:B99,\">=6\")-COUNTIF(B3:B99,\">14\")","v":9},{"$f":"COUNTIF(B3:B99,\">=15\")-COUNTIF(B3:B99,\">20\")","v":6},{"$f":"COUNTIF(B3:B99,\">=21\")","v":4}]
[null,4]
[null,5]
[null,6]
[null,7,null,null,{"$f":"\"Ginástica - \"&'Valores das Aulas'!B6:C6","v":{"$error":"#VALUE!"}}]
[null,8,null,null,"Academia",null,null,null,null,null,null,null,"Contabilidade"]
[null,9,null,null,"Nr. de Alunos",null,{"$f":"F5","v":0},{"$f":"G5","v":"1 a 5"},"6 a 14","15 A 20","21 ou Mais",null,"Nr. de Alunos",null,{"$f":"F5","v":0},{"$f":"G5","v":"1 a 5"},"6 a 14","15 A 20","21 ou Mais"]
[null,10,null,null,"Valor da Aula",null,{"$f":"'Valores das Aulas'!E6","v":0},{"$f":"'Valores das Aulas'!F6","v":0},{"$f":"'Valores das Aulas'!G6","v":0},{"$f":"'Valores das Aulas'!H6","v":0},{"$f":"'Valores das Aulas'!I6","v":0},null,"Valor da Aula",null,{"$f":"IF(G13<=Configurações!$H$3,0,G13-Configurações!$H$3)","v":0},{"$f":"IF(H13<=Configurações!$H$3,0,H13-Configurações!$H$3)","v":0},{"$f":"IF(I13<=Configurações!$H$3,0,I13-Configurações!$H$3)","v":0},{"$f":"IF(J13<=Configurações!$H$3,0,J13-Configurações!$H$3)","v":0},{"$f":"IF(K13<=Configurações!$H$3,0,K13-Configurações!$H$3)","v":0}]
[null,11,null,null,"Nr. de Aulas",null,{"$f":"F6","v":1},{"$f":"G6","v":5},9,6,4,null,"Nr. de Aulas",null,{"$f":"G14","v":1},{"$f":"H14","v":5},9,6,4]
[null,12,null,null,"Valor",null,{"$f":"G13*G14","v":0},{"$f":"H13*H14","v":0},0,0,0,null,"Valor",null,{"$f":"O13*O14","v":0},{"$f":"P13*P14","v":0},0,0,0]
[null,13,null,null,null,"Total de Alunos",null,null,null,{"$f":"B101","v":452},null,null,null,"Total de Alunos",null,null,null,{"$f":"J16","v":452}]
[null,14,null,null,null,"Total de Aulas",null,null,null,{"$f":"G14+H14+I14+J14+K14","v":25},null,null,null,"Total de Aulas",null,null,null,{"$f":"J17","v":25}]
[null,15,null,null,null,"Total a Receber",null,null,null,{"$f":"G15+H15+I15+J15+K15","v":0},null,null,null,"Total a Receber",null,null,null,{"$f":"O15+P15+Q15+R15+S15","v":0}]
[null,16]
[null,17]
{"$rows_left_out":82}
{"sheet":"Resumo - MARCELO","index":7,"n_rows":10,"n_cols":5,"rows_kept":10,"cut":false,"hidden":false,"merged":[[2,2,2,4]]}
[]
[]
[null,null,{"$f":"\"Resumo - \"&'Valores das Aulas'!B6","v":"Resumo - Marcelo da Silva"}]
[null,null,"Aula","Academia","Contabilidade"]
[null,null,"Ginástica",{"$f":"'Comp. Ginástica - ALEXANDRA'!J18","v":853.1},{"$f":"'Comp. Ginástica - ALEXANDRA'!R18","v":194.79}]
[null,null,"Hidroginástica",0,0]
[null,null,"Natação Adulta",0,0]
[null,null,"Natação Infantil",0,0]
[]
[null,null,"TOTAL",{"$f":"SUM(D5:D9)","v":853.1},{"$f":"SUM(E5:E9)","v":194.79}]