{"text_format":"1","workbook":"xlsx","n_sheets":3,"sheets":["Inserir Pendencia NC","Registro Pendencia NC","Plan3"],"not_rendered":{"charts":0,"images":0,"macros":1,"external_links":0,"defined_names":1,"comments":0,"pivot_tables":0},"unopened":[],"bounds":{"document_bytes":16777216,"sheet_cells":100000,"rows_first":2000,"rows_last":500,"rows_between":2000,"halvings":0,"cell_chars":16384,"cell_head_chars":4096},"cells_cut":0,"cells_raw":0,"read":"whole","date_system":"1900"}

{"sheet":"Inserir Pendencia NC","index":0,"n_rows":20,"n_cols":16,"rows_kept":20,"cut":false,"hidden":false,"merged":[]}
[]
[]
[]
[]
[]
[]
[null,null,null,null,null,null,"Nº N.C","0001/2021"]
[null,null,null,null,null,null,"Data Encerramento",null,null,null,null,null,null,null,null,{"$f":"IF(H7=\"\",\"\",VLOOKUP(H7,'Registro Pendencia NC'!A7:W11859,22,0))","v":"Check List Ponte"}]
[null,null,null,null,null,null,"Data Reprogramação",null,null,null,null,null,null,null,null,{"$f":"IF(H7=\"\",\"\",VLOOKUP(H7,'Registro Pendencia NC'!A7:W11859,2,0))","v":"PR02"}]
[null,null,null,null,null,null,"Data Verificação",null,null,null,null,null,null,null,null,{"$f":"IF(H7=\"\",\"\",VLOOKUP(H7,'Registro Pendencia NC'!A7:W11859,3,0))","v":"2021-08-20"}]
[null,null,null,null,null,null,"Resultado Verificação",null,null,null,null,null,null,null,null,{"$f":"IF(H7=\"\",\"\",VLOOKUP(H7,'Registro Pendencia NC'!A7:W11859,4,0))","v":"2021-08-22"}]
[null,null,null,null,null,null,"Responsável Verificação",null,null,null,null,null,null,null,null,{"$f":"IF(H7=\"\",\"\",VLOOKUP(H7,'Registro Pendencia NC'!A7:W11859,5,0))","v":"2021-08-25"}]
[null,null,null,null,null,null,"Considerações Verificador",null,null,null,null,null,null,null,null,{"$f":"IF(H7=\"\",\"\",VLOOKUP(H7,'Registro Pendencia NC'!A7:W11859,6,0))","v":"Joaquim"}]
[null,null,null,null,null,null,null,null,null,null,null,null,null,null,null,{"$f":"IF(H7=\"\",\"\",VLOOKUP(H7,'Registro Pendencia NC'!A7:W11859,7,0))","v":"Elétrica"}]
[null,null,null,null,null,null,null,null,null,null,null,null,null,null,null,{"$f":"IF(H7=\"\",\"\",VLOOKUP(H7,'Registro Pendencia NC'!A7:W11859,8,0))","v":"Danos ao Meio Ambiente"}]
[null,null,null,null,null,null,null,null,null,null,null,null,null,null,null,{"$f":"IF(H7=\"\",\"\",VLOOKUP(H7,'Registro Pendencia NC'!A7:W11859,9,0))","v":"teste01"}]
[null,null,null,null,null,null,null,null,null,null,null,null,null,null,null,{"$f":"IF(H7=\"\",\"\",VLOOKUP(H7,'Registro Pendencia NC'!A7:W11859,10,0))","v":"teste02"}]
[null,null,null,null,null,null,null,null,null,null,null,null,null,null,null,{"$f":"IF(H7=\"\",\"\",VLOOKUP(H7,'Registro Pendencia NC'!A7:W11859,11,0))","v":"teste03"}]
[null,null,null,null,null,null,null,null,null,null,null,null,null,null,null,{"$f":"IF(H7=\"\",\"\",VLOOKUP(H7,'Registro Pendencia NC'!A7:W11859,12,0))","v":"Não"}]
[null,null,null,null,null,null,null,null,null,null,null,null,null,null,null,{"$f":"IF($H$7=\"\",\"\",INDEX('Registro Pendencia NC'!$A$7:$W$1048576,MATCH($H$7,'Registro Pendencia NC'!$M$6:$M$1048576,0),ROWS($A$7:A7)))","v":{"$error":"#N/A"}}]

{"sheet":"Registro Pendencia NC","index":1,"n_rows":16,"n_cols":23,"rows_kept":16,"cut":false,"hidden":false,"merged":[]}
[]
[]
[]
[]
[1,2,3,4,5,6,7,8,9,10,11,12,13,14,15,16,17,18,19,20,21,22,23]
["Nº NC","Equipto","Data da Não Conformidade","Prazo Início da Solução","Prazo Final da Solução","Responsável Pela N.C","Tema","Efeitos","Descrição da Não Conformidade","Descrição da Causa","Contra Medidas","Plano de Ação?","Data Encerramento","Data Reprogramação","Data Verificação","Resultado Verificação","Lead Time","Status","AG.Verificação?","Resp. Verificação","Considerações Verificador","Local Detecção da N.C","Data Incl"]
["0000/2019","XXXXXXXXXXXX","2019-09-06","2019-09-07","2019-09-08","XXXXXXXXXXX","XXXXXXXXX","XXXXXXXXXXX","XXXXXXXXXXXXXXXXX","XXXXXXXXXXXXX","XXXXXXXXXXXX","XXXXXXX","xxxxxxxxx","xxxxxxxxxx","xxxxxxxxx","xxxxxxx",{"$f":"IF(A7=\"\",\"\",(TODAY()-C7))","v":825},{"$f":"IF(A7=\"\",\"\",IF(AND(N7>M7,S7<>\"SIM\",P7<>\"Eficaz\"),\"EM ANDAMENTO\",IF(AND(P7=\"Não Eficaz\",M7<>\"\",S7=\"SIM\"),\"AG.VERIFICAÇÃO\",IF(AND(P7=\"Não Eficaz\",N7<>\"\"),\"EM ANDAMENTO\",IF(D7=\"\",\"AG.PRAZO\",IF(OR(D7<>\"\",M7=\"\"),IF(OR(P7=\"Não Eficaz\",S7=\"\"),\"EM ANDAMENTO\",IF(AND(M7<>\"\",P7=\"Eficaz\",S7=\"NÃO\"),\"CONCLUIDO\",IF(OR(O7=\"\",P7=\"Não Eficaz\"),\"AG.VERIFICAÇÃO\",\"\")))))))))","v":"EM ANDAMENTO"},{"$f":"IF(M7=\"\",\"\",IF(OR(O7=\"\",P7=\"Não Eficaz\"),\"SIM\",\"NÃO\"))","v":"NÃO"}]
["0001/2021","PR02","2021-08-20","2021-08-22","2021-08-25","Joaquim","Elétrica","Danos ao Meio Ambiente","teste01","teste02","teste03","Não",null,null,null,null,{"$f":"IF(A8=\"\",\"\",(TODAY()-C8))","v":111},{"$f":"IF(A8=\"\",\"\",IF(AND(N8>M8,S8<>\"SIM\",P8<>\"Eficaz\"),\"EM ANDAMENTO\",IF(AND(P8=\"Não Eficaz\",M8<>\"\",S8=\"SIM\"),\"AG.VERIFICAÇÃO\",IF(AND(P8=\"Não Eficaz\",N8<>\"\"),\"EM ANDAMENTO\",IF(D8=\"\",\"AG.PRAZO\",IF(OR(D8<>\"\",M8=\"\"),IF(OR(P8=\"Não Eficaz\",S8=\"\"),\"EM ANDAMENTO\",IF(AND(M8<>\"\",P8=\"Eficaz\",S8=\"NÃO\"),\"CONCLUIDO\",IF(OR(O8=\"\",P8=\"Não Eficaz\"),\"AG.VERIFICAÇÃO\",\"\")))))))))","v":"EM ANDAMENTO"},{"$f":"IF(M8=\"\",\"\",IF(OR(O8=\"\",P8=\"Não Eficaz\"),\"SIM\",\"NÃO\"))","v":""},null,null,"Check List Ponte","2021-08-25T15:22:27"]
["0001/2021","PR02","2021-08-20","2021-08-22","2021-08-25","Joaquim","Elétrica","Danos ao Meio Ambiente","teste01","teste02","teste03","Não",null,"2021-08-25",null,null,{"$f":"IF(A9=\"\",\"\",(TODAY()-C9))","v":111},{"$f":"IF(A9=\"\",\"\",IF(AND(N9>M9,S9<>\"SIM\",P9<>\"Eficaz\"),\"EM ANDAMENTO\",IF(AND(P9=\"Não Eficaz\",M9<>\"\",S9=\"SIM\"),\"AG.VERIFICAÇÃO\",IF(AND(P9=\"Não Eficaz\",N9<>\"\"),\"EM ANDAMENTO\",IF(D9=\"\",\"AG.PRAZO\",IF(OR(D9<>\"\",M9=\"\"),IF(OR(P9=\"Não Eficaz\",S9=\"\"),\"EM ANDAMENTO\",IF(AND(M9<>\"\",P9=\"Eficaz\",S9=\"NÃO\"),\"CONCLUIDO\",IF(OR(O9=\"\",P9=\"Não Eficaz\"),\"AG.VERIFICAÇÃO\",\"\")))))))))","v":"EM ANDAMENTO"},{"$f":"IF(M9=\"\",\"\",IF(OR(O9=\"\",P9=\"Não Eficaz\"),\"SIM\",\"NÃO\"))","v":""},null,null,"Check List Ponte"]
["0001/2021","PR02","2021-08-20","2021-08-22","2021-08-25","Joaquim","Elétrica","Danos ao Meio Ambiente","teste01","teste02","teste03","Não","2021-12-09",null,null,null,{"$f":"IF(A10=\"\",\"\",(TODAY()-C10))","v":111},{"$f":"IF(A10=\"\",\"\",IF(AND(N10>M10,S10<>\"SIM\",P10<>\"Eficaz\"),\"EM ANDAMENTO\",IF(AND(P10=\"Não Eficaz\",M10<>\"\",S10=\"SIM\"),\"AG.VERIFICAÇÃO\",IF(AND(P10=\"Não Eficaz\",N10<>\"\"),\"EM ANDAMENTO\",IF(D10=\"\",\"AG.PRAZO\",IF(OR(D10<>\"\",M10=\"\"),IF(OR(P10=\"Não Eficaz\",S10=\"\"),\"EM ANDAMENTO\",IF(AND(M10<>\"\",P10=\"Eficaz\",S10=\"NÃO\"),\"CONCLUIDO\",IF(OR(O10=\"\",P10=\"Não Eficaz\"),\"AG.VERIFICAÇÃO\",\"\")))))))))","v":"AG.VERIFICAÇÃO"},{"$f":"IF(M10=\"\",\"\",IF(OR(O10=\"\",P10=\"Não Eficaz\"),\"SIM\",\"NÃO\"))","v":"SIM"},null,null,"Check List Ponte"]
["0002/2021","PR03","2021-12-05","2021-12-06","2021-12-10","Joaquim","Mecânica","Descumprimento de Procedimento","TESTE01","TESTE02","TESTE03","Não",null,null,null,null,{"$f":"IF(A11=\"\",\"\",(TODAY()-C11))","v":4},{"$f":"IF(A11=\"\",\"\",IF(AND(N11>M11,S11<>\"SIM\",P11<>\"Eficaz\"),\"EM ANDAMENTO\",IF(AND(P11=\"Não Eficaz\",M11<>\"\",S11=\"SIM\"),\"AG.VERIFICAÇÃO\",IF(AND(P11=\"Não Eficaz\",N11<>\"\"),\"EM ANDAMENTO\",IF(D11=\"\",\"AG.PRAZO\",IF(OR(D11<>\"\",M11=\"\"),IF(OR(P11=\"Não Eficaz\",S11=\"\"),\"EM ANDAMENTO\",IF(AND(M11<>\"\",P11=\"Eficaz\",S11=\"NÃO\"),\"CONCLUIDO\",IF(OR(O11=\"\",P11=\"Não Eficaz\"),\"AG.VERIFICAÇÃO\",\"\")))))))))","v":"EM ANDAMENTO"},{"$f":"IF(M11=\"\",\"\",IF(OR(O11=\"\",P11=\"Não Eficaz\"),\"SIM\",\"NÃO\"))","v":""},null,null,"Check List Ponte","2021-12-06T09:30:44"]
["0003/2021","PR04","2021-12-06","2021-12-07","2021-12-15","Ramos","Elétrica","Operação Inadequada do Equipamento","TESTE01","TESTE02","TESTE03","Não",null,null,null,null,{"$f":"IF(A12=\"\",\"\",(TODAY()-C12))","v":3},{"$f":"IF(A12=\"\",\"\",IF(AND(N12>M12,S12<>\"SIM\",P12<>\"Eficaz\"),\"EM ANDAMENTO\",IF(AND(P12=\"Não Eficaz\",M12<>\"\",S12=\"SIM\"),\"AG.VERIFICAÇÃO\",IF(AND(P12=\"Não Eficaz\",N12<>\"\"),\"EM ANDAMENTO\",IF(D12=\"\",\"AG.PRAZO\",IF(OR(D12<>\"\",M12=\"\"),IF(OR(P12=\"Não Eficaz\",S12=\"\"),\"EM ANDAMENTO\",IF(AND(M12<>\"\",P12=\"Eficaz\",S12=\"NÃO\"),\"CONCLUIDO\",IF(OR(O12=\"\",P12=\"Não Eficaz\"),\"AG.VERIFICAÇÃO\",\"\")))))))))","v":"EM ANDAMENTO"},{"$f":"IF(M12=\"\",\"\",IF(OR(O12=\"\",P12=\"Não Eficaz\"),\"SIM\",\"NÃO\"))","v":""},null,null,"Check List Ponte","2021-12-06T09:31:56"]
["0004/2021","PR05","2021-12-06","2021-12-10","2021-12-20","Joaquim","Meio Ambiente","Danos ao Meio Ambiente","TESTE","TESTE","TESTE","Não",null,null,null,null,{"$f":"IF(A13=\"\",\"\",(TODAY()-C13))","v":3},{"$f":"IF(A13=\"\",\"\",IF(AND(N13>M13,S13<>\"SIM\",P13<>\"Eficaz\"),\"EM ANDAMENTO\",IF(AND(P13=\"Não Eficaz\",M13<>\"\",S13=\"SIM\"),\"AG.VERIFICAÇÃO\",IF(AND(P13=\"Não Eficaz\",N13<>\"\"),\"EM ANDAMENTO\",IF(D13=\"\",\"AG.PRAZO\",IF(OR(D13<>\"\",M13=\"\"),IF(OR(P13=\"Não Eficaz\",S13=\"\"),\"EM ANDAMENTO\",IF(AND(M13<>\"\",P13=\"Eficaz\",S13=\"NÃO\"),\"CONCLUIDO\",IF(OR(O13=\"\",P13=\"Não Eficaz\"),\"AG.VERIFICAÇÃO\",\"\")))))))))","v":"EM ANDAMENTO"},{"$f":"IF(M13=\"\",\"\",IF(OR(O13=\"\",P13=\"Não Eficaz\"),\"SIM\",\"NÃO\"))","v":""},null,null,"Check List Ponte","2021-12-06T09:33:00"]
["0005/2021","PR06","2021-12-05","2021-12-06","2021-12-07","Palomaço","Outros","Falta de Limpeza","TESTE","TESTE","TESTE","Não",null,null,null,null,{"$f":"IF(A14=\"\",\"\",(TODAY()-C14))","v":4},{"$f":"IF(A14=\"\",\"\",IF(AND(N14>M14,S14<>\"SIM\",P14<>\"Eficaz\"),\"EM ANDAMENTO\",IF(AND(P14=\"Não Eficaz\",M14<>\"\",S14=\"SIM\"),\"AG.VERIFICAÇÃO\",IF(AND(P14=\"Não Eficaz\",N14<>\"\"),\"EM ANDAMENTO\",IF(D14=\"\",\"AG.PRAZO\",IF(OR(D14<>\"\",M14=\"\"),IF(OR(P14=\"Não Eficaz\",S14=\"\"),\"EM ANDAMENTO\",IF(AND(M14<>\"\",P14=\"Eficaz\",S14=\"NÃO\"),\"CONCLUIDO\",IF(OR(O14=\"\",P14=\"Não Eficaz\"),\"AG.VERIFICAÇÃO\",\"\")))))))))","v":"EM ANDAMENTO"},{"$f":"IF(M14=\"\",\"\",IF(OR(O14=\"\",P14=\"Não Eficaz\"),\"SIM\",\"NÃO\"))","v":""},null,null,"Check List Ponte","2021-12-06T09:33:57"]
["0006/2021","PR07","2021-12-06","2021-12-08","2021-12-10","Ramos","Mecânica","Falta de Lubrificação","TESTE","TESTE","TESTE","Não",null,null,null,null,{"$f":"IF(A15=\"\",\"\",(TODAY()-C15))","v":3},{"$f":"IF(A15=\"\",\"\",IF(AND(N15>M15,S15<>\"SIM\",P15<>\"Eficaz\"),\"EM ANDAMENTO\",IF(AND(P15=\"Não Eficaz\",M15<>\"\",S15=\"SIM\"),\"AG.VERIFICAÇÃO\",IF(AND(P15=\"Não Eficaz\",N15<>\"\"),\"EM ANDAMENTO\",IF(D15=\"\",\"AG.PRAZO\",IF(OR(D15<>\"\",M15=\"\"),IF(OR(P15=\"Não Eficaz\",S15=\"\"),\"EM ANDAMENTO\",IF(AND(M15<>\"\",P15=\"Eficaz\",S15=\"NÃO\"),\"CONCLUIDO\",IF(OR(O15=\"\",P15=\"Não Eficaz\"),\"AG.VERIFICAÇÃO\",\"\")))))))))","v":"EM ANDAMENTO"},{"$f":"IF(M15=\"\",\"\",IF(OR(O15=\"\",P15=\"Não Eficaz\"),\"SIM\",\"NÃO\"))","v":""},null,null,"Check List Ponte","2021-12-06T09:35:04"]
["0007/2021","PR08","2021-12-06","2021-12-10","2021-12-13","Ramos","Operação","Operação Inadequada do Equipamento","TESTE","TESTE","TESTE","Não",null,null,null,null,{"$f":"IF(A16=\"\",\"\",(TODAY()-C16))","v":3},{"$f":"IF(A16=\"\",\"\",IF(AND(N16>M16,S16<>\"SIM\",P16<>\"Eficaz\"),\"EM ANDAMENTO\",IF(AND(P16=\"Não Eficaz\",M16<>\"\",S16=\"SIM\"),\"AG.VERIFICAÇÃO\",IF(AND(P16=\"Não Eficaz\",N16<>\"\"),\"EM ANDAMENTO\",IF(D16=\"\",\"AG.PRAZO\",IF(OR(D16<>\"\",M16=\"\"),IF(OR(P16=\"Não Eficaz\",S16=\"\"),\"EM ANDAMENTO\",IF(AND(M16<>\"\",P16=\"Eficaz\",S16=\"NÃO\"),\"CONCLUIDO\",IF(OR(O16=\"\",P16=\"Não Eficaz\"),\"AG.VERIFICAÇÃO\",\"\")))))))))","v":"EM ANDAMENTO"},{"$f":"IF(M16=\"\",\"\",IF(OR(O16=\"\",P16=\"Não Eficaz\"),\"SIM\",\"NÃO\"))","v":""},null,null,"Check List Ponte","2021-12-06T09:36:31"]

{"sheet":"Plan3","index":2,"n_rows":0,"n_cols":0,"rows_kept":0,"cut":false,"hidden":false,"merged":[]}