{"text_format":"1","workbook":"xlsx","n_sheets":3,"sheets":["Inserir Pendencia NC","Registro Pendencia NC","Plan3"],"not_rendered":{"charts":0,"images":0,"macros":1,"external_links":0,"defined_names":1,"comments":0,"pivot_tables":0},"unopened":[],"bounds":{"document_bytes":16777216,"sheet_cells":100000,"rows_first":2000,"rows_last":500,"rows_between":2000,"halvings":0,"cell_chars":16384,"cell_head_chars":4096},"cells_cut":0,"cells_raw":0,"read":"whole","date_system":"1900"}

{"sheet":"Inserir Pendencia NC","index":0,"n_rows":20,"n_cols":16,"rows_kept":20,"cut":false,"hidden":false,"merged":[]}
[]
[]
[]
[]
[]
[]
[null,null,null,null,null,null,"Nº N.C","0001/2021"]
[null,null,null,null,null,null,"Data Encerramento",null,null,null,null,null,null,null,null,{"$f":"IF(H7=\"\",\"\",VLOOKUP(H7,'Registro Pendencia NC'!A7:W11859,22,0))","v":"Check List Ponte"}]
[null,null,null,null,null,null,"Data Reprogramação",null,null,null,null,null,null,null,null,{"$f":"IF(H7=\"\",\"\",VLOOKUP(H7,'Registro Pendencia NC'!A7:W11859,2,0))","v":"PR02"}]
[null,null,null,null,null,null,"Data Verificação",null,null,null,null,null,null,null,null,{"$f":"IF(H7=\"\",\"\",VLOOKUP(H7,'Registro Pendencia NC'!A7:W11859,3,0))","v":"2021-08-20"}]
[null,null,null,null,null,null,"Resultado Verificação",null,null,null,null,null,null,null,null,{"$f":"IF(H7=\"\",\"\",VLOOKUP(H7,'Registro Pendencia NC'!A7:W11859,4,0))","v":"2021-08-22"}]
[null,null,null,null,null,null,"Responsável Verificação",null,null,null,null,null,null,null,null,{"$f":"IF(H7=\"\",\"\",VLOOKUP(H7,'Registro Pendencia NC'!A7:W11859,5,0))","v":"2021-08-25"}]
[null,null,null,null,null,null,"Considerações Verificador",null,null,null,null,null,null,null,null,{"$f":"IF(H7=\"\",\"\",VLOOKUP(H7,'Registro Pendencia NC'!A7:W11859,6,0))","v":"Joaquim"}]
[null,null,null,null,null,null,null,null,null,null,null,null,null,null,null,{"$f":"IF(H7=\"\",\"\",VLOOKUP(H7,'Registro Pendencia NC'!A7:W11859,7,0))","v":"Elétrica"}]
[null,null,null,null,null,null,null,null,null,null,null,null,null,null,null,{"$f":"IF(H7=\"\",\"\",VLOOKUP(H7,'Registro Pendencia NC'!A7:W11859,8,0))","v":"Danos ao Meio Ambiente"}]
[null,null,null,null,null,null,null,null,null,null,null,null,null,null,null,{"$f":"IF(H7=\"\",\"\",VLOOKUP(H7,'Registro Pendencia NC'!A7:W11859,9,0))","v":"teste01"}]
[null,null,null,null,null,null,null,null,null,null,null,null,null,null,null,{"$f":"IF(H7=\"\",\"\",VLOOKUP(H7,'Registro Pendencia NC'!A7:W11859,10,0))","v":"teste02"}]
[null,null,null,null,null,null,null,null,null,null,null,null,null,null,null,{"$f":"IF(H7=\"\",\"\",VLOOKUP(H7,'Registro Pendencia NC'!A7:W11859,11,0))","v":"teste03"}]
[null,null,null,null,null,null,null,null,null,null,null,null,null,null,null,{"$f":"IF(H7=\"\",\"\",VLOOKUP(H7,'Registro Pendencia NC'!A7:W11859,12,0))","v":"Não"}]
[null,null,null,null,null,null,null,null,null,null,null,null,null,null,null,{"$f":"IFERROR(INDEX('Registro Pendencia NC'!$M$7:$M$1000,MATCH(ROW(A1),'Registro Pendencia NC'!$X$7:$X$1000,0)),\"\")","v":"2021-12-09"}]

{"sheet":"Registro Pendencia NC","index":1,"n_rows":1000,"n_cols":24,"rows_kept":1000,"cut":false,"hidden":false,"merged":[]}
[]
[]
[]
[]
[1,2,3,4,5,6,7,8,9,10,11,12,13,14,15,16,17,18,19,20,21,22,23]
["Nº NC","Equipto","Data da Não Conformidade","Prazo Início da Solução","Prazo Final da Solução","Responsável Pela N.C","Tema","Efeitos","Descrição da Não Conformidade","Descrição da Causa","Contra Medidas","Plano de Ação?","Data Encerramento","Data Reprogramação","Data Verificação","Resultado Verificação","Lead Time","Status","AG.Verificação?","Resp. Verificação","Considerações Verificador","Local Detecção da N.C","Data Incl"]
["0000/2019","XXXXXXXXXXXX","2019-09-06","2019-09-07","2019-09-08","XXXXXXXXXXX","XXXXXXXXX","XXXXXXXXXXX","XXXXXXXXXXXXXXXXX","XXXXXXXXXXXXX","XXXXXXXXXXXX","XXXXXXX","xxxxxxxxx","xxxxxxxxxx","xxxxxxxxx","xxxxxxx",{"$f":"IF(A7=\"\",\"\",(TODAY()-C7))","v":826},{"$f":"IF(A7=\"\",\"\",IF(AND(N7>M7,S7<>\"SIM\",P7<>\"Eficaz\"),\"EM ANDAMENTO\",IF(AND(P7=\"Não Eficaz\",M7<>\"\",S7=\"SIM\"),\"AG.VERIFICAÇÃO\",IF(AND(P7=\"Não Eficaz\",N7<>\"\"),\"EM ANDAMENTO\",IF(D7=\"\",\"AG.PRAZO\",IF(OR(D7<>\"\",M7=\"\"),IF(OR(P7=\"Não Eficaz\",S7=\"\"),\"EM ANDAMENTO\",IF(AND(M7<>\"\",P7=\"Eficaz\",S7=\"NÃO\"),\"CONCLUIDO\",IF(OR(O7=\"\",P7=\"Não Eficaz\"),\"AG.VERIFICAÇÃO\",\"\")))))))))","v":"EM ANDAMENTO"},{"$f":"IF(M7=\"\",\"\",IF(OR(O7=\"\",P7=\"Não Eficaz\"),\"SIM\",\"NÃO\"))","v":"NÃO"},null,null,null,null,{"$f":"IF(AND($A7='Inserir Pendencia NC'!$H$7,'Registro Pendencia NC'!$M7<>\"\"),MAX($X$6:X6)+1,\"\")","v":""}]
["0001/2021","PR02","2021-08-20","2021-08-22","2021-08-25","Joaquim","Elétrica","Danos ao Meio Ambiente","teste01","teste02","teste03","Não",null,null,null,null,{"$f":"IF(A8=\"\",\"\",(TODAY()-C8))","v":112},{"$f":"IF(A8=\"\",\"\",IF(AND(N8>M8,S8<>\"SIM\",P8<>\"Eficaz\"),\"EM ANDAMENTO\",IF(AND(P8=\"Não Eficaz\",M8<>\"\",S8=\"SIM\"),\"AG.VERIFICAÇÃO\",IF(AND(P8=\"Não Eficaz\",N8<>\"\"),\"EM ANDAMENTO\",IF(D8=\"\",\"AG.PRAZO\",IF(OR(D8<>\"\",M8=\"\"),IF(OR(P8=\"Não Eficaz\",S8=\"\"),\"EM ANDAMENTO\",IF(AND(M8<>\"\",P8=\"Eficaz\",S8=\"NÃO\"),\"CONCLUIDO\",IF(OR(O8=\"\",P8=\"Não Eficaz\"),\"AG.VERIFICAÇÃO\",\"\")))))))))","v":"EM ANDAMENTO"},{"$f":"IF(M8=\"\",\"\",IF(OR(O8=\"\",P8=\"Não Eficaz\"),\"SIM\",\"NÃO\"))","v":""},null,null,"Check List Ponte","2021-08-25T15:22:27",{"$f":"IF(AND($A8='Inserir Pendencia NC'!$H$7,'Registro Pendencia NC'!$M8<>\"\"),MAX($X$6:X7)+1,\"\")","v":""}]
["0001/2021","PR02","2021-08-20","2021-08-22","2021-08-25","Joaquim","Elétrica","Danos ao Meio Ambiente","teste01","teste02","teste03","Não",null,"2021-08-25",null,null,{"$f":"IF(A9=\"\",\"\",(TODAY()-C9))","v":112},{"$f":"IF(A9=\"\",\"\",IF(AND(N9>M9,S9<>\"SIM\",P9<>\"Eficaz\"),\"EM ANDAMENTO\",IF(AND(P9=\"Não Eficaz\",M9<>\"\",S9=\"SIM\"),\"AG.VERIFICAÇÃO\",IF(AND(P9=\"Não Eficaz\",N9<>\"\"),\"EM ANDAMENTO\",IF(D9=\"\",\"AG.PRAZO\",IF(OR(D9<>\"\",M9=\"\"),IF(OR(P9=\"Não Eficaz\",S9=\"\"),\"EM ANDAMENTO\",IF(AND(M9<>\"\",P9=\"Eficaz\",S9=\"NÃO\"),\"CONCLUIDO\",IF(OR(O9=\"\",P9=\"Não Eficaz\"),\"AG.VERIFICAÇÃO\",\"\")))))))))","v":"EM ANDAMENTO"},{"$f":"IF(M9=\"\",\"\",IF(OR(O9=\"\",P9=\"Não Eficaz\"),\"SIM\",\"NÃO\"))","v":""},null,null,"Check List Ponte",null,{"$f":"IF(AND($A9='Inserir Pendencia NC'!$H$7,'Registro Pendencia NC'!$M9<>\"\"),MAX($X$6:X8)+1,\"\")","v":""}]
["0001/2021","PR02","2021-08-20","2021-08-22","2021-08-25","Joaquim","Elétrica","Danos ao Meio Ambiente","teste01","teste02","teste03","Não","2021-12-09",null,null,null,112,"AG.VERIFICAÇÃO","SIM",null,null,"Check List Ponte",null,{"$f":"IF(AND($A10='Inserir Pendencia NC'!$H$7,'Registro Pendencia NC'!$M10<>\"\"),MAX($X$6:X9)+1,\"\")","v":1}]
["0002/2021","PR03","2021-12-05","2021-12-06","2021-12-10","Joaquim","Mecânica","Descumprimento de Procedimento","TESTE01","TESTE02","TESTE03","Não",null,null,null,null,5,"EM ANDAMENTO","",null,null,"Check List Ponte","2021-12-06T09:30:44",{"$f":"IF(AND($A11='Inserir Pendencia NC'!$H$7,'Registro Pendencia NC'!$M11<>\"\"),MAX($X$6:X10)+1,\"\")","v":""}]
["0003/2021","PR04","2021-12-06","2021-12-07","2021-12-15","Ramos","Elétrica","Operação Inadequada do Equipamento","TESTE01","TESTE02","TESTE03","Não",null,null,null,null,4,"EM ANDAMENTO","",null,null,"Check List Ponte","2021-12-06T09:31:56",{"$f":"IF(AND($A12='Inserir Pendencia NC'!$H$7,'Registro Pendencia NC'!$M12<>\"\"),MAX($X$6:X11)+1,\"\")","v":""}]
["0004/2021","PR05","2021-12-06","2021-12-10","2021-12-20","Joaquim","Meio Ambiente","Danos ao Meio Ambiente","TESTE","TESTE","TESTE","Não",null,null,null,null,4,"EM ANDAMENTO","",null,null,"Check List Ponte","2021-12-06T09:33:00",{"$f":"IF(AND($A13='Inserir Pendencia NC'!$H$7,'Registro Pendencia NC'!$M13<>\"\"),MAX($X$6:X12)+1,\"\")","v":""}]
["0005/2021","PR06","2021-12-05","2021-12-06","2021-12-07","Palomaço","Outros","Falta de Limpeza","TESTE","TESTE","TESTE","Não",null,null,null,null,5,"EM ANDAMENTO","",null,null,"Check List Ponte","2021-12-06T09:33:57",{"$f":"IF(AND($A14='Inserir Pendencia NC'!$H$7,'Registro Pendencia NC'!$M14<>\"\"),MAX($X$6:X13)+1,\"\")","v":""}]
["0006/2021","PR07","2021-12-06","2021-12-08","2021-12-10","Ramos","Mecânica","Falta de Lubrificação","TESTE","TESTE","TESTE","Não",null,null,null,null,4,"EM ANDAMENTO","",null,null,"Check List Ponte","2021-12-06T09:35:04",{"$f":"IF(AND($A15='Inserir Pendencia NC'!$H$7,'Registro Pendencia NC'!$M15<>\"\"),MAX($X$6:X14)+1,\"\")","v":""}]
["0007/2021","PR08","2021-12-06","2021-12-10","2021-12-13","Ramos","Operação","Operação Inadequada do Equipamento","TESTE","TESTE","TESTE","Não",null,null,null,null,4,"EM ANDAMENTO","",null,null,"Check List Ponte","2021-12-06T09:36:31",{"$f":"IF(AND($A16='Inserir Pendencia NC'!$H$7,'Registro Pendencia NC'!$M16<>\"\"),MAX($X$6:X15)+1,\"\")","v":""}]
[null,null,null,null,null,null,null,null,null,null,null,null,null,null,null,null,null,null,null,null,null,null,null,{"$f":"IF(AND($A17='Inserir Pendencia NC'!$H$7,'Registro Pendencia NC'!$M17<>\"\"),MAX($X$6:X16)+1,\"\")","v":""}]
[null,null,null,null,null,null,null,null,null,null,null,null,null,null,null,null,null,null,null,null,null,null,null,{"$f":"IF(AND($A18='Inserir Pendencia NC'!$H$7,'Registro Pendencia NC'!$M18<>\"\"),MAX($X$6:X17)+1,\"\")","v":""}]
[null,null,null,null,null,null,null,null,null,null,null,null,null,null,null,null,null,null,null,null,null,null,null,{"$f":"IF(AND($A19='Inserir Pendencia NC'!$H$7,'Registro Pendencia NC'!$M19<>\"\"),MAX($X$6:X18)+1,\"\")","v":""}]
[null,null,null,null,null,null,null,null,null,null,null,null,null,null,null,null,null,null,null,null,null,null,null,{"$f":"IF(AND($A20='Inserir Pendencia NC'!$H$7,'Registro Pendencia NC'!$M20<>\"\"),MAX($X$6:X19)+1,\"\")","v":""}]
[null,null,null,null,null,null,null,null,null,null,null,null,null,null,null,null,null,null,null,null,null,null,null,{"$f":"IF(AND($A21='Inserir Pendencia NC'!$H$7,'Registro Pendencia NC'!$M21<>\"\"),MAX($X$6:X20)+1,\"\")","v":""}]
[null,null,null,null,null,null,null,null,null,null,null,null,null,null,null,null,null,null,null,null,null,null,null,{"$f":"IF(AND($A22='Inserir Pendencia NC'!$H$7,'Registro Pendencia NC'!$M22<>\"\"),MAX($X$6:X21)+1,\"\")","v":""}]
[null,null,null,null,null,null,null,null,null,null,null,null,null,null,null,null,null,null,null,null,null,null,null,{"$f":"IF(AND($A23='Inserir Pendencia NC'!$H$7,'Registro Pendencia NC'!$M23<>\"\"),MAX($X$6:X22)+1,\"\")","v":""}]
[null,null,null,null,null,null,null,null,null,null,null,null,null,null,null,null,null,null,null,null,null,null,null,{"$f":"IF(AND($A24='Inserir Pendencia NC'!$H$7,'Registro Pendencia NC'!$M24<>\"\"),MAX($X$6:X23)+1,\"\")","v":""}]
[null,null,null,null,null,null,null,null,null,null,null,null,null,null,null,null,null,null,null,null,null,null,null,{"$f":"IF(AND($A25='Inserir Pendencia NC'!$H$7,'Registro Pendencia NC'!$M25<>\"\"),MAX($X$6:X24)+1,\"\")","v":""}]
[null,null,null,null,null,null,null,null,null,null,null,null,null,null,null,null,null,null,null,null,null,null,null,{"$f":"IF(AND($A26='Inserir Pendencia NC'!$H$7,'Registro Pendencia NC'!$M26<>\"\"),MAX($X$6:X25)+1,\"\")","v":""}]
[null,null,null,null,null,null,null,null,null,null,null,null,null,null,null,null,null,null,null,null,null,null,null,{"$f":"IF(AND($A27='Inserir Pendencia NC'!$H$7,'Registro Pendencia NC'!$M27<>\"\"),MAX($X$6:X26)+1,\"\")","v":""}]
[null,null,null,null,null,null,null,null,null,null,null,null,null,null,null,null,null,null,null,null,null,null,null,{"$f":"IF(AND($A28='Inserir Pendencia NC'!$H$7,'Registro Pendencia NC'!$M28<>\"\"),MAX($X$6:X27)+1,\"\")","v":""}]
[null,null,null,null,null,null,null,null,null,null,null,null,null,null,null,null,null,null,null,null,null,null,null,{"$f":"IF(AND($A29='Inserir Pendencia NC'!$H$7,'Registro Pendencia NC'!$M29<>\"\"),MAX($X$6:X28)+1,\"\")","v":""}]
[null,null,null,null,null,null,null,null,null,null,null,null,null,null,null,null,null,null,null,null,null,null,null,{"$f":"IF(AND($A30='Inserir Pendencia NC'!$H$7,'Registro Pendencia NC'!$M30<>\"\"),MAX($X$6:X29)+1,\"\")","v":""}]
[null,null,null,null,null,null,null,null,null,null,null,null,null,null,null,null,null,null,null,null,null,null,null,{"$f":"IF(AND($A31='Inserir Pendencia NC'!$H$7,'Registro Pendencia NC'!$M31<>\"\"),MAX($X$6:X30)+1,\"\")","v":""}]
[null,null,null,null,null,null,null,null,null,null,null,null,null,null,null,null,null,null,null,null,null,null,null,{"$f":"IF(AND($A32='Inserir Pendencia NC'!$H$7,'Registro Pendencia NC'!$M32<>\"\"),MAX($X$6:X31)+1,\"\")","v":""}]
[null,null,null,null,null,null,null,null,null,null,null,null,null,null,null,null,null,null,null,null,null,null,null,{"$f":"IF(AND($A33='Inserir Pendencia NC'!$H$7,'Registro Pendencia NC'!$M33<>\"\"),MAX($X$6:X32)+1,\"\")","v":""}]
[null,null,null,null,null,null,null,null,null,null,null,null,null,null,null,null,null,null,null,null,null,null,null,{"$f":"IF(AND($A34='Inserir Pendencia NC'!$H$7,'Registro Pendencia NC'!$M34<>\"\"),MAX($X$6:X33)+1,\"\")","v":""}]
[null,null,null,null,null,null,null,null,null,null,null,null,null,null,null,null,null,null,null,null,null,null,null,{"$f":"IF(AND($A35='Inserir Pendencia NC'!$H$7,'Registro Pendencia NC'!$M35<>\"\"),MAX($X$6:X34)+1,\"\")","v":""}]
[null,null,null,null,null,null,null,null,null,null,null,null,null,null,null,null,null,null,null,null,null,null,null,{"$f":"IF(AND($A36='Inserir Pendencia NC'!$H$7,'Registro Pendencia NC'!$M36<>\"\"),MAX($X$6:X35)+1,\"\")","v":""}]
[null,null,null,null,null,null,null,null,null,null,null,null,null,null,null,null,null,null,null,null,null,null,null,{"$f":"IF(AND($A37='Inserir Pendencia NC'!$H$7,'Registro Pendencia NC'!$M37<>\"\"),MAX($X$6:X36)+1,\"\")","v":""}]
[null,null,null,null,null,null,null,null,null,null,null,null,null,null,null,null,null,null,null,null,null,null,null,{"$f":"IF(AND($A38='Inserir Pendencia NC'!$H$7,'Registro Pendencia NC'!$M38<>\"\"),MAX($X$6:X37)+1,\"\")","v":""}]
[null,null,null,null,null,null,null,null,null,null,null,null,null,null,null,null,null,null,null,null,null,null,null,{"$f":"IF(AND($A39='Inserir Pendencia NC'!$H$7,'Registro Pendencia NC'!$M39<>\"\"),MAX($X$6:X38)+1,\"\")","v":""}]
[null,null,null,null,null,null,null,null,null,null,null,null,null,null,null,null,null,null,null,null,null,null,null,{"$f":"IF(AND($A40='Inserir Pendencia NC'!$H$7,'Registro Pendencia NC'!$M40<>\"\"),MAX($X$6:X39)+1,\"\")","v":""}]
[null,null,null,null,null,null,null,null,null,null,null,null,null,null,null,null,null,null,null,null,null,null,null,{"$f":"IF(AND($A41='Inserir Pendencia NC'!$H$7,'Registro Pendencia NC'!$M41<>\"\"),MAX($X$6:X40)+1,\"\")","v":""}]
[null,null,null,null,null,null,null,null,null,null,null,null,null,null,null,null,null,null,null,null,null,null,null,{"$f":"IF(AND($A42='Inserir Pendencia NC'!$H$7,'Registro Pendencia NC'!$M42<>\"\"),MAX($X$6:X41)+1,\"\")","v":""}]
[null,null,null,null,null,null,null,null,null,null,null,null,null,null,null,null,null,null,null,null,null,null,null,{"$f":"IF(AND($A43='Inserir Pendencia NC'!$H$7,'Registro Pendencia NC'!$M43<>\"\"),MAX($X$6:X42)+1,\"\")","v":""}]
[null,null,null,null,null,null,null,null,null,null,null,null,null,null,null,null,null,null,null,null,null,null,null,{"$f":"IF(AND($A44='Inserir Pendencia NC'!$H$7,'Registro Pendencia NC'!$M44<>\"\"),MAX($X$6:X43)+1,\"\")","v":""}]
[null,null,null,null,null,null,null,null,null,null,null,null,null,null,null,null,null,null,null,null,null,null,null,{"$f":"IF(AND($A45='Inserir Pendencia NC'!$H$7,'Registro Pendencia NC'!$M45<>\"\"),MAX($X$6:X44)+1,\"\")","v":""}]
[null,null,null,null,null,null,null,null,null,null,null,null,null,null,null,null,null,null,null,null,null,null,null,{"$f":"IF(AND($A46='Inserir Pendencia NC'!$H$7,'Registro Pendencia NC'!$M46<>\"\"),MAX($X$6:X45)+1,\"\")","v":""}]
[null,null,null,null,null,null,null,null,null,null,null,null,null,null,null,null,null,null,null,null,null,null,null,{"$f":"IF(AND($A47='Inserir Pendencia NC'!$H$7,'Registro Pendencia NC'!$M47<>\"\"),MAX($X$6:X46)+1,\"\")","v":""}]
[null,null,null,null,null,null,null,null,null,null,null,null,null,null,null,null,null,null,null,null,null,null,null,{"$f":"IF(AND($A48='Inserir Pendencia NC'!$H$7,'Registro Pendencia NC'!$M48<>\"\"),MAX($X$6:X47)+1,\"\")","v":""}]
[null,null,null,null,null,null,null,null,null,null,null,null,null,null,null,null,null,null,null,null,null,null,null,{"$f":"IF(AND($A49='Inserir Pendencia NC'!$H$7,'Registro Pendencia NC'!$M49<>\"\"),MAX($X$6:X48)+1,\"\")","v":""}]
[null,null,null,null,null,null,null,null,null,null,null,null,null,null,null,null,null,null,null,null,null,null,null,{"$f":"IF(AND($A50='Inserir Pendencia NC'!$H$7,'Registro Pendencia NC'!$M50<>\"\"),MAX($X$6:X49)+1,\"\")","v":""}]
[null,null,null,null,null,null,null,null,null,null,null,null,null,null,null,null,null,null,null,null,null,null,null,{"$f":"IF(AND($A51='Inserir Pendencia NC'!$H$7,'Registro Pendencia NC'!$M51<>\"\"),MAX($X$6:X50)+1,\"\")","v":""}]
[null,null,null,null,null,null,null,null,null,null,null,null,null,null,null,null,null,null,null,null,null,null,null,{"$f":"IF(AND($A52='Inserir Pendencia NC'!$H$7,'Registro Pendencia NC'!$M52<>\"\"),MAX($X$6:X51)+1,\"\")","v":""}]
[null,null,null,null,null,null,null,null,null,null,null,null,null,null,null,null,null,null,null,null,null,null,null,{"$f":"IF(AND($A53='Inserir Pendencia NC'!$H$7,'Registro Pendencia NC'!$M53<>\"\"),MAX($X$6:X52)+1,\"\")","v":""}]
[null,null,null,null,null,null,null,null,null,null,null,null,null,null,null,null,null,null,null,null,null,null,null,{"$f":"IF(AND($A54='Inserir Pendencia NC'!$H$7,'Registro Pendencia NC'!$M54<>\"\"),MAX($X$6:X53)+1,\"\")","v":""}]
[null,null,null,null,null,null,null,null,null,null,null,null,null,null,null,null,null,null,null,null,null,null,null,{"$f":"IF(AND($A55='Inserir Pendencia NC'!$H$7,'Registro Pendencia NC'!$M55<>\"\"),MAX($X$6:X54)+1,\"\")","v":""}]
[null,null,null,null,null,null,null,null,null,null,null,null,null,null,null,null,null,null,null,null,null,null,null,{"$f":"IF(AND($A56='Inserir Pendencia NC'!$H$7,'Registro Pendencia NC'!$M56<>\"\"),MAX($X$6:X55)+1,\"\")","v":""}]
[null,null,null,null,null,null,null,null,null,null,null,null,null,null,null,null,null,null,null,null,null,null,null,{"$f":"IF(AND($A57='Inserir Pendencia NC'!$H$7,'Registro Pendencia NC'!$M57<>\"\"),MAX($X$6:X56)+1,\"\")","v":""}]
[null,null,null,null,null,null,null,null,null,null,null,null,null,null,null,null,null,null,null,null,null,null,null,{"$f":"IF(AND($A58='Inserir Pendencia NC'!$H$7,'Registro Pendencia NC'!$M58<>\"\"),MAX($X$6:X57)+1,\"\")","v":""}]
[null,null,null,null,null,null,null,null,null,null,null,null,null,null,null,null,null,null,null,null,null,null,null,{"$f":"IF(AND($A59='Inserir Pendencia NC'!$H$7,'Registro Pendencia NC'!$M59<>\"\"),MAX($X$6:X58)+1,\"\")","v":""}]
[null,null,null,null,null,null,null,null,null,null,null,null,null,null,null,null,null,null,null,null,null,null,null,{"$f":"IF(AND($A60='Inserir Pendencia NC'!$H$7,'Registro Pendencia NC'!$M60<>\"\"),MAX($X$6:X59)+1,\"\")","v":""}]
[null,null,null,null,null,null,null,null,null,null,null,null,null,null,null,null,null,null,null,null,null,null,null,{"$f":"IF(AND($A61='Inserir Pendencia NC'!$H$7,'Registro Pendencia NC'!$M61<>\"\"),MAX($X$6:X60)+1,\"\")","v":""}]
[null,null,null,null,null,null,null,null,null,null,null,null,null,null,null,null,null,null,null,null,null,null,null,{"$f":"IF(AND($A62='Inserir Pendencia NC'!$H$7,'Registro Pendencia NC'!$M62<>\"\"),MAX($X$6:X61)+1,\"\")","v":""}]
[null,null,null,null,null,null,null,null,null,null,null,null,null,null,null,null,null,null,null,null,null,null,null,{"$f":"IF(AND($A63='Inserir Pendencia NC'!$H$7,'Registro Pendencia NC'!$M63<>\"\"),MAX($X$6:X62)+1,\"\")","v":""}]
[null,null,null,null,null,null,null,null,null,null,null,null,null,null,null,null,null,null,null,null,null,null,null,{"$f":"IF(AND($A64='Inserir Pendencia NC'!$H$7,'Registro Pendencia NC'!$M64<>\"\"),MAX($X$6:X63)+1,\"\")","v":""}]
[null,null,null,null,null,null,null,null,null,null,null,null,null,null,null,null,null,null,null,null,null,null,null,{"$f":"IF(AND($A65='Inserir Pendencia NC'!$H$7,'Registro Pendencia NC'!$M65<>\"\"),MAX($X$6:X64)+1,\"\")","v":""}]
[null,null,null,null,null,null,null,null,null,null,null,null,null,null,null,null,null,null,null,null,null,null,null,{"$f":"IF(AND($A66='Inserir Pendencia NC'!$H$7,'Registro Pendencia NC'!$M66<>\"\"),MAX($X$6:X65)+1,\"\")","v":""}]
[null,null,null,null,null,null,null,null,null,null,null,null,null,null,null,null,null,null,null,null,null,null,null,{"$f":"IF(AND($A67='Inserir Pendencia NC'!$H$7,'Registro Pendencia NC'!$M67<>\"\"),MAX($X$6:X66)+1,\"\")","v":""}]
[null,null,null,null,null,null,null,null,null,null,null,null,null,null,null,null,null,null,null,null,null,null,null,{"$f":"IF(AND($A68='Inserir Pendencia NC'!$H$7,'Registro Pendencia NC'!$M68<>\"\"),MAX($X$6:X67)+1,\"\")","v":""}]
[null,null,null,null,null,null,null,null,null,null,null,null,null,null,null,null,null,null,null,null,null,null,null,{"$f":"IF(AND($A69='Inserir Pendencia NC'!$H$7,'Registro Pendencia NC'!$M69<>\"\"),MAX($X$6:X68)+1,\"\")","v":""}]
[null,null,null,null,null,null,null,null,null,null,null,null,null,null,null,null,null,null,null,null,null,null,null,{"$f":"IF(AND($A70='Inserir Pendencia NC'!$H$7,'Registro Pendencia NC'!$M70<>\"\"),MAX($X$6:X69)+1,\"\")","v":""}]
[null,null,null,null,null,null,null,null,null,null,null,null,null,null,null,null,null,null,null,null,null,null,null,{"$f":"IF(AND($A71='Inserir Pendencia NC'!$H$7,'Registro Pendencia NC'!$M71<>\"\"),MAX($X$6:X70)+1,\"\")","v":""}]
[null,null,null,null,null,null,null,null,null,null,null,null,null,null,null,null,null,null,null,null,null,null,null,{"$f":"IF(AND($A72='Inserir Pendencia NC'!$H$7,'Registro Pendencia NC'!$M72<>\"\"),MAX($X$6:X71)+1,\"\")","v":""}]
[null,null,null,null,null,null,null,null,null,null,null,null,null,null,null,null,null,null,null,null,null,null,null,{"$f":"IF(AND($A73='Inserir Pendencia NC'!$H$7,'Registro Pendencia NC'!$M73<>\"\"),MAX($X$6:X72)+1,\"\")","v":""}]
[null,null,null,null,null,null,null,null,null,null,null,null,null,null,null,null,null,null,null,null,null,null,null,{"$f":"IF(AND($A74='Inserir Pendencia NC'!$H$7,'Registro Pendencia NC'!$M74<>\"\"),MAX($X$6:X73)+1,\"\")","v":""}]
[null,null,null,null,null,null,null,null,null,null,null,null,null,null,null,null,null,null,null,null,null,null,null,{"$f":"IF(AND($A75='Inserir Pendencia NC'!$H$7,'Registro Pendencia NC'!$M75<>\"\"),MAX($X$6:X74)+1,\"\")","v":""}]
[null,null,null,null,null,null,null,null,null,null,null,null,null,null,null,null,null,null,null,null,null,null,null,{"$f":"IF(AND($A76='Inserir Pendencia NC'!$H$7,'Registro Pendencia NC'!$M76<>\"\"),MAX($X$6:X75)+1,\"\")","v":""}]
[null,null,null,null,null,null,null,null,null,null,null,null,null,null,null,null,null,null,null,null,null,null,null,{"$f":"IF(AND($A77='Inserir Pendencia NC'!$H$7,'Registro Pendencia NC'!$M77<>\"\"),MAX($X$6:X76)+1,\"\")","v":""}]
[null,null,null,null,null,null,null,null,null,null,null,null,null,null,null,null,null,null,null,null,null,null,null,{"$f":"IF(AND($A78='Inserir Pendencia NC'!$H$7,'Registro Pendencia NC'!$M78<>\"\"),MAX($X$6:X77)+1,\"\")","v":""}]
[null,null,null,null,null,null,null,null,null,null,null,null,null,null,null,null,null,null,null,null,null,null,null,{"$f":"IF(AND($A79='Inserir Pendencia NC'!$H$7,'Registro Pendencia NC'!$M79<>\"\"),MAX($X$6:X78)+1,\"\")","v":""}]
[null,null,null,null,null,null,null,null,null,null,null,null,null,null,null,null,null,null,null,null,null,null,null,{"$f":"IF(AND($A80='Inserir Pendencia NC'!$H$7,'Registro Pendencia NC'!$M80<>\"\"),MAX($X$6:X79)+1,\"\")","v":""}]
{"$rows_left_out":921}
{"sheet":"Plan3","index":2,"n_rows":0,"n_cols":0,"rows_kept":0,"cut":false,"hidden":false,"merged":[]}