{"text_format":"1","workbook":"xlsx","n_sheets":3,"sheets":["Inserir Pendencia PR","Registro Pendencia PR","CALENDÁRIO"],"not_rendered":{"charts":0,"images":0,"macros":1,"external_links":0,"defined_names":21,"comments":0,"pivot_tables":0},"unopened":[],"bounds":{"document_bytes":16777216,"sheet_cells":100000,"rows_first":2000,"rows_last":500,"rows_between":2000,"halvings":0,"cell_chars":16384,"cell_head_chars":4096},"cells_cut":0,"cells_raw":0,"read":"whole","date_system":"1900"}

{"sheet":"Inserir Pendencia PR","index":0,"n_rows":21,"n_cols":10,"rows_kept":21,"cut":false,"hidden":false,"merged":[[1,5,2,5]]}
[]
[]
[]
[]
[]
[]
[]
[]
[null,"Nº Pendência (Nº Automático)","0000493",null,null,null,null,"",{"$f":"VLOOKUP(H9,'Registro Pendencia PR'!A:S,1,0)","v":{"$error":"#N/A"}},{"$f":"VLOOKUP(H9,'Registro Pendencia PR'!A:S,2,0)","v":{"$error":"#N/A"}}]
[null,"Data","2021-12-15",null,null,null,null,null,{"$f":"VLOOKUP(H9,'Registro Pendencia PR'!A:S,12,0)","v":{"$error":"#N/A"}}]
[null,"Nº Ponte Rolante","PR01",null,null,null,null,null,{"$f":"VLOOKUP(H9,'Registro Pendencia PR'!A:S,13,0)","v":{"$error":"#N/A"}}]
[null,"Área","Estrutura TROLE",null,null,null,null,null,{"$f":"VLOOKUP(H9,'Registro Pendencia PR'!A:S,14,0)","v":{"$error":"#N/A"}}]
[null,"Item",11020,{"$f":" IFERROR(VLOOKUP(C13,CALENDÁRIO!$AJ$7:$AK$154,2,FALSE),\"\")","v":"Limpa trilhos do trole"},null,null,null,null,{"$f":"VLOOKUP(H9,'Registro Pendencia PR'!A:S,8,0)","v":{"$error":"#N/A"}}]
[null,"Nº OS da MP",12,null,null,null,null,null,{"$f":"VLOOKUP(H9,'Registro Pendencia PR'!A:S,9,0)","v":{"$error":"#N/A"}}]
[null,"Observação da OS","y"]
[null,"Prazo Inicial","2021-12-16"]
[null,"Prazo Final","2021-12-20"]
[null,"Responsável"]
[null,"mês",{"$f":"IF(C10=\"\",\"\",UPPER(TEXT(C10,\"MMMM\")))","v":"DEZEMBRO"}]
[null,"ano",{"$f":"IF(C10=\"\",\"\",YEAR(C10))","v":2021}]
[null,"Tabela Auxiliar",{"$f":"IF(C11=\"\",\"\",IF(C12=\"Estrutura TROLE\",\"AA\",IF(C12=\"Maquinário TROLE\",\"AB\",IF(C12=\"Elétrica TROLE\",\"AC\",IF(C12=\"Maquinário TALHA\",\"AD\",IF(C12=\"Elétrica TALHA\",\"AE\",IF(C12=\"Estrutura PONTE\",\"AF\",IF(C12=\"Maquinário da Ponte / Pórtico\",\"AG\",IF(C12=\"Elétrica da Ponte / Pórtico\",\"AH\",IF(C12=\"Estrutura do Caminho de Rolamento\",\"AI\",IF(C12=\"Elétrica do Caminho de Rolamento\",\"AJ\",\"\")))))))))))","v":"AA"}]

{"sheet":"Registro Pendencia PR","index":1,"n_rows":500,"n_cols":20,"rows_kept":500,"cut":false,"hidden":false,"merged":[]}
[]
[]
[]
[]
[]
["Nº Pendência ","Data","Nº Ponte Rolante","Área","Item","Descrição do Item","Nº OS da MP","Prazo Inicial","Prazo Final","Observação da OS","Responsável","Data Conclusão","Data Reprogramação","Data Cancelamento","mês","ano","Pendente?","Observação Manutenção","ano_aux"]
["0000001","2017-01-10","PR02","Trole / Carro","5.7","Uniões Parafusadas/Cupilhas",137574,null,null,null,"Jesiel","2017-06-23",null,null,"JANEIRO",2017,{"$f":"IF(B7=\"\",\"\",IF(AND(L7=\"\",N7=\"\"),\"SIM\",IF(M7<>\"\",\"SIM\",\"NÃO\")))","v":"NÃO"},null,{"$f":"IFERROR(INDEX(P$7:P$1048576,MATCH(1,(COUNTIF(S$6:S6,P$7:P$1048576)=0)*(P$7:P$1048576<>\"\"),0)),0)","v":2017},{"$f":"IFERROR(IF(INDEX(ano_aux,MATCH(0,INDEX(COUNTIF(T$6:T6,ano_aux),,),))=0,\"\",IFERROR(INDEX(ano_aux,MATCH(0,INDEX(COUNTIF(T$6:T6,Codigo),,),)),\"\")),\"\")","v":""}]
["000002","2017-01-10","PR02","Trole / Carro","5.8","Vedação dos Redutores",137574,null,null,null,"Jesiel","2017-06-23",null,null,"JANEIRO",2017,{"$f":"IF(B8=\"\",\"\",IF(AND(L8=\"\",N8=\"\"),\"SIM\",IF(M8<>\"\",\"SIM\",\"NÃO\")))","v":"NÃO"},null,{"$f":"IFERROR(INDEX(P$7:P$1048576,MATCH(1,(COUNTIF(S$6:S7,P$7:P$1048576)=0)*(P$7:P$1048576<>\"\"),0)),0)","v":2018},{"$f":"IFERROR(IF(INDEX(ano_aux,MATCH(0,INDEX(COUNTIF(T$6:T7,ano_aux),,),))=0,\"\",IFERROR(INDEX(ano_aux,MATCH(0,INDEX(COUNTIF(T$6:T7,Codigo),,),)),\"\")),\"\")","v":""}]
["0000003","2017-01-10","PR02","Trole / Carro","5.9","Eixos e Rolamentos",137574,null,null,null,"Jesiel","2017-06-23",null,null,"JANEIRO",2017,"NÃO",null,{"$f":"IFERROR(INDEX(P$7:P$1048576,MATCH(1,(COUNTIF(S$6:S8,P$7:P$1048576)=0)*(P$7:P$1048576<>\"\"),0)),0)","v":2019},{"$f":"IFERROR(IF(INDEX(ano_aux,MATCH(0,INDEX(COUNTIF(T$6:T8,ano_aux),,),))=0,\"\",IFERROR(INDEX(ano_aux,MATCH(0,INDEX(COUNTIF(T$6:T8,Codigo),,),)),\"\")),\"\")","v":""}]
["0000004","2017-01-10",null,"Ponte Rolante","6.12","Limites",137574,null,null,null,"Jesiel","2017-10-10",null,null,"JANEIRO",2017,"NÃO",null,{"$f":"IFERROR(INDEX(P$7:P$1048576,MATCH(1,(COUNTIF(S$6:S9,P$7:P$1048576)=0)*(P$7:P$1048576<>\"\"),0)),0)","v":2020},{"$f":"IFERROR(IF(INDEX(ano_aux,MATCH(0,INDEX(COUNTIF(T$6:T9,ano_aux),,),))=0,\"\",IFERROR(INDEX(ano_aux,MATCH(0,INDEX(COUNTIF(T$6:T9,Codigo),,),)),\"\")),\"\")","v":""}]
["0000005","2017-01-10",null,"Caminho de Rolamento","9.2","Emenda dos Trilhos/Talas de Junção",137574,null,null,null,"Jesiel","2019-02-21",null,null,"JANEIRO",2017,"NÃO",null,{"$f":"IFERROR(INDEX(P$7:P$1048576,MATCH(1,(COUNTIF(S$6:S10,P$7:P$1048576)=0)*(P$7:P$1048576<>\"\"),0)),0)","v":2021},{"$f":"IFERROR(IF(INDEX(ano_aux,MATCH(0,INDEX(COUNTIF(T$6:T10,ano_aux),,),))=0,\"\",IFERROR(INDEX(ano_aux,MATCH(0,INDEX(COUNTIF(T$6:T10,Codigo),,),)),\"\")),\"\")","v":""}]
["0000006","2017-01-10",null,"Sistema Elétrico","10.8","Contatores",137574,null,null,"Aguardando Material Para Proxima Preventiva Previsto Para 10/10/2017","Jesiel","2017-03-29",null,null,"JANEIRO",2017,"NÃO",null,{"$f":"IFERROR(INDEX(P$7:P$1048576,MATCH(1,(COUNTIF(S$6:S11,P$7:P$1048576)=0)*(P$7:P$1048576<>\"\"),0)),0)","v":0},{"$f":"IFERROR(IF(INDEX(ano_aux,MATCH(0,INDEX(COUNTIF(T$6:T11,ano_aux),,),))=0,\"\",IFERROR(INDEX(ano_aux,MATCH(0,INDEX(COUNTIF(T$6:T11,Codigo),,),)),\"\")),\"\")","v":""}]
["0000007","2017-01-10",null,"Sistema Elétrico","10.9","Contatos",137574,null,null,null,"Jesiel","2017-03-29",null,null,"JANEIRO",2017,"NÃO",null,{"$f":"IFERROR(INDEX(P$7:P$1048576,MATCH(1,(COUNTIF(S$6:S12,P$7:P$1048576)=0)*(P$7:P$1048576<>\"\"),0)),0)","v":0},{"$f":"IFERROR(IF(INDEX(ano_aux,MATCH(0,INDEX(COUNTIF(T$6:T12,ano_aux),,),))=0,\"\",IFERROR(INDEX(ano_aux,MATCH(0,INDEX(COUNTIF(T$6:T12,Codigo),,),)),\"\")),\"\")","v":""}]
["0000008","2017-01-09",null,"Elevação Principal","1.8","Bloco Superior (Polias)",137573,null,null,null,"Jesiel","2017-05-11",null,null,"JANEIRO",2017,"NÃO",null,{"$f":"IFERROR(INDEX(P$7:P$1048576,MATCH(1,(COUNTIF(S$6:S13,P$7:P$1048576)=0)*(P$7:P$1048576<>\"\"),0)),0)","v":0},{"$f":"IFERROR(IF(INDEX(ano_aux,MATCH(0,INDEX(COUNTIF(T$6:T13,ano_aux),,),))=0,\"\",IFERROR(INDEX(ano_aux,MATCH(0,INDEX(COUNTIF(T$6:T13,Codigo),,),)),\"\")),\"\")","v":""}]
["0000009","2017-01-09",null,"Trole / Carro","5.7","Uniões Parafusadas/Cupilhas",137573,null,null,null,"Jesiel","2017-05-11",null,null,"JANEIRO",2017,"NÃO",null,{"$f":"IFERROR(INDEX(P$7:P$1048576,MATCH(1,(COUNTIF(S$6:S14,P$7:P$1048576)=0)*(P$7:P$1048576<>\"\"),0)),0)","v":0},{"$f":"IFERROR(IF(INDEX(ano_aux,MATCH(0,INDEX(COUNTIF(T$6:T14,ano_aux),,),))=0,\"\",IFERROR(INDEX(ano_aux,MATCH(0,INDEX(COUNTIF(T$6:T14,Codigo),,),)),\"\")),\"\")","v":""}]
["0000010","2017-01-09",null,"Trole / Carro","5.18","Limites",137573,null,null,null,"Jesiel","2017-07-05",null,null,"JANEIRO",2017,"NÃO",null,{"$f":"IFERROR(INDEX(P$7:P$1048576,MATCH(1,(COUNTIF(S$6:S15,P$7:P$1048576)=0)*(P$7:P$1048576<>\"\"),0)),0)","v":0},{"$f":"IFERROR(IF(INDEX(ano_aux,MATCH(0,INDEX(COUNTIF(T$6:T15,ano_aux),,),))=0,\"\",IFERROR(INDEX(ano_aux,MATCH(0,INDEX(COUNTIF(T$6:T15,Codigo),,),)),\"\")),\"\")","v":""}]
["0000011","2017-01-09",null,"Ponte Rolante","6.12","Limites",137573,null,null,null,"Jesiel","2017-05-10",null,null,"JANEIRO",2017,"NÃO",null,{"$f":"IFERROR(INDEX(P$7:P$1048576,MATCH(1,(COUNTIF(S$6:S16,P$7:P$1048576)=0)*(P$7:P$1048576<>\"\"),0)),0)","v":0},{"$f":"IFERROR(IF(INDEX(ano_aux,MATCH(0,INDEX(COUNTIF(T$6:T16,ano_aux),,),))=0,\"\",IFERROR(INDEX(ano_aux,MATCH(0,INDEX(COUNTIF(T$6:T16,Codigo),,),)),\"\")),\"\")","v":""}]
["0000012","2017-01-09",null,"Caminho de Rolamento","9.2","Emenda dos Trilhos/Talas de Junção",137573,null,null,null,"Jesiel","2019-02-21",null,null,"JANEIRO",2017,"NÃO",null,{"$f":"IFERROR(INDEX(P$7:P$1048576,MATCH(1,(COUNTIF(S$6:S17,P$7:P$1048576)=0)*(P$7:P$1048576<>\"\"),0)),0)","v":0},{"$f":"IFERROR(IF(INDEX(ano_aux,MATCH(0,INDEX(COUNTIF(T$6:T17,ano_aux),,),))=0,\"\",IFERROR(INDEX(ano_aux,MATCH(0,INDEX(COUNTIF(T$6:T17,Codigo),,),)),\"\")),\"\")","v":""}]
["0000013","2017-01-09","PR03","Caminho de Rolamento","9.3","Elementos de Fixação",137573,null,null,null,"Jesiel","2019-02-21",null,null,"JANEIRO",2017,"NÃO",null,{"$f":"IFERROR(INDEX(P$7:P$1048576,MATCH(1,(COUNTIF(S$6:S18,P$7:P$1048576)=0)*(P$7:P$1048576<>\"\"),0)),0)","v":0},{"$f":"IFERROR(IF(INDEX(ano_aux,MATCH(0,INDEX(COUNTIF(T$6:T18,ano_aux),,),))=0,\"\",IFERROR(INDEX(ano_aux,MATCH(0,INDEX(COUNTIF(T$6:T18,Codigo),,),)),\"\")),\"\")","v":""}]
["0000014","2017-01-09","PR03","Caminho de Rolamento","9.4","Batentes Fim de Curso",137573,null,null,null,"Jesiel","2017-07-03",null,null,"JANEIRO",2017,"NÃO",null,{"$f":"IFERROR(INDEX(P$7:P$1048576,MATCH(1,(COUNTIF(S$6:S19,P$7:P$1048576)=0)*(P$7:P$1048576<>\"\"),0)),0)","v":0},{"$f":"IFERROR(IF(INDEX(ano_aux,MATCH(0,INDEX(COUNTIF(T$6:T19,ano_aux),,),))=0,\"\",IFERROR(INDEX(ano_aux,MATCH(0,INDEX(COUNTIF(T$6:T19,Codigo),,),)),\"\")),\"\")","v":""}]
["0000015","2017-01-09","PR03","Sistema Elétrico","10.4","Chave Geral",137573,null,null,"Manopla da Chave Seccicionadora Geral da Ponte Quebrada","Jesiel","2021-01-21",null,null,"JANEIRO",2017,"NÃO","Essa pendência de acordo com a preventiva realizada em 21/01/2021 OS Nº 6036089 já foi contornada.",{"$f":"IFERROR(INDEX(P$7:P$1048576,MATCH(1,(COUNTIF(S$6:S20,P$7:P$1048576)=0)*(P$7:P$1048576<>\"\"),0)),0)","v":0},{"$f":"IFERROR(IF(INDEX(ano_aux,MATCH(0,INDEX(COUNTIF(T$6:T20,ano_aux),,),))=0,\"\",IFERROR(INDEX(ano_aux,MATCH(0,INDEX(COUNTIF(T$6:T20,Codigo),,),)),\"\")),\"\")","v":""}]
["0000016","2017-01-09","PR03","Sistema Elétrico","10.8","Contatores",137573,null,null,null,"Jesiel","2017-08-09",null,null,"JANEIRO",2017,"NÃO",null,{"$f":"IFERROR(INDEX(P$7:P$1048576,MATCH(1,(COUNTIF(S$6:S21,P$7:P$1048576)=0)*(P$7:P$1048576<>\"\"),0)),0)","v":0},{"$f":"IFERROR(IF(INDEX(ano_aux,MATCH(0,INDEX(COUNTIF(T$6:T21,ano_aux),,),))=0,\"\",IFERROR(INDEX(ano_aux,MATCH(0,INDEX(COUNTIF(T$6:T21,Codigo),,),)),\"\")),\"\")","v":""}]
["0000017","2017-01-09","PR03","Sistema Elétrico","10.9","Contatos",137573,null,null,null,"Jesiel","2017-08-09",null,null,"JANEIRO",2017,"NÃO",null,{"$f":"IFERROR(INDEX(P$7:P$1048576,MATCH(1,(COUNTIF(S$6:S22,P$7:P$1048576)=0)*(P$7:P$1048576<>\"\"),0)),0)","v":0},{"$f":"IFERROR(IF(INDEX(ano_aux,MATCH(0,INDEX(COUNTIF(T$6:T22,ano_aux),,),))=0,\"\",IFERROR(INDEX(ano_aux,MATCH(0,INDEX(COUNTIF(T$6:T22,Codigo),,),)),\"\")),\"\")","v":""}]
["0000018","2017-01-11","PR06","Elevação Principal","1.8","Bloco Superior (Polias)",137575,null,null,null,"Jesiel","2017-07-05",null,null,"JANEIRO",2017,"NÃO",null,{"$f":"IFERROR(INDEX(P$7:P$1048576,MATCH(1,(COUNTIF(S$6:S23,P$7:P$1048576)=0)*(P$7:P$1048576<>\"\"),0)),0)","v":0},{"$f":"IFERROR(IF(INDEX(ano_aux,MATCH(0,INDEX(COUNTIF(T$6:T23,ano_aux),,),))=0,\"\",IFERROR(INDEX(ano_aux,MATCH(0,INDEX(COUNTIF(T$6:T23,Codigo),,),)),\"\")),\"\")","v":""}]
["0000019","2017-01-11","PR06","Elevação Principal","1.16","Bloco Inferior (Polias)",137575,null,null,null,"Jesiel","2017-07-05",null,null,"JANEIRO",2017,"NÃO",null,{"$f":"IFERROR(INDEX(P$7:P$1048576,MATCH(1,(COUNTIF(S$6:S24,P$7:P$1048576)=0)*(P$7:P$1048576<>\"\"),0)),0)","v":0},{"$f":"IFERROR(IF(INDEX(ano_aux,MATCH(0,INDEX(COUNTIF(T$6:T24,ano_aux),,),))=0,\"\",IFERROR(INDEX(ano_aux,MATCH(0,INDEX(COUNTIF(T$6:T24,Codigo),,),)),\"\")),\"\")","v":""}]
["0000020","2017-01-11","PR06","Ponte Rolante","6.11","Pára-Choque",137575,null,null,null,"Jesiel","2017-07-05",null,null,"JANEIRO",2017,"NÃO",null,{"$f":"IFERROR(INDEX(P$7:P$1048576,MATCH(1,(COUNTIF(S$6:S25,P$7:P$1048576)=0)*(P$7:P$1048576<>\"\"),0)),0)","v":0},{"$f":"IFERROR(IF(INDEX(ano_aux,MATCH(0,INDEX(COUNTIF(T$6:T25,ano_aux),,),))=0,\"\",IFERROR(INDEX(ano_aux,MATCH(0,INDEX(COUNTIF(T$6:T25,Codigo),,),)),\"\")),\"\")","v":""}]
["0000021","2017-01-11","PR06","Ponte Rolante","6.12","Limites",137575,null,null,"Verficar","Jesiel","2017-07-05",null,null,"JANEIRO",2017,"NÃO",null,{"$f":"IFERROR(INDEX(P$7:P$1048576,MATCH(1,(COUNTIF(S$6:S26,P$7:P$1048576)=0)*(P$7:P$1048576<>\"\"),0)),0)","v":0},{"$f":"IFERROR(IF(INDEX(ano_aux,MATCH(0,INDEX(COUNTIF(T$6:T26,ano_aux),,),))=0,\"\",IFERROR(INDEX(ano_aux,MATCH(0,INDEX(COUNTIF(T$6:T26,Codigo),,),)),\"\")),\"\")","v":""}]
["0000022","2017-01-11","PR06","Caminho de Rolamento","9.2","Emenda dos Trilhos/Talas de Junção",137575,null,null,null,"Jesiel","2019-02-21",null,null,"JANEIRO",2017,"NÃO",null,{"$f":"IFERROR(INDEX(P$7:P$1048576,MATCH(1,(COUNTIF(S$6:S27,P$7:P$1048576)=0)*(P$7:P$1048576<>\"\"),0)),0)","v":0},{"$f":"IFERROR(IF(INDEX(ano_aux,MATCH(0,INDEX(COUNTIF(T$6:T27,ano_aux),,),))=0,\"\",IFERROR(INDEX(ano_aux,MATCH(0,INDEX(COUNTIF(T$6:T27,Codigo),,),)),\"\")),\"\")","v":""}]
["0000023","2017-01-11","PR06","Caminho de Rolamento","9.3","Elementos de Fixação",137575,null,null,null,"Jesiel","2019-02-21",null,null,"JANEIRO",2017,"NÃO",null,{"$f":"IFERROR(INDEX(P$7:P$1048576,MATCH(1,(COUNTIF(S$6:S28,P$7:P$1048576)=0)*(P$7:P$1048576<>\"\"),0)),0)","v":0},{"$f":"IFERROR(IF(INDEX(ano_aux,MATCH(0,INDEX(COUNTIF(T$6:T28,ano_aux),,),))=0,\"\",IFERROR(INDEX(ano_aux,MATCH(0,INDEX(COUNTIF(T$6:T28,Codigo),,),)),\"\")),\"\")","v":""}]
["0000024","2017-01-11","PR06","Sistema Elétrico","10.3","Portas do Painel",137575,null,null,"Verificar","Jesiel","2017-07-05",null,null,"JANEIRO",2017,"NÃO",null,{"$f":"IFERROR(INDEX(P$7:P$1048576,MATCH(1,(COUNTIF(S$6:S29,P$7:P$1048576)=0)*(P$7:P$1048576<>\"\"),0)),0)","v":0},{"$f":"IFERROR(IF(INDEX(ano_aux,MATCH(0,INDEX(COUNTIF(T$6:T29,ano_aux),,),))=0,\"\",IFERROR(INDEX(ano_aux,MATCH(0,INDEX(COUNTIF(T$6:T29,Codigo),,),)),\"\")),\"\")","v":""}]
{"$rows_left_out":471}
{"sheet":"CALENDÁRIO","index":2,"n_rows":130,"n_cols":38,"rows_kept":130,"cut":false,"hidden":false,"merged":[[5,34,5,36],[5,19,5,23],[4,18,4,23]]}
[]
[]
[]
[]
[null,null,null,null,null,null,null,null,null,null,null,null,null,null,null,null,null,null,null,null,null,null,null,null,null,null,null,null,null,null,null,null,null,"Módulo de Controle das Pontes Rolantes"]
[null,null,null,null,null,null,null,null,null,null,null,null,null,null,null,null,null,null,null,null,null,null,null,null,null,null,null,null,null,null,null,null,null,"Elementos","Itens a Serrem Inspecionados",null,null,"Metrologia"]
[null,null,null,null,null,null,null,null,null,null,null,null,null,null,null,null,null,null,null,null,null,null,null,null,null,null,null,null,null,null,null,null,null,"Estrutura TROLE","Estrutura TROLE",11010,"Amortecedores do trole"]
[null,null,null,null,null,null,null,null,null,null,null,null,null,null,null,null,null,null,null,null,null,null,null,null,null,null,null,null,null,null,null,null,null,"Maquinário TROLE","Estrutura TROLE",11020,"Limpa trilhos do trole"]
[null,null,null,null,null,null,null,null,null,null,null,null,null,null,null,null,null,null,null,null,null,null,null,null,null,null,null,null,null,null,null,null,null,"Elétrica TROLE","Estrutura TROLE",11030,"Estrutura geral e soldas"]
[null,null,null,null,null,null,null,null,null,null,null,null,null,null,null,null,null,null,null,null,null,null,null,null,null,null,null,null,null,null,null,null,null,"Maquinário TALHA","Estrutura TROLE",11040,"Conexões talha com trole","Ensaios Não Destrutível"]
[null,null,null,null,null,null,null,null,null,null,null,null,null,null,null,null,null,null,null,null,null,null,null,null,null,null,null,null,null,null,null,null,null,"Elétrica TALHA","Estrutura TROLE",11050,"Outros","Calibração"]
[null,null,null,null,null,null,null,null,null,null,null,null,null,null,null,null,null,null,null,null,null,null,null,null,null,null,null,null,null,null,null,null,null,"Estrutura PONTE","Maquinário TROLE",12004,"Freio"]
[null,null,null,null,null,null,null,null,null,null,null,null,null,null,null,null,null,null,null,null,null,null,null,null,null,null,null,null,null,null,null,null,null,"Maquinário da Ponte / Pórtico","Maquinário TROLE",12005,"Caixa de engrenagens e engrenagens"]
[null,null,null,null,null,null,null,null,null,null,null,null,null,null,null,null,null,null,null,null,null,null,null,null,null,null,null,null,null,null,null,null,null,"Elétrica da Ponte / Pórtico","Maquinário TROLE",12006,"Acoplamento"]
[null,null,null,null,null,null,null,null,null,null,null,null,null,null,null,null,null,null,null,null,null,null,null,null,null,null,null,null,null,null,null,null,null,"Estrutura do Caminho de Rolamento","Maquinário TROLE",12007,"Rolamento do eixo central"]
[null,null,null,null,null,null,null,null,null,null,null,null,null,null,null,null,null,null,null,null,null,null,null,null,null,null,null,null,null,null,null,null,null,"Elétrica do Caminho de Rolamento","Maquinário TROLE",12008,"Rodas"]
[null,null,null,null,null,null,null,null,null,null,null,null,null,null,null,null,null,null,null,null,null,null,null,null,null,null,null,null,null,null,null,null,null,"Geral","Maquinário TROLE",12009,"Engrenagens das rodas"]
[null,null,null,null,null,null,null,null,null,null,null,null,null,null,null,null,null,null,null,null,null,null,null,null,null,null,null,null,null,null,null,null,null,null,"Maquinário TROLE",12010,"Rolamentos das rodas"]
[null,null,null,null,null,null,null,null,null,null,null,null,null,null,null,null,null,null,null,null,null,null,null,null,null,null,null,null,null,null,null,null,null,null,"Maquinário TROLE",12011,"Unidade de motorização externo"]
[null,null,null,null,null,null,null,null,null,null,null,null,null,null,null,null,null,null,null,null,null,null,null,null,null,null,null,null,null,null,null,null,null,null,"Maquinário TROLE",12012,"Outros"]
[null,null,null,null,null,null,null,null,null,null,null,null,null,null,null,null,null,null,null,null,null,null,null,null,null,null,null,null,null,null,null,null,null,null,"Elétrica TROLE",13002,"Motor do trolei"]
[null,null,null,null,null,null,null,null,null,null,null,null,null,null,null,null,null,null,null,null,null,null,null,null,null,null,null,null,null,null,null,null,null,null,"Elétrica TROLE",13003,"Caixa(s) do painel de controle"]
[null,null,null,null,null,null,null,null,null,null,null,null,null,null,null,null,null,null,null,null,null,null,null,null,null,null,null,null,null,null,null,null,null,null,"Elétrica TROLE",13004,"Operação de controle"]
[null,null,null,null,null,null,null,null,null,null,null,null,null,null,null,null,null,null,null,null,null,null,null,null,null,null,null,null,null,null,null,null,null,null,"Elétrica TROLE",13005,"Enrolador de cabo"]
[null,null,null,null,null,null,null,null,null,null,null,null,null,null,null,null,null,null,null,null,null,null,null,null,null,null,null,null,null,null,null,null,null,null,"Elétrica TROLE",13006,"Sensor anticolisão"]
[null,null,null,null,null,null,null,null,null,null,null,null,null,null,null,null,null,null,null,null,null,null,null,null,null,null,null,null,null,null,null,null,null,null,"Elétrica TROLE",13007,"Resistores"]
[null,null,null,null,null,null,null,null,null,null,null,null,null,null,null,null,null,null,null,null,null,null,null,null,null,null,null,null,null,null,null,null,null,null,"Elétrica TROLE",13009,"Inversor"]
[null,null,null,null,null,null,null,null,null,null,null,null,null,null,null,null,null,null,null,null,null,null,null,null,null,null,null,null,null,null,null,null,null,null,"Elétrica TROLE",13010,"Fiação geral e condutos / sistema Feestoon"]
[null,null,null,null,null,null,null,null,null,null,null,null,null,null,null,null,null,null,null,null,null,null,null,null,null,null,null,null,null,null,null,null,null,null,"Elétrica TROLE",13011,"Horímetro do trole"]
[null,null,null,null,null,null,null,null,null,null,null,null,null,null,null,null,null,null,null,null,null,null,null,null,null,null,null,null,null,null,null,null,null,null,"Elétrica TROLE",13012,"Interruptor de fim de curso do trole"]
{"$rows_left_out":100}