{"text_format":"1","workbook":"xlsx","n_sheets":3,"sheets":["KITS","MAPA ILUMINADO","BD"],"not_rendered":{"charts":0,"images":0,"macros":1,"external_links":6,"defined_names":145,"comments":0,"pivot_tables":0},"unopened":[],"bounds":{"document_bytes":16777216,"sheet_cells":100000,"rows_first":2000,"rows_last":500,"rows_between":2000,"halvings":0,"cell_chars":16384,"cell_head_chars":4096},"cells_cut":0,"cells_raw":0,"read":"whole","date_system":"1900"}

{"sheet":"KITS","index":0,"n_rows":22,"n_cols":2,"rows_kept":22,"cut":false,"hidden":false,"merged":[]}
["SERVIÇO","MAPA"]
["AGUA FRIA RADIER","MAPA1"]
["ARMAÇÃO DE LAJE","MAPA2"]
["ARMAÇÃO DE LAJE COBERTURA"]
["ARMAÇÃO DE LAJE TIPO"]
["ARMAÇÃO PAREDE TÉRREO"]
["ARMAÇÃO PAREDE TIPO-COBERT"]
["ARMAÇÃO RADIER 2 BLOCOS","MAPA1"]
["ARMAÇÃO RADIER 3 BLOCOS","MAPA1"]
["COBERTURA - TELHADO"]
["ESGOTO RADIER","MAPA1"]
["HIDROSANITÁRIO TIPO"]
["HIDROSSANITÁRIO"]
["IMPLANTAÇÃO","MAPA1"]
["KIT LIGA FÁCIL"]
["MARCAÇÃO DE LAJE"]
["MARCAÇÃO DE PAREDE"]
["MONTAGEM DE FORMAS"]
["PLATIBANDA"]
["SPDA COBERTURA"]
{"$rows_left_out":3}
{"sheet":"MAPA ILUMINADO","index":1,"n_rows":36,"n_cols":20,"rows_kept":36,"cut":false,"hidden":false,"merged":[[1,18,1,19],[0,18,0,19],[2,1,2,9],[2,10,2,15],[28,1,28,2],[28,13,28,14],[2,18,2,19],[28,11,28,12],[28,3,28,7],[15,18,15,19],[23,18,23,25],[24,18,24,24],[22,18,22,24],[35,13,35,14],[34,13,34,14],[33,1,33,2],[32,1,32,2],[31,1,31,2],[34,1,34,2],[35,1,35,5],[34,3,34,7],[33,3,33,7],[32,3,32,7],[31,3,31,7],[34,11,34,12],[33,11,33,12],[32,11,32,12],[31,11,31,12],[33,13,33,14],[32,13,32,14],[31,13,31,14],[30,13,30,14],[29,13,29,14],[30,1,30,2],[29,1,29,2],[30,3,30,7],[29,3,29,7],[30,11,30,12],[29,11,29,12]]}
[null,null,null,null,null,null,null,null,null,null,null,null,null,null,null,null,null,null,"MÊS A ATUALIZAR"]
[null,null,null,null,null,null,null,null,null,null,null,null,null,null,null,null,null,null,"JULHO"]
[null,"MAPA ILUMINADO QUADRA 35 ",null,null,null,null,null,null,null,null,"HIDROSSANITÁRIO",null,null,null,null,null,null,null,"LEGENDA "]
[null,null,null,null,null,null,null,null,null,null,null,null,null,null,null,null,null,null,{"$f":"IFERROR(INDEX(BD!J$1:V$50,MATCH($K$3,BD!J$1:J$50,0),MATCH(T4,BD!$J$1:$V$1,0)),0)","v":0},"JANEIRO"]
[null,null,null,null,null,null,null,null,null,null,null,null,null,null,null,null,null,null,{"$f":"IFERROR(INDEX(BD!J$1:V$50,MATCH($K$3,BD!J$1:J$50,0),MATCH(T5,BD!$J$1:$V$1,0)),0)","v":0},"FEVEREIRO"]
[null,null,null,null,null,null,null,null,null,null,null,null,null,null,null,null,null,null,{"$f":"IFERROR(INDEX(BD!J$1:V$50,MATCH($K$3,BD!J$1:J$50,0),MATCH(T6,BD!$J$1:$V$1,0)),0)","v":0},"MARÇO"]
[null,null,null,null,null,null,null,null,null,null,null,null,null,null,null,null,null,null,{"$f":"IFERROR(INDEX(BD!J$1:V$50,MATCH($K$3,BD!J$1:J$50,0),MATCH(T7,BD!$J$1:$V$1,0)),0)","v":0},"ABRIL"]
[null,null,null,null,null,null,null,null,null,null,null,null,null,null,null,null,null,null,{"$f":"IFERROR(INDEX(BD!J$1:V$50,MATCH($K$3,BD!J$1:J$50,0),MATCH(T8,BD!$J$1:$V$1,0)),0)","v":0},"MAIO"]
[null,null,null,null,null,null,null,null,null,null,null,null,null,null,null,null,null,null,{"$f":"IFERROR(INDEX(BD!J$1:V$50,MATCH($K$3,BD!J$1:J$50,0),MATCH(T9,BD!$J$1:$V$1,0)),0)","v":0},"JUNHO"]
[null,null,null,null,null,null,null,null,null,null,null,null,null,null,null,null,null,null,{"$f":"IFERROR(INDEX(BD!J$1:V$50,MATCH($K$3,BD!J$1:J$50,0),MATCH(T10,BD!$J$1:$V$1,0)),0)","v":2},"JULHO"]
[null,null,null,null,null,null,null,null,null,null,null,null,null,null,null,null,null,null,{"$f":"IFERROR(INDEX(BD!J$1:V$50,MATCH($K$3,BD!J$1:J$50,0),MATCH(T11,BD!$J$1:$V$1,0)),0)","v":0},"AGOSTO"]
[null,null,null,null,null,null,null,null,null,null,null,null,null,null,null,null,null,null,{"$f":"IFERROR(INDEX(BD!J$1:V$50,MATCH($K$3,BD!J$1:J$50,0),MATCH(T12,BD!$J$1:$V$1,0)),0)","v":0},"SETEMBRO"]
[null,null,null,null,null,null,null,null,null,null,null,null,null,null,null,null,null,null,{"$f":"IFERROR(INDEX(BD!J$1:V$50,MATCH($K$3,BD!J$1:J$50,0),MATCH(T13,BD!$J$1:$V$1,0)),0)","v":0},"OUTUBRO"]
[null,null,null,null,null,null,null,null,null,null,null,null,null,null,null,null,null,null,{"$f":"IFERROR(INDEX(BD!J$1:V$50,MATCH($K$3,BD!J$1:J$50,0),MATCH(T14,BD!$J$1:$V$1,0)),0)","v":2},"NOVEMBRO"]
[null,null,null,null,null,null,null,null,null,null,null,null,null,null,null,null,null,null,{"$f":"IFERROR(INDEX(BD!J$1:V$50,MATCH($K$3,BD!J$1:J$50,0),MATCH(T15,BD!$J$1:$V$1,0)),0)","v":0},"DEZEMBRO"]
[]
[null,null,null,null,null,null,null,null,null,null,null,null,null,null,null,null,null,null,{"$f":"SUM(S4:S15)","v":4},"TOTAL"]
[]
[]
[]
{"$rows_left_out":17}
{"sheet":"BD","index":2,"n_rows":24,"n_cols":29,"rows_kept":24,"cut":false,"hidden":false,"merged":[[21,26,21,28]]}
["SERVIÇO EXECUTADO","R","G","B","MÊS APLICADO","SERVIÇO","INDICADOR","SHAPES",null,"SERVIÇO","JANEIRO","FEVEREIRO","MARÇO","ABRIL","MAIO","JUNHO","JULHO","AGOSTO","SETEMBRO","OUTUBRO","NOVEMBRO","DEZEMBRO","TOTAL"]
["HIDROSSANITÁRIO PLATIBANDA 6B",155,194,230,"NOVEMBRO","HIDROSSANITÁRIO",1,"PLATIBANDA 6B",null,{"$f":"_xlfn._xlws.SORT(_xlfn.UNIQUE(Tabela2[SERVIÇO],0,0))","v":"AGUA FRIA RADIER"},{"$f":"SUMIFS($G$2:$G10058,$F$2:$F10058,$J2,$E$2:$E10058,$K$1)","v":0},{"$f":"SUMIFS($G$2:$G10058,F$2:$F10058,$J2,$E$2:$E10058,$L$1)","v":0},{"$f":"SUMIFS($G$2:$G10058,$F$2:$F10058,$J2,$E$2:$E10058,$M$1)","v":0},{"$f":"SUMIFS($G$2:$G10058,$F$2:$F10058,$J2,$E$2:$E10058,$N$1)","v":0},{"$f":"SUMIFS($G$2:$G10058,$F$2:$F10058,$J2,$E$2:$E10058,$O$1)","v":0},{"$f":"SUMIFS($G$2:$G10058,$F$2:$F10058,$J2,$E$2:$E10058,$P$1)","v":0},{"$f":"SUMIFS($G$2:$G10058,$F$2:$F10058,$J2,$E$2:$E10058,$Q$1)","v":0},{"$f":"SUMIFS($G$2:$G10058,$F$2:$F10058,$J2,$E$2:$E10058,$R$1)","v":0},{"$f":"SUMIFS($G$2:$G10058,$F$2:$F10058,$J2,$E$2:$E10058,$S$1)","v":0},{"$f":"SUMIFS($G$2:$G10058,$F$2:$F10058,$J2,$E$2:$E10058,$T$1)","v":0},{"$f":"SUMIFS($G$2:$G10058,$F$2:$F10058,$J2,$E$2:$E10058,$U$1)","v":0},{"$f":"SUMIFS($G$2:$G10058,$F$2:$F10058,$J2,$E$2:$E10058,$V$1)","v":0},{"$f":"SUM(K2:V2)","v":0},null,null,null,null,"JANEIRO"]
["HIDROSSANITÁRIO PAV 3 6B",155,194,230,"NOVEMBRO","HIDROSSANITÁRIO",1,"PAV 3 6B",null,"ARMAÇÃO DE LAJE",{"$f":"SUMIFS($G$2:$G10059,$F$2:$F10059,$J3,$E$2:$E10059,$K$1)","v":0},{"$f":"SUMIFS($G$2:$G10059,$F$2:$F10059,$J3,$E$2:$E10059,$L$1)","v":0},{"$f":"SUMIFS($G$2:$G10059,$F$2:$F10059,$J3,$E$2:$E10059,$M$1)","v":0},{"$f":"SUMIFS($G$2:$G10059,$F$2:$F10059,$J3,$E$2:$E10059,$N$1)","v":0},{"$f":"SUMIFS($G$2:$G10059,$F$2:$F10059,$J3,$E$2:$E10059,$O$1)","v":0},{"$f":"SUMIFS($G$2:$G10059,$F$2:$F10059,$J3,$E$2:$E10059,$P$1)","v":0},{"$f":"SUMIFS($G$2:$G10059,$F$2:$F10059,$J3,$E$2:$E10059,$Q$1)","v":0},{"$f":"SUMIFS($G$2:$G10059,$F$2:$F10059,$J3,$E$2:$E10059,$R$1)","v":0},{"$f":"SUMIFS($G$2:$G10059,$F$2:$F10059,$J3,$E$2:$E10059,$S$1)","v":0},{"$f":"SUMIFS($G$2:$G10059,$F$2:$F10059,$J3,$E$2:$E10059,$T$1)","v":0},{"$f":"SUMIFS($G$2:$G10059,$F$2:$F10059,$J3,$E$2:$E10059,$U$1)","v":0},{"$f":"SUMIFS($G$2:$G10059,$F$2:$F10059,$J3,$E$2:$E10059,$V$1)","v":0},{"$f":"SUM(K3:V3)","v":0},null,null,null,null,"setembro"]
["HIDROSSANITÁRIO PAV 3 6C",255,217,102,"JULHO","HIDROSSANITÁRIO",1,"PAV 3 6C",null,"ARMAÇÃO DE LAJE COBERTURA",{"$f":"SUMIFS($G$2:$G10060,$F$2:$F10060,$J4,$E$2:$E10060,$K$1)","v":0},{"$f":"SUMIFS($G$2:$G10060,$F$2:$F10060,$J4,$E$2:$E10060,$L$1)","v":0},{"$f":"SUMIFS($G$2:$G10060,$F$2:$F10060,$J4,$E$2:$E10060,$M$1)","v":0},{"$f":"SUMIFS($G$2:$G10060,$F$2:$F10060,$J4,$E$2:$E10060,$N$1)","v":0},{"$f":"SUMIFS($G$2:$G10060,$F$2:$F10060,$J4,$E$2:$E10060,$O$1)","v":0},{"$f":"SUMIFS($G$2:$G10060,$F$2:$F10060,$J4,$E$2:$E10060,$P$1)","v":0},{"$f":"SUMIFS($G$2:$G10060,$F$2:$F10060,$J4,$E$2:$E10060,$Q$1)","v":0},{"$f":"SUMIFS($G$2:$G10060,$F$2:$F10060,$J4,$E$2:$E10060,$R$1)","v":0},{"$f":"SUMIFS($G$2:$G10060,$F$2:$F10060,$J4,$E$2:$E10060,$S$1)","v":0},{"$f":"SUMIFS($G$2:$G10060,$F$2:$F10060,$J4,$E$2:$E10060,$T$1)","v":0},{"$f":"SUMIFS($G$2:$G10060,$F$2:$F10060,$J4,$E$2:$E10060,$U$1)","v":0},{"$f":"SUMIFS($G$2:$G10060,$F$2:$F10060,$J4,$E$2:$E10060,$V$1)","v":0},0,null,null,null,null,"novembro"]
["HIDROSSANITÁRIO PLATIBANDA 6C",255,217,102,"JULHO","HIDROSSANITÁRIO",1,"PLATIBANDA 6C",null,"ARMAÇÃO DE LAJE TIPO",{"$f":"SUMIFS($G$2:$G10061,$F$2:$F10061,$J5,$E$2:$E10061,$K$1)","v":0},{"$f":"SUMIFS($G$2:$G10061,$F$2:$F10061,$J5,$E$2:$E10061,$L$1)","v":0},{"$f":"SUMIFS($G$2:$G10061,$F$2:$F10061,$J5,$E$2:$E10061,$M$1)","v":0},{"$f":"SUMIFS($G$2:$G10061,$F$2:$F10061,$J5,$E$2:$E10061,$N$1)","v":0},{"$f":"SUMIFS($G$2:$G10061,$F$2:$F10061,$J5,$E$2:$E10061,$O$1)","v":0},{"$f":"SUMIFS($G$2:$G10061,$F$2:$F10061,$J5,$E$2:$E10061,$P$1)","v":0},{"$f":"SUMIFS($G$2:$G10061,$F$2:$F10061,$J5,$E$2:$E10061,$Q$1)","v":0},{"$f":"SUMIFS($G$2:$G10061,$F$2:$F10061,$J5,$E$2:$E10061,$R$1)","v":0},{"$f":"SUMIFS($G$2:$G10061,$F$2:$F10061,$J5,$E$2:$E10061,$S$1)","v":0},{"$f":"SUMIFS($G$2:$G10061,$F$2:$F10061,$J5,$E$2:$E10061,$T$1)","v":0},{"$f":"SUMIFS($G$2:$G10061,$F$2:$F10061,$J5,$E$2:$E10061,$U$1)","v":0},{"$f":"SUMIFS($G$2:$G10061,$F$2:$F10061,$J5,$E$2:$E10061,$V$1)","v":0},0,null,null,{"$f":"COUNTIF(A:A,\"*Hidrosanitário*Tipo*\")","v":0},"CONTAR SERVIÇOS"]
[null,null,null,null,null,null,null,null,null,"ARMAÇÃO PAREDE TÉRREO",{"$f":"SUMIFS($G$2:$G10062,$F$2:$F10062,$J6,$E$2:$E10062,$K$1)","v":0},{"$f":"SUMIFS($G$2:$G10062,$F$2:$F10062,$J6,$E$2:$E10062,$L$1)","v":0},{"$f":"SUMIFS($G$2:$G10062,$F$2:$F10062,$J6,$E$2:$E10062,$M$1)","v":0},{"$f":"SUMIFS($G$2:$G10062,$F$2:$F10062,$J6,$E$2:$E10062,$N$1)","v":0},{"$f":"SUMIFS($G$2:$G10062,$F$2:$F10062,$J6,$E$2:$E10062,$O$1)","v":0},{"$f":"SUMIFS($G$2:$G10062,$F$2:$F10062,$J6,$E$2:$E10062,$P$1)","v":0},{"$f":"SUMIFS($G$2:$G10062,$F$2:$F10062,$J6,$E$2:$E10062,$Q$1)","v":0},{"$f":"SUMIFS($G$2:$G10062,$F$2:$F10062,$J6,$E$2:$E10062,$R$1)","v":0},{"$f":"SUMIFS($G$2:$G10062,$F$2:$F10062,$J6,$E$2:$E10062,$S$1)","v":0},{"$f":"SUMIFS($G$2:$G10062,$F$2:$F10062,$J6,$E$2:$E10062,$T$1)","v":0},{"$f":"SUMIFS($G$2:$G10062,$F$2:$F10062,$J6,$E$2:$E10062,$U$1)","v":0},{"$f":"SUMIFS($G$2:$G10062,$F$2:$F10062,$J6,$E$2:$E10062,$V$1)","v":0},0,null,null,{"$f":"COUNTIFS($A$2:$A$6,\"*Hidrosanitário Tipo*\",$E$2:$E$6,AB2)","v":0}," "]
[null,null,null,null,null,null,null,null,null,"ARMAÇÃO PAREDE TIPO-COBERT",{"$f":"SUMIFS($G$2:$G10063,$F$2:$F10063,$J7,$E$2:$E10063,$K$1)","v":0},{"$f":"SUMIFS($G$2:$G10063,$F$2:$F10063,$J7,$E$2:$E10063,$L$1)","v":0},{"$f":"SUMIFS($G$2:$G10063,$F$2:$F10063,$J7,$E$2:$E10063,$M$1)","v":0},{"$f":"SUMIFS($G$2:$G10063,$F$2:$F10063,$J7,$E$2:$E10063,$N$1)","v":0},{"$f":"SUMIFS($G$2:$G10063,$F$2:$F10063,$J7,$E$2:$E10063,$O$1)","v":0},{"$f":"SUMIFS($G$2:$G10063,$F$2:$F10063,$J7,$E$2:$E10063,$P$1)","v":0},{"$f":"SUMIFS($G$2:$G10063,$F$2:$F10063,$J7,$E$2:$E10063,$Q$1)","v":0},{"$f":"SUMIFS($G$2:$G10063,$F$2:$F10063,$J7,$E$2:$E10063,$R$1)","v":0},{"$f":"SUMIFS($G$2:$G10063,$F$2:$F10063,$J7,$E$2:$E10063,$S$1)","v":0},{"$f":"SUMIFS($G$2:$G10063,$F$2:$F10063,$J7,$E$2:$E10063,$T$1)","v":0},{"$f":"SUMIFS($G$2:$G10063,$F$2:$F10063,$J7,$E$2:$E10063,$U$1)","v":0},{"$f":"SUMIFS($G$2:$G10063,$F$2:$F10063,$J7,$E$2:$E10063,$V$1)","v":0},0,null,null,{"$f":"COUNTIFS($A$2:$A$6,\"*Hidrosanitário Tipo*\",$E$2:$E$6,AB3)","v":0}]
[null,null,null,null,null,null,null,null,null,"ARMAÇÃO RADIER 2 BLOCOS",{"$f":"SUMIFS($G$2:$G10064,$F$2:$F10064,$J8,$E$2:$E10064,$K$1)","v":0},{"$f":"SUMIFS($G$2:$G10064,$F$2:$F10064,$J8,$E$2:$E10064,$L$1)","v":0},{"$f":"SUMIFS($G$2:$G10064,$F$2:$F10064,$J8,$E$2:$E10064,$M$1)","v":0},{"$f":"SUMIFS($G$2:$G10064,$F$2:$F10064,$J8,$E$2:$E10064,$N$1)","v":0},{"$f":"SUMIFS($G$2:$G10064,$F$2:$F10064,$J8,$E$2:$E10064,$O$1)","v":0},{"$f":"SUMIFS($G$2:$G10064,$F$2:$F10064,$J8,$E$2:$E10064,$P$1)","v":0},{"$f":"SUMIFS($G$2:$G10064,$F$2:$F10064,$J8,$E$2:$E10064,$Q$1)","v":0},{"$f":"SUMIFS($G$2:$G10064,$F$2:$F10064,$J8,$E$2:$E10064,$R$1)","v":0},{"$f":"SUMIFS($G$2:$G10064,$F$2:$F10064,$J8,$E$2:$E10064,$S$1)","v":0},{"$f":"SUMIFS($G$2:$G10064,$F$2:$F10064,$J8,$E$2:$E10064,$T$1)","v":0},{"$f":"SUMIFS($G$2:$G10064,$F$2:$F10064,$J8,$E$2:$E10064,$U$1)","v":0},{"$f":"SUMIFS($G$2:$G10064,$F$2:$F10064,$J8,$E$2:$E10064,$V$1)","v":0},0,null,null,{"$f":"COUNTIFS($A$2:$A$6,\"*Hidrosanitário Tipo*\",$E$2:$E$6,AB4)","v":0}]
[null,null,null,null,null,null,null,null,null,"ARMAÇÃO RADIER 3 BLOCOS",{"$f":"SUMIFS($G$2:$G10065,$F$2:$F10065,$J9,$E$2:$E10065,$K$1)","v":0},{"$f":"SUMIFS($G$2:$G10065,$F$2:$F10065,$J9,$E$2:$E10065,$L$1)","v":0},{"$f":"SUMIFS($G$2:$G10065,$F$2:$F10065,$J9,$E$2:$E10065,$M$1)","v":0},{"$f":"SUMIFS($G$2:$G10065,$F$2:$F10065,$J9,$E$2:$E10065,$N$1)","v":0},{"$f":"SUMIFS($G$2:$G10065,$F$2:$F10065,$J9,$E$2:$E10065,$O$1)","v":0},{"$f":"SUMIFS($G$2:$G10065,$F$2:$F10065,$J9,$E$2:$E10065,$P$1)","v":0},{"$f":"SUMIFS($G$2:$G10065,$F$2:$F10065,$J9,$E$2:$E10065,$Q$1)","v":0},{"$f":"SUMIFS($G$2:$G10065,$F$2:$F10065,$J9,$E$2:$E10065,$R$1)","v":0},{"$f":"SUMIFS($G$2:$G10065,$F$2:$F10065,$J9,$E$2:$E10065,$S$1)","v":0},{"$f":"SUMIFS($G$2:$G10065,$F$2:$F10065,$J9,$E$2:$E10065,$T$1)","v":0},{"$f":"SUMIFS($G$2:$G10065,$F$2:$F10065,$J9,$E$2:$E10065,$U$1)","v":0},{"$f":"SUMIFS($G$2:$G10065,$F$2:$F10065,$J9,$E$2:$E10065,$V$1)","v":0},0]
[null,null,null,null,null,null,null,null,null,"COBERTURA - TELHADO",{"$f":"SUMIFS($G$2:$G10066,$F$2:$F10066,$J10,$E$2:$E10066,$K$1)","v":0},{"$f":"SUMIFS($G$2:$G10066,$F$2:$F10066,$J10,$E$2:$E10066,$L$1)","v":0},{"$f":"SUMIFS($G$2:$G10066,$F$2:$F10066,$J10,$E$2:$E10066,$M$1)","v":0},{"$f":"SUMIFS($G$2:$G10066,$F$2:$F10066,$J10,$E$2:$E10066,$N$1)","v":0},{"$f":"SUMIFS($G$2:$G10066,$F$2:$F10066,$J10,$E$2:$E10066,$O$1)","v":0},{"$f":"SUMIFS($G$2:$G10066,$F$2:$F10066,$J10,$E$2:$E10066,$P$1)","v":0},{"$f":"SUMIFS($G$2:$G10066,$F$2:$F10066,$J10,$E$2:$E10066,$Q$1)","v":0},{"$f":"SUMIFS($G$2:$G10066,$F$2:$F10066,$J10,$E$2:$E10066,$R$1)","v":0},{"$f":"SUMIFS($G$2:$G10066,$F$2:$F10066,$J10,$E$2:$E10066,$S$1)","v":0},{"$f":"SUMIFS($G$2:$G10066,$F$2:$F10066,$J10,$E$2:$E10066,$T$1)","v":0},{"$f":"SUMIFS($G$2:$G10066,$F$2:$F10066,$J10,$E$2:$E10066,$U$1)","v":0},{"$f":"SUMIFS($G$2:$G10066,$F$2:$F10066,$J10,$E$2:$E10066,$V$1)","v":0},0]
[null,null,null,null,null,null,null,null,null,"ESGOTO RADIER",{"$f":"SUMIFS($G$2:$G10067,$F$2:$F10067,$J11,$E$2:$E10067,$K$1)","v":0},{"$f":"SUMIFS($G$2:$G10067,$F$2:$F10067,$J11,$E$2:$E10067,$L$1)","v":0},{"$f":"SUMIFS($G$2:$G10067,$F$2:$F10067,$J11,$E$2:$E10067,$M$1)","v":0},{"$f":"SUMIFS($G$2:$G10067,$F$2:$F10067,$J11,$E$2:$E10067,$N$1)","v":0},{"$f":"SUMIFS($G$2:$G10067,$F$2:$F10067,$J11,$E$2:$E10067,$O$1)","v":0},{"$f":"SUMIFS($G$2:$G10067,$F$2:$F10067,$J11,$E$2:$E10067,$P$1)","v":0},{"$f":"SUMIFS($G$2:$G10067,$F$2:$F10067,$J11,$E$2:$E10067,$Q$1)","v":0},{"$f":"SUMIFS($G$2:$G10067,$F$2:$F10067,$J11,$E$2:$E10067,$R$1)","v":0},{"$f":"SUMIFS($G$2:$G10067,$F$2:$F10067,$J11,$E$2:$E10067,$S$1)","v":0},{"$f":"SUMIFS($G$2:$G10067,$F$2:$F10067,$J11,$E$2:$E10067,$T$1)","v":0},{"$f":"SUMIFS($G$2:$G10067,$F$2:$F10067,$J11,$E$2:$E10067,$U$1)","v":0},{"$f":"SUMIFS($G$2:$G10067,$F$2:$F10067,$J11,$E$2:$E10067,$V$1)","v":0},0]
[null,null,null,null,null,null,null,null,null,"HIDROSANITÁRIO TIPO",{"$f":"SUMIFS($G$2:$G10068,$F$2:$F10068,$J12,$E$2:$E10068,$K$1)","v":0},{"$f":"SUMIFS($G$2:$G10068,$F$2:$F10068,$J12,$E$2:$E10068,$L$1)","v":0},{"$f":"SUMIFS($G$2:$G10068,$F$2:$F10068,$J12,$E$2:$E10068,$M$1)","v":0},{"$f":"SUMIFS($G$2:$G10068,$F$2:$F10068,$J12,$E$2:$E10068,$N$1)","v":0},{"$f":"SUMIFS($G$2:$G10068,$F$2:$F10068,$J12,$E$2:$E10068,$O$1)","v":0},{"$f":"SUMIFS($G$2:$G10068,$F$2:$F10068,$J12,$E$2:$E10068,$P$1)","v":0},{"$f":"SUMIFS($G$2:$G10068,$F$2:$F10068,$J12,$E$2:$E10068,$Q$1)","v":0},{"$f":"SUMIFS($G$2:$G10068,$F$2:$F10068,$J12,$E$2:$E10068,$R$1)","v":0},{"$f":"SUMIFS($G$2:$G10068,$F$2:$F10068,$J12,$E$2:$E10068,$S$1)","v":0},{"$f":"SUMIFS($G$2:$G10068,$F$2:$F10068,$J12,$E$2:$E10068,$T$1)","v":0},{"$f":"SUMIFS($G$2:$G10068,$F$2:$F10068,$J12,$E$2:$E10068,$U$1)","v":0},{"$f":"SUMIFS($G$2:$G10068,$F$2:$F10068,$J12,$E$2:$E10068,$V$1)","v":0},0,null,null,"LÓGICA = SE MAPA ILUMNADO K3 FOR IGUAL A HIDROSAINTÁRIO TIPO ENTÃO FILTRAR OS MESES COM ESSE SERVIÇO EXECUTADO, E CONTAR CADA SERVIÇO EXECUTADO NO MÊS."]
[null,null,null,null,null,null,null,null,null,"HIDROSSANITÁRIO",{"$f":"SUMIFS($G$2:$G10069,$F$2:$F10069,$J13,$E$2:$E10069,$K$1)","v":0},{"$f":"SUMIFS($G$2:$G10069,$F$2:$F10069,$J13,$E$2:$E10069,$L$1)","v":0},{"$f":"SUMIFS($G$2:$G10069,$F$2:$F10069,$J13,$E$2:$E10069,$M$1)","v":0},{"$f":"SUMIFS($G$2:$G10069,$F$2:$F10069,$J13,$E$2:$E10069,$N$1)","v":0},{"$f":"SUMIFS($G$2:$G10069,$F$2:$F10069,$J13,$E$2:$E10069,$O$1)","v":0},{"$f":"SUMIFS($G$2:$G10069,$F$2:$F10069,$J13,$E$2:$E10069,$P$1)","v":0},{"$f":"SUMIFS($G$2:$G10069,$F$2:$F10069,$J13,$E$2:$E10069,$Q$1)","v":2},{"$f":"SUMIFS($G$2:$G10069,$F$2:$F10069,$J13,$E$2:$E10069,$R$1)","v":0},{"$f":"SUMIFS($G$2:$G10069,$F$2:$F10069,$J13,$E$2:$E10069,$S$1)","v":0},{"$f":"SUMIFS($G$2:$G10069,$F$2:$F10069,$J13,$E$2:$E10069,$T$1)","v":0},{"$f":"SUMIFS($G$2:$G10069,$F$2:$F10069,$J13,$E$2:$E10069,$U$1)","v":2},{"$f":"SUMIFS($G$2:$G10069,$F$2:$F10069,$J13,$E$2:$E10069,$V$1)","v":0},4]
[null,null,null,null,null,null,null,null,null,"IMPLANTAÇÃO",{"$f":"SUMIFS($G$2:$G10070,$F$2:$F10070,$J14,$E$2:$E10070,$K$1)","v":0},{"$f":"SUMIFS($G$2:$G10070,$F$2:$F10070,$J14,$E$2:$E10070,$L$1)","v":0},{"$f":"SUMIFS($G$2:$G10070,$F$2:$F10070,$J14,$E$2:$E10070,$M$1)","v":0},{"$f":"SUMIFS($G$2:$G10070,$F$2:$F10070,$J14,$E$2:$E10070,$N$1)","v":0},{"$f":"SUMIFS($G$2:$G10070,$F$2:$F10070,$J14,$E$2:$E10070,$O$1)","v":0},{"$f":"SUMIFS($G$2:$G10070,$F$2:$F10070,$J14,$E$2:$E10070,$P$1)","v":0},{"$f":"SUMIFS($G$2:$G10070,$F$2:$F10070,$J14,$E$2:$E10070,$Q$1)","v":0},{"$f":"SUMIFS($G$2:$G10070,$F$2:$F10070,$J14,$E$2:$E10070,$R$1)","v":0},{"$f":"SUMIFS($G$2:$G10070,$F$2:$F10070,$J14,$E$2:$E10070,$S$1)","v":0},{"$f":"SUMIFS($G$2:$G10070,$F$2:$F10070,$J14,$E$2:$E10070,$T$1)","v":0},{"$f":"SUMIFS($G$2:$G10070,$F$2:$F10070,$J14,$E$2:$E10070,$U$1)","v":0},{"$f":"SUMIFS($G$2:$G10070,$F$2:$F10070,$J14,$E$2:$E10070,$V$1)","v":0},0]
[null,null,null,null,null,null,null,null,null,"KIT LIGA FÁCIL",{"$f":"SUMIFS($G$2:$G10071,$F$2:$F10071,$J15,$E$2:$E10071,$K$1)","v":0},{"$f":"SUMIFS($G$2:$G10071,$F$2:$F10071,$J15,$E$2:$E10071,$L$1)","v":0},{"$f":"SUMIFS($G$2:$G10071,$F$2:$F10071,$J15,$E$2:$E10071,$M$1)","v":0},{"$f":"SUMIFS($G$2:$G10071,$F$2:$F10071,$J15,$E$2:$E10071,$N$1)","v":0},{"$f":"SUMIFS($G$2:$G10071,$F$2:$F10071,$J15,$E$2:$E10071,$O$1)","v":0},{"$f":"SUMIFS($G$2:$G10071,$F$2:$F10071,$J15,$E$2:$E10071,$P$1)","v":0},{"$f":"SUMIFS($G$2:$G10071,$F$2:$F10071,$J15,$E$2:$E10071,$Q$1)","v":0},{"$f":"SUMIFS($G$2:$G10071,$F$2:$F10071,$J15,$E$2:$E10071,$R$1)","v":0},{"$f":"SUMIFS($G$2:$G10071,$F$2:$F10071,$J15,$E$2:$E10071,$S$1)","v":0},{"$f":"SUMIFS($G$2:$G10071,$F$2:$F10071,$J15,$E$2:$E10071,$T$1)","v":0},{"$f":"SUMIFS($G$2:$G10071,$F$2:$F10071,$J15,$E$2:$E10071,$U$1)","v":0},{"$f":"SUMIFS($G$2:$G10071,$F$2:$F10071,$J15,$E$2:$E10071,$V$1)","v":0},0]
[null,null,null,null,null,null,null,null,null,"MARCAÇÃO DE LAJE",{"$f":"SUMIFS($G$2:$G10072,$F$2:$F10072,$J16,$E$2:$E10072,$K$1)","v":0},{"$f":"SUMIFS($G$2:$G10072,$F$2:$F10072,$J16,$E$2:$E10072,$L$1)","v":0},{"$f":"SUMIFS($G$2:$G10072,$F$2:$F10072,$J16,$E$2:$E10072,$M$1)","v":0},{"$f":"SUMIFS($G$2:$G10072,$F$2:$F10072,$J16,$E$2:$E10072,$N$1)","v":0},{"$f":"SUMIFS($G$2:$G10072,$F$2:$F10072,$J16,$E$2:$E10072,$O$1)","v":0},{"$f":"SUMIFS($G$2:$G10072,$F$2:$F10072,$J16,$E$2:$E10072,$P$1)","v":0},{"$f":"SUMIFS($G$2:$G10072,$F$2:$F10072,$J16,$E$2:$E10072,$Q$1)","v":0},{"$f":"SUMIFS($G$2:$G10072,$F$2:$F10072,$J16,$E$2:$E10072,$R$1)","v":0},{"$f":"SUMIFS($G$2:$G10072,$F$2:$F10072,$J16,$E$2:$E10072,$S$1)","v":0},{"$f":"SUMIFS($G$2:$G10072,$F$2:$F10072,$J16,$E$2:$E10072,$T$1)","v":0},{"$f":"SUMIFS($G$2:$G10072,$F$2:$F10072,$J16,$E$2:$E10072,$U$1)","v":0},{"$f":"SUMIFS($G$2:$G10072,$F$2:$F10072,$J16,$E$2:$E10072,$V$1)","v":0},0]
[null,null,null,null,null,null,null,null,null,"MARCAÇÃO DE PAREDE",{"$f":"SUMIFS($G$2:$G10073,$F$2:$F10073,$J17,$E$2:$E10073,$K$1)","v":0},{"$f":"SUMIFS($G$2:$G10073,$F$2:$F10073,$J17,$E$2:$E10073,$L$1)","v":0},{"$f":"SUMIFS($G$2:$G10073,$F$2:$F10073,$J17,$E$2:$E10073,$M$1)","v":0},{"$f":"SUMIFS($G$2:$G10073,$F$2:$F10073,$J17,$E$2:$E10073,$N$1)","v":0},{"$f":"SUMIFS($G$2:$G10073,$F$2:$F10073,$J17,$E$2:$E10073,$O$1)","v":0},{"$f":"SUMIFS($G$2:$G10073,$F$2:$F10073,$J17,$E$2:$E10073,$P$1)","v":0},{"$f":"SUMIFS($G$2:$G10073,$F$2:$F10073,$J17,$E$2:$E10073,$Q$1)","v":0},{"$f":"SUMIFS($G$2:$G10073,$F$2:$F10073,$J17,$E$2:$E10073,$R$1)","v":0},{"$f":"SUMIFS($G$2:$G10073,$F$2:$F10073,$J17,$E$2:$E10073,$S$1)","v":0},{"$f":"SUMIFS($G$2:$G10073,$F$2:$F10073,$J17,$E$2:$E10073,$T$1)","v":0},{"$f":"SUMIFS($G$2:$G10073,$F$2:$F10073,$J17,$E$2:$E10073,$U$1)","v":0},{"$f":"SUMIFS($G$2:$G10073,$F$2:$F10073,$J17,$E$2:$E10073,$V$1)","v":0},0]
[null,null,null,null,null,null,null,null,null,"MONTAGEM DE FORMAS",{"$f":"SUMIFS($G$2:$G10074,$F$2:$F10074,$J18,$E$2:$E10074,$K$1)","v":0},{"$f":"SUMIFS($G$2:$G10074,$F$2:$F10074,$J18,$E$2:$E10074,$L$1)","v":0},{"$f":"SUMIFS($G$2:$G10074,$F$2:$F10074,$J18,$E$2:$E10074,$M$1)","v":0},{"$f":"SUMIFS($G$2:$G10074,$F$2:$F10074,$J18,$E$2:$E10074,$N$1)","v":0},{"$f":"SUMIFS($G$2:$G10074,$F$2:$F10074,$J18,$E$2:$E10074,$O$1)","v":0},{"$f":"SUMIFS($G$2:$G10074,$F$2:$F10074,$J18,$E$2:$E10074,$P$1)","v":0},{"$f":"SUMIFS($G$2:$G10074,$F$2:$F10074,$J18,$E$2:$E10074,$Q$1)","v":0},{"$f":"SUMIFS($G$2:$G10074,$F$2:$F10074,$J18,$E$2:$E10074,$R$1)","v":0},{"$f":"SUMIFS($G$2:$G10074,$F$2:$F10074,$J18,$E$2:$E10074,$S$1)","v":0},{"$f":"SUMIFS($G$2:$G10074,$F$2:$F10074,$J18,$E$2:$E10074,$T$1)","v":0},{"$f":"SUMIFS($G$2:$G10074,$F$2:$F10074,$J18,$E$2:$E10074,$U$1)","v":0},{"$f":"SUMIFS($G$2:$G10074,$F$2:$F10074,$J18,$E$2:$E10074,$V$1)","v":0},0]
[null,null,null,null,null,null,null,null,null,"PLATIBANDA",{"$f":"SUMIFS($G$2:$G10075,$F$2:$F10075,$J19,$E$2:$E10075,$K$1)","v":0},{"$f":"SUMIFS($G$2:$G10075,$F$2:$F10075,$J19,$E$2:$E10075,$L$1)","v":0},{"$f":"SUMIFS($G$2:$G10075,$F$2:$F10075,$J19,$E$2:$E10075,$M$1)","v":0},{"$f":"SUMIFS($G$2:$G10075,$F$2:$F10075,$J19,$E$2:$E10075,$N$1)","v":0},{"$f":"SUMIFS($G$2:$G10075,$F$2:$F10075,$J19,$E$2:$E10075,$O$1)","v":0},{"$f":"SUMIFS($G$2:$G10075,$F$2:$F10075,$J19,$E$2:$E10075,$P$1)","v":0},{"$f":"SUMIFS($G$2:$G10075,$F$2:$F10075,$J19,$E$2:$E10075,$Q$1)","v":0},{"$f":"SUMIFS($G$2:$G10075,$F$2:$F10075,$J19,$E$2:$E10075,$R$1)","v":0},{"$f":"SUMIFS($G$2:$G10075,$F$2:$F10075,$J19,$E$2:$E10075,$S$1)","v":0},{"$f":"SUMIFS($G$2:$G10075,$F$2:$F10075,$J19,$E$2:$E10075,$T$1)","v":0},{"$f":"SUMIFS($G$2:$G10075,$F$2:$F10075,$J19,$E$2:$E10075,$U$1)","v":0},{"$f":"SUMIFS($G$2:$G10075,$F$2:$F10075,$J19,$E$2:$E10075,$V$1)","v":0},0,null,null,"v=IFERROR(QUERY(A2:E41;\"select A where A = '\"&$B$3&\"' AND C = '\"&$C$3&\"' AND E = '\"&$D$3&\"' \n\");\"\")"]
[null,null,null,null,null,null,null,null,null,"SPDA COBERTURA",{"$f":"SUMIFS($G$2:$G10076,$F$2:$F10076,$J20,$E$2:$E10076,$K$1)","v":0},{"$f":"SUMIFS($G$2:$G10076,$F$2:$F10076,$J20,$E$2:$E10076,$L$1)","v":0},{"$f":"SUMIFS($G$2:$G10076,$F$2:$F10076,$J20,$E$2:$E10076,$M$1)","v":0},{"$f":"SUMIFS($G$2:$G10076,$F$2:$F10076,$J20,$E$2:$E10076,$N$1)","v":0},{"$f":"SUMIFS($G$2:$G10076,$F$2:$F10076,$J20,$E$2:$E10076,$O$1)","v":0},{"$f":"SUMIFS($G$2:$G10076,$F$2:$F10076,$J20,$E$2:$E10076,$P$1)","v":0},{"$f":"SUMIFS($G$2:$G10076,$F$2:$F10076,$J20,$E$2:$E10076,$Q$1)","v":0},{"$f":"SUMIFS($G$2:$G10076,$F$2:$F10076,$J20,$E$2:$E10076,$R$1)","v":0},{"$f":"SUMIFS($G$2:$G10076,$F$2:$F10076,$J20,$E$2:$E10076,$S$1)","v":0},{"$f":"SUMIFS($G$2:$G10076,$F$2:$F10076,$J20,$E$2:$E10076,$T$1)","v":0},{"$f":"SUMIFS($G$2:$G10076,$F$2:$F10076,$J20,$E$2:$E10076,$U$1)","v":0},{"$f":"SUMIFS($G$2:$G10076,$F$2:$F10076,$J20,$E$2:$E10076,$V$1)","v":0},0]
{"$rows_left_out":4}