{"text_format":"1","workbook":"xlsx","n_sheets":5,"sheets":["KITS","MAPA ILUMINADO","Planilha2","Planilha1","BD"],"not_rendered":{"charts":0,"images":0,"macros":1,"external_links":6,"defined_names":146,"comments":1,"pivot_tables":0},"unopened":[],"bounds":{"document_bytes":16777216,"sheet_cells":100000,"rows_first":2000,"rows_last":500,"rows_between":2000,"halvings":0,"cell_chars":16384,"cell_head_chars":4096},"cells_cut":0,"cells_raw":0,"read":"whole","date_system":"1900"}

{"sheet":"KITS","index":0,"n_rows":22,"n_cols":2,"rows_kept":22,"cut":false,"hidden":false,"merged":[]}
["SERVIÇO","MAPA"]
["AGUA FRIA RADIER","MAPA1"]
["ARMAÇÃO DE LAJE","MAPA2"]
["ARMAÇÃO DE LAJE COBERTURA"]
["ARMAÇÃO DE LAJE TIPO"]
["ARMAÇÃO PAREDE TÉRREO"]
["ARMAÇÃO PAREDE TIPO-COBERT"]
["ARMAÇÃO RADIER 2 BLOCOS","MAPA1"]
["ARMAÇÃO RADIER 3 BLOCOS","MAPA1"]
["COBERTURA - TELHADO"]
["ESGOTO RADIER","MAPA1"]
["HIDROSANITÁRIO TIPO"]
["HIDROSSANITÁRIO"]
["IMPLANTAÇÃO","MAPA1"]
["KIT LIGA FÁCIL"]
{"$rows_left_out":8}
{"sheet":"MAPA ILUMINADO","index":1,"n_rows":36,"n_cols":20,"rows_kept":36,"cut":false,"hidden":false,"merged":[[1,18,1,19],[0,18,0,19],[2,1,2,9],[2,10,2,15],[28,1,28,2],[28,13,28,14],[2,18,2,19],[28,11,28,12],[28,3,28,7],[15,18,15,19],[35,13,35,14],[34,13,34,14],[33,1,33,2],[32,1,32,2],[31,1,31,2],[34,1,34,2],[35,1,35,5],[34,3,34,7],[33,3,33,7],[32,3,32,7],[31,3,31,7],[34,11,34,12],[33,11,33,12],[32,11,32,12],[31,11,31,12],[33,13,33,14],[32,13,32,14],[31,13,31,14],[30,13,30,14],[29,13,29,14],[30,1,30,2],[29,1,29,2],[30,3,30,7],[29,3,29,7],[30,11,30,12],[29,11,29,12]]}
[null,null,null,null,null,null,null,null,null,null,null,null,null,null,null,null,null,null,"MÊS A ATUALIZAR"]
[null,null,null,null,null,null,null,null,null,null,null,null,null,null,null,null,null,null,"ABRIL"]
[null,"MAPA ILUMINADO QUADRA 35 ",null,null,null,null,null,null,null,null,"MARCAÇÃO DE PAREDE",null,null,null,null,null,null,null,"LEGENDA "]
[null,null,null,null,null,null,null,null,null,null,null,null,null,null,null,null,null,null,{"$f":"IFERROR(INDEX(BD!J$1:V$50,MATCH($K$3,BD!J$1:J$50,0),MATCH(T4,BD!$J$1:$V$1,0)),0)","v":0},"JANEIRO"]
[null,null,null,null,null,null,null,null,null,null,null,null,null,null,null,null,null,null,{"$f":"IFERROR(INDEX(BD!J$1:V$50,MATCH($K$3,BD!J$1:J$50,0),MATCH(T5,BD!$J$1:$V$1,0)),0)","v":0},"FEVEREIRO"]
[null,null,null,null,null,null,null,null,null,null,null,null,null,null,null,null,null,null,{"$f":"IFERROR(INDEX(BD!J$1:V$50,MATCH($K$3,BD!J$1:J$50,0),MATCH(T6,BD!$J$1:$V$1,0)),0)","v":0},"MARÇO"]
[null,null,null,null,null,null,null,null,null,null,null,null,null,null,null,null,null,null,{"$f":"IFERROR(INDEX(BD!J$1:V$50,MATCH($K$3,BD!J$1:J$50,0),MATCH(T7,BD!$J$1:$V$1,0)),0)","v":0},"ABRIL"]
[null,null,null,null,null,null,null,null,null,null,null,null,null,null,null,null,null,null,{"$f":"IFERROR(INDEX(BD!J$1:V$50,MATCH($K$3,BD!J$1:J$50,0),MATCH(T8,BD!$J$1:$V$1,0)),0)","v":0},"MAIO"]
[null,null,null,null,null,null,null,null,null,null,null,null,null,null,null,null,null,null,{"$f":"IFERROR(INDEX(BD!J$1:V$50,MATCH($K$3,BD!J$1:J$50,0),MATCH(T9,BD!$J$1:$V$1,0)),0)","v":0},"JUNHO"]
[null,null,null,null,null,null,null,null,null,null,null,null,null,null,null,null,null,null,{"$f":"IFERROR(INDEX(BD!J$1:V$50,MATCH($K$3,BD!J$1:J$50,0),MATCH(T10,BD!$J$1:$V$1,0)),0)","v":0},"JULHO"]
[null,null,null,null,null,null,null,null,null,null,null,null,null,null,null,null,null,null,{"$f":"IFERROR(INDEX(BD!J$1:V$50,MATCH($K$3,BD!J$1:J$50,0),MATCH(T11,BD!$J$1:$V$1,0)),0)","v":0},"AGOSTO"]
[null,null,null,null,null,null,null,null,null,null,null,null,null,null,null,null,null,null,{"$f":"IFERROR(INDEX(BD!J$1:V$50,MATCH($K$3,BD!J$1:J$50,0),MATCH(T12,BD!$J$1:$V$1,0)),0)","v":0},"SETEMBRO"]
[null,null,null,null,null,null,null,null,null,null,null,null,null,null,null,null,null,null,{"$f":"IFERROR(INDEX(BD!J$1:V$50,MATCH($K$3,BD!J$1:J$50,0),MATCH(T13,BD!$J$1:$V$1,0)),0)","v":0},"OUTUBRO"]
[null,null,null,null,null,null,null,null,null,null,null,null,null,null,null,null,null,null,{"$f":"IFERROR(INDEX(BD!J$1:V$50,MATCH($K$3,BD!J$1:J$50,0),MATCH(T14,BD!$J$1:$V$1,0)),0)","v":0},"NOVEMBRO"]
[null,null,null,null,null,null,null,null,null,null,null,null,null,null,null,null,null,null,{"$f":"IFERROR(INDEX(BD!J$1:V$50,MATCH($K$3,BD!J$1:J$50,0),MATCH(T15,BD!$J$1:$V$1,0)),0)","v":0},"DEZEMBRO"]
{"$rows_left_out":22}
{"sheet":"Planilha2","index":2,"n_rows":80,"n_cols":99,"rows_kept":80,"cut":false,"hidden":false,"merged":[]}
["\"","PAV",1,"(",1,")","=",null,null,{"$f":"CONCATENATE(B1 & \" \"&D1&E1&F1&G1)","v":"PAV (1)="},"(",1,")",null,null,null,"\"TÉRREO 1 A\"",{"$f":"CONCATENATE(J1,Q1)","v":"PAV (1)=\"TÉRREO 1 A\""},"\"","\"TÉRREO 1 A\",","\"PAV 1 1 A\",","\"PAV 2 1 A\",","\"PAV 3 1 A\",","\"PLATIBANDA 1 A\",","\"TÉRREO 1 B\",","\"PAV 1 1 B\",","\"PAV 2 1 B\",","\"PAV 3 1 B\",","\"PLATIBANDA 1 B\",","\"TÉRREO 2 A\",","\"PAV 1 2 A\",","\"PAV 2 2 A\",","\"PAV 3 2 A\",","\"PLATIBANDA 2 A\",","\"TÉRREO 2 B\",","\"PAV 1 2 B\",","\"PAV 2 2 B\",","\"PAV 3 2 B\",","\"PLATIBANDA 2 B\",","\"TÉRREO 3 A\",","\"PAV 1 3 A\",","\"PAV 2 3 A\",","\"PAV 3 3 A\",","\"PLATIBANDA 3 A\",","\"TÉRREO 3 B\",","\"PAV 1 3 B\",","\"PAV 2 3 B\",","\"PAV 3 3 B\",","\"PLATIBANDA 3 B\",","\"TÉRREO 3 C\",","\"PAV 1 3 C\",","\"PAV 2 3 C\",","\"PAV 3 3 C\",","\"PLATIBANDA 3 C\",","\"TÉRREO 4 A\",","\"PAV 1 4 A\",","\"PAV 2 4 A\",","\"PAV 3 4 A\",","\"PLATIBANDA 4 A\",","\"TÉRREO 4 B\",","\"PAV 1 4 B\",","\"PAV 2 4 B\",","\"PAV 3 4 B\",","\"PLATIBANDA 4 B\",","\"TÉRREO 4 C\",","\"PAV 1 4 C\",","\"PAV 2 4 C\",","\"PAV 3 4 C\",","\"PLATIBANDA 4 C\",","\"TÉRREO 5 A\",","\"PAV 1 5 A\",","\"PAV 2 5 A\",","\"PAV 3 5 A\",","\"PLATIBANDA 5 A\",","\"TÉRREO 5 B\",","\"PAV 1 5 B\",","\"PAV 2 5 B\",","\"PAV 3 5 B\",","\"PLATIBANDA 5 B\",","\"TÉRREO 5 C\",","\"PAV 1 5 C\",","\"PAV 2 5 C\",","\"PAV 3 5 C\",","\"PLATIBANDA 5 C\",","\"TÉRREO 6 A\",","\"PAV 1 6 A\",","\"PAV 2 6 A\",","\"PAV 3 6 A\",","\"PLATIBANDA 6 A\",","\"TÉRREO 6 B\",","\"PAV 1 6 B\",","\"PAV 2 6 B\",","\"PAV 3 6 B\",","\"PLATIBANDA 6 B\",","\"TÉRREO 6 C\",","\"PAV 1 6 C\",","\"PAV 2 6 C\",","\"PAV 3 6 C\",","\"PLATIBANDA 6 C\","]
["\"","PAV",1,"(",2,")","=",null,null,{"$f":"CONCATENATE(B2 & \" \"&D2&E2&F2&G2)","v":"PAV (2)="},"(",2,")",null,null,null,"\"PAV 1 1 A\"",{"$f":"CONCATENATE(J2,Q2)","v":"PAV (2)=\"PAV 1 1 A\""}]
["\"","PAV",1,"(",3,")","=",null,null,"PAV (3)=","(",3,")",null,null,null,"\"PAV 2 1 A\"","PAV (3)=\"PAV 2 1 A\""]
["\"","PAV",1,"(",4,")","=",null,null,"PAV (4)=","(",4,")",null,null,null,"\"PAV 3 1 A\"","PAV (4)=\"PAV 3 1 A\""]
["\"","PAV",1,"(",5,")","=",null,null,"PAV (5)=","(",5,")",null,null,null,"\"PLATIBANDA 1 A\"","PAV (5)=\"PLATIBANDA 1 A\""]
["\"","PAV",1,"(",6,")","=",null,null,"PAV (6)=","(",6,")",null,null,null,"\"TÉRREO 1 B\"","PAV (6)=\"TÉRREO 1 B\""]
["\"","PAV",1,"(",7,")","=",null,null,"PAV (7)=","(",7,")",null,null,null,"\"PAV 1 1 B\"","PAV (7)=\"PAV 1 1 B\""]
["\"","PAV",1,"(",8,")","=",null,null,"PAV (8)=","(",8,")",null,null,null,"\"PAV 2 1 B\"","PAV (8)=\"PAV 2 1 B\""]
["\"","PAV",1,"(",9,")","=",null,null,"PAV (9)=","(",9,")",null,null,null,"\"PAV 3 1 B\"","PAV (9)=\"PAV 3 1 B\""]
["\"","PAV",1,"(",10,")","=",null,null,"PAV (10)=","(",10,")",null,null,null,"\"PLATIBANDA 1 B\"","PAV (10)=\"PLATIBANDA 1 B\""]
["\"","PAV",2,"(",11,")","=",null,null,"PAV (11)=","(",11,")",null,null,null,"\"TÉRREO 2 A\"","PAV (11)=\"TÉRREO 2 A\""]
["\"","PAV",2,"(",12,")","=",null,null,"PAV (12)=","(",12,")",null,null,null,"\"PAV 1 2 A\"","PAV (12)=\"PAV 1 2 A\""]
["\"","PAV",2,"(",13,")","=",null,null,"PAV (13)=","(",13,")",null,null,null,"\"PAV 2 2 A\"","PAV (13)=\"PAV 2 2 A\""]
["\"","PAV",2,"(",14,")","=",null,null,"PAV (14)=","(",14,")",null,null,null,"\"PAV 3 2 A\"","PAV (14)=\"PAV 3 2 A\""]
["\"","PAV",2,"(",15,")","=",null,null,"PAV (15)=","(",15,")",null,null,null,"\"PLATIBANDA 2 A\"","PAV (15)=\"PLATIBANDA 2 A\""]
{"$rows_left_out":66}
{"sheet":"Planilha1","index":3,"n_rows":0,"n_cols":0,"rows_kept":0,"cut":false,"hidden":false,"merged":[]}

{"sheet":"BD","index":4,"n_rows":43,"n_cols":26,"rows_kept":43,"cut":false,"hidden":false,"merged":[[21,26,21,28]]}
["SERVIÇO EXECUTADO","R","G","B","MÊS APLICADO","SERVIÇO","INDICADOR","SHAPES",null,"SERVIÇO","JANEIRO","FEVEREIRO","MARÇO","ABRIL","MAIO","JUNHO","JULHO","AGOSTO","SETEMBRO","OUTUBRO","NOVEMBRO","DEZEMBRO","TOTAL"]
["MONTAGEM DE FORMAS PAV 1 6C",155,194,230,"NOVEMBRO","MONTAGEM DE FORMAS",1,"PAV 1 6C",null,{"$f":"_xlfn._xlws.SORT(_xlfn.UNIQUE(Tabela2[SERVIÇO],0,0))","v":"AGUA FRIA RADIER"},{"$f":"SUMIFS($G$2:$G10058,$F$2:$F10058,$J2,$E$2:$E10058,$K$1)","v":0},{"$f":"SUMIFS($G$2:$G10058,F$2:$F10058,$J2,$E$2:$E10058,$L$1)","v":0},{"$f":"SUMIFS($G$2:$G10058,$F$2:$F10058,$J2,$E$2:$E10058,$M$1)","v":0},{"$f":"SUMIFS($G$2:$G10058,$F$2:$F10058,$J2,$E$2:$E10058,$N$1)","v":0},{"$f":"SUMIFS($G$2:$G10058,$F$2:$F10058,$J2,$E$2:$E10058,$O$1)","v":0},{"$f":"SUMIFS($G$2:$G10058,$F$2:$F10058,$J2,$E$2:$E10058,$P$1)","v":0},{"$f":"SUMIFS($G$2:$G10058,$F$2:$F10058,$J2,$E$2:$E10058,$Q$1)","v":0},{"$f":"SUMIFS($G$2:$G10058,$F$2:$F10058,$J2,$E$2:$E10058,$R$1)","v":0},{"$f":"SUMIFS($G$2:$G10058,$F$2:$F10058,$J2,$E$2:$E10058,$S$1)","v":0},{"$f":"SUMIFS($G$2:$G10058,$F$2:$F10058,$J2,$E$2:$E10058,$T$1)","v":0},{"$f":"SUMIFS($G$2:$G10058,$F$2:$F10058,$J2,$E$2:$E10058,$U$1)","v":0},{"$f":"SUMIFS($G$2:$G10058,$F$2:$F10058,$J2,$E$2:$E10058,$V$1)","v":0},{"$f":"SUM(K2:V2)","v":0}]
["MONTAGEM DE FORMAS TERREO 6C",155,194,230,"NOVEMBRO","MONTAGEM DE FORMAS",1,"TERREO 6C",null,"ARMAÇÃO DE LAJE",{"$f":"SUMIFS($G$2:$G10059,$F$2:$F10059,$J3,$E$2:$E10059,$K$1)","v":0},{"$f":"SUMIFS($G$2:$G10059,$F$2:$F10059,$J3,$E$2:$E10059,$L$1)","v":0},{"$f":"SUMIFS($G$2:$G10059,$F$2:$F10059,$J3,$E$2:$E10059,$M$1)","v":0},{"$f":"SUMIFS($G$2:$G10059,$F$2:$F10059,$J3,$E$2:$E10059,$N$1)","v":8},{"$f":"SUMIFS($G$2:$G10059,$F$2:$F10059,$J3,$E$2:$E10059,$O$1)","v":0},{"$f":"SUMIFS($G$2:$G10059,$F$2:$F10059,$J3,$E$2:$E10059,$P$1)","v":0},{"$f":"SUMIFS($G$2:$G10059,$F$2:$F10059,$J3,$E$2:$E10059,$Q$1)","v":0},{"$f":"SUMIFS($G$2:$G10059,$F$2:$F10059,$J3,$E$2:$E10059,$R$1)","v":0},{"$f":"SUMIFS($G$2:$G10059,$F$2:$F10059,$J3,$E$2:$E10059,$S$1)","v":0},{"$f":"SUMIFS($G$2:$G10059,$F$2:$F10059,$J3,$E$2:$E10059,$T$1)","v":6},{"$f":"SUMIFS($G$2:$G10059,$F$2:$F10059,$J3,$E$2:$E10059,$U$1)","v":0},{"$f":"SUMIFS($G$2:$G10059,$F$2:$F10059,$J3,$E$2:$E10059,$V$1)","v":0},{"$f":"SUM(K3:V3)","v":14}]
["MONTAGEM DE FORMAS PAV 2 6C",155,194,230,"NOVEMBRO","MONTAGEM DE FORMAS",1,"PAV 2 6C",null,"ARMAÇÃO DE LAJE COBERTURA",{"$f":"SUMIFS($G$2:$G10060,$F$2:$F10060,$J4,$E$2:$E10060,$K$1)","v":0},{"$f":"SUMIFS($G$2:$G10060,$F$2:$F10060,$J4,$E$2:$E10060,$L$1)","v":0},{"$f":"SUMIFS($G$2:$G10060,$F$2:$F10060,$J4,$E$2:$E10060,$M$1)","v":0},{"$f":"SUMIFS($G$2:$G10060,$F$2:$F10060,$J4,$E$2:$E10060,$N$1)","v":0},{"$f":"SUMIFS($G$2:$G10060,$F$2:$F10060,$J4,$E$2:$E10060,$O$1)","v":0},{"$f":"SUMIFS($G$2:$G10060,$F$2:$F10060,$J4,$E$2:$E10060,$P$1)","v":0},{"$f":"SUMIFS($G$2:$G10060,$F$2:$F10060,$J4,$E$2:$E10060,$Q$1)","v":0},{"$f":"SUMIFS($G$2:$G10060,$F$2:$F10060,$J4,$E$2:$E10060,$R$1)","v":0},{"$f":"SUMIFS($G$2:$G10060,$F$2:$F10060,$J4,$E$2:$E10060,$S$1)","v":0},{"$f":"SUMIFS($G$2:$G10060,$F$2:$F10060,$J4,$E$2:$E10060,$T$1)","v":0},{"$f":"SUMIFS($G$2:$G10060,$F$2:$F10060,$J4,$E$2:$E10060,$U$1)","v":0},{"$f":"SUMIFS($G$2:$G10060,$F$2:$F10060,$J4,$E$2:$E10060,$V$1)","v":0},0]
["MONTAGEM DE FORMAS PAV 3 6C",155,194,230,"NOVEMBRO","MONTAGEM DE FORMAS",1,"PAV 3 6C",null,"ARMAÇÃO DE LAJE TIPO",{"$f":"SUMIFS($G$2:$G10061,$F$2:$F10061,$J5,$E$2:$E10061,$K$1)","v":0},{"$f":"SUMIFS($G$2:$G10061,$F$2:$F10061,$J5,$E$2:$E10061,$L$1)","v":0},{"$f":"SUMIFS($G$2:$G10061,$F$2:$F10061,$J5,$E$2:$E10061,$M$1)","v":0},{"$f":"SUMIFS($G$2:$G10061,$F$2:$F10061,$J5,$E$2:$E10061,$N$1)","v":0},{"$f":"SUMIFS($G$2:$G10061,$F$2:$F10061,$J5,$E$2:$E10061,$O$1)","v":0},{"$f":"SUMIFS($G$2:$G10061,$F$2:$F10061,$J5,$E$2:$E10061,$P$1)","v":0},{"$f":"SUMIFS($G$2:$G10061,$F$2:$F10061,$J5,$E$2:$E10061,$Q$1)","v":0},{"$f":"SUMIFS($G$2:$G10061,$F$2:$F10061,$J5,$E$2:$E10061,$R$1)","v":0},{"$f":"SUMIFS($G$2:$G10061,$F$2:$F10061,$J5,$E$2:$E10061,$S$1)","v":0},{"$f":"SUMIFS($G$2:$G10061,$F$2:$F10061,$J5,$E$2:$E10061,$T$1)","v":0},{"$f":"SUMIFS($G$2:$G10061,$F$2:$F10061,$J5,$E$2:$E10061,$U$1)","v":0},{"$f":"SUMIFS($G$2:$G10061,$F$2:$F10061,$J5,$E$2:$E10061,$V$1)","v":0},0]
["MONTAGEM DE FORMAS PAV 3 6B",198,224,180,"AGOSTO","MONTAGEM DE FORMAS",1,"PAV 3 6B",null,"ARMAÇÃO PAREDE TÉRREO",{"$f":"SUMIFS($G$2:$G10062,$F$2:$F10062,$J6,$E$2:$E10062,$K$1)","v":0},{"$f":"SUMIFS($G$2:$G10062,$F$2:$F10062,$J6,$E$2:$E10062,$L$1)","v":0},{"$f":"SUMIFS($G$2:$G10062,$F$2:$F10062,$J6,$E$2:$E10062,$M$1)","v":0},{"$f":"SUMIFS($G$2:$G10062,$F$2:$F10062,$J6,$E$2:$E10062,$N$1)","v":0},{"$f":"SUMIFS($G$2:$G10062,$F$2:$F10062,$J6,$E$2:$E10062,$O$1)","v":0},{"$f":"SUMIFS($G$2:$G10062,$F$2:$F10062,$J6,$E$2:$E10062,$P$1)","v":0},{"$f":"SUMIFS($G$2:$G10062,$F$2:$F10062,$J6,$E$2:$E10062,$Q$1)","v":0},{"$f":"SUMIFS($G$2:$G10062,$F$2:$F10062,$J6,$E$2:$E10062,$R$1)","v":0},{"$f":"SUMIFS($G$2:$G10062,$F$2:$F10062,$J6,$E$2:$E10062,$S$1)","v":0},{"$f":"SUMIFS($G$2:$G10062,$F$2:$F10062,$J6,$E$2:$E10062,$T$1)","v":0},{"$f":"SUMIFS($G$2:$G10062,$F$2:$F10062,$J6,$E$2:$E10062,$U$1)","v":0},{"$f":"SUMIFS($G$2:$G10062,$F$2:$F10062,$J6,$E$2:$E10062,$V$1)","v":0},0]
["MONTAGEM DE FORMAS PAV 2 6B",198,224,180,"AGOSTO","MONTAGEM DE FORMAS",1,"PAV 2 6B",null,"ARMAÇÃO PAREDE TIPO-COBERT",{"$f":"SUMIFS($G$2:$G10063,$F$2:$F10063,$J7,$E$2:$E10063,$K$1)","v":0},{"$f":"SUMIFS($G$2:$G10063,$F$2:$F10063,$J7,$E$2:$E10063,$L$1)","v":0},{"$f":"SUMIFS($G$2:$G10063,$F$2:$F10063,$J7,$E$2:$E10063,$M$1)","v":0},{"$f":"SUMIFS($G$2:$G10063,$F$2:$F10063,$J7,$E$2:$E10063,$N$1)","v":0},{"$f":"SUMIFS($G$2:$G10063,$F$2:$F10063,$J7,$E$2:$E10063,$O$1)","v":0},{"$f":"SUMIFS($G$2:$G10063,$F$2:$F10063,$J7,$E$2:$E10063,$P$1)","v":0},{"$f":"SUMIFS($G$2:$G10063,$F$2:$F10063,$J7,$E$2:$E10063,$Q$1)","v":0},{"$f":"SUMIFS($G$2:$G10063,$F$2:$F10063,$J7,$E$2:$E10063,$R$1)","v":0},{"$f":"SUMIFS($G$2:$G10063,$F$2:$F10063,$J7,$E$2:$E10063,$S$1)","v":0},{"$f":"SUMIFS($G$2:$G10063,$F$2:$F10063,$J7,$E$2:$E10063,$T$1)","v":0},{"$f":"SUMIFS($G$2:$G10063,$F$2:$F10063,$J7,$E$2:$E10063,$U$1)","v":0},{"$f":"SUMIFS($G$2:$G10063,$F$2:$F10063,$J7,$E$2:$E10063,$V$1)","v":0},0]
["MONTAGEM DE FORMAS PAV 1 6B",198,224,180,"AGOSTO","MONTAGEM DE FORMAS",1,"PAV 1 6B",null,"ARMAÇÃO RADIER 2 BLOCOS",{"$f":"SUMIFS($G$2:$G10064,$F$2:$F10064,$J8,$E$2:$E10064,$K$1)","v":0},{"$f":"SUMIFS($G$2:$G10064,$F$2:$F10064,$J8,$E$2:$E10064,$L$1)","v":0},{"$f":"SUMIFS($G$2:$G10064,$F$2:$F10064,$J8,$E$2:$E10064,$M$1)","v":0},{"$f":"SUMIFS($G$2:$G10064,$F$2:$F10064,$J8,$E$2:$E10064,$N$1)","v":0},{"$f":"SUMIFS($G$2:$G10064,$F$2:$F10064,$J8,$E$2:$E10064,$O$1)","v":0},{"$f":"SUMIFS($G$2:$G10064,$F$2:$F10064,$J8,$E$2:$E10064,$P$1)","v":0},{"$f":"SUMIFS($G$2:$G10064,$F$2:$F10064,$J8,$E$2:$E10064,$Q$1)","v":0},{"$f":"SUMIFS($G$2:$G10064,$F$2:$F10064,$J8,$E$2:$E10064,$R$1)","v":0},{"$f":"SUMIFS($G$2:$G10064,$F$2:$F10064,$J8,$E$2:$E10064,$S$1)","v":0},{"$f":"SUMIFS($G$2:$G10064,$F$2:$F10064,$J8,$E$2:$E10064,$T$1)","v":0},{"$f":"SUMIFS($G$2:$G10064,$F$2:$F10064,$J8,$E$2:$E10064,$U$1)","v":0},{"$f":"SUMIFS($G$2:$G10064,$F$2:$F10064,$J8,$E$2:$E10064,$V$1)","v":0},0]
["MONTAGEM DE FORMAS TERREO 6B",198,224,180,"AGOSTO","MONTAGEM DE FORMAS",1,"TERREO 6B",null,"ARMAÇÃO RADIER 3 BLOCOS",{"$f":"SUMIFS($G$2:$G10065,$F$2:$F10065,$J9,$E$2:$E10065,$K$1)","v":0},{"$f":"SUMIFS($G$2:$G10065,$F$2:$F10065,$J9,$E$2:$E10065,$L$1)","v":0},{"$f":"SUMIFS($G$2:$G10065,$F$2:$F10065,$J9,$E$2:$E10065,$M$1)","v":0},{"$f":"SUMIFS($G$2:$G10065,$F$2:$F10065,$J9,$E$2:$E10065,$N$1)","v":0},{"$f":"SUMIFS($G$2:$G10065,$F$2:$F10065,$J9,$E$2:$E10065,$O$1)","v":0},{"$f":"SUMIFS($G$2:$G10065,$F$2:$F10065,$J9,$E$2:$E10065,$P$1)","v":0},{"$f":"SUMIFS($G$2:$G10065,$F$2:$F10065,$J9,$E$2:$E10065,$Q$1)","v":0},{"$f":"SUMIFS($G$2:$G10065,$F$2:$F10065,$J9,$E$2:$E10065,$R$1)","v":0},{"$f":"SUMIFS($G$2:$G10065,$F$2:$F10065,$J9,$E$2:$E10065,$S$1)","v":0},{"$f":"SUMIFS($G$2:$G10065,$F$2:$F10065,$J9,$E$2:$E10065,$T$1)","v":0},{"$f":"SUMIFS($G$2:$G10065,$F$2:$F10065,$J9,$E$2:$E10065,$U$1)","v":0},{"$f":"SUMIFS($G$2:$G10065,$F$2:$F10065,$J9,$E$2:$E10065,$V$1)","v":0},0]
["MONTAGEM DE FORMAS PAV 3 6A",198,89,17,"MAIO","MONTAGEM DE FORMAS",1,"PAV 3 6A",null,"COBERTURA - TELHADO",{"$f":"SUMIFS($G$2:$G10066,$F$2:$F10066,$J10,$E$2:$E10066,$K$1)","v":0},{"$f":"SUMIFS($G$2:$G10066,$F$2:$F10066,$J10,$E$2:$E10066,$L$1)","v":0},{"$f":"SUMIFS($G$2:$G10066,$F$2:$F10066,$J10,$E$2:$E10066,$M$1)","v":0},{"$f":"SUMIFS($G$2:$G10066,$F$2:$F10066,$J10,$E$2:$E10066,$N$1)","v":0},{"$f":"SUMIFS($G$2:$G10066,$F$2:$F10066,$J10,$E$2:$E10066,$O$1)","v":0},{"$f":"SUMIFS($G$2:$G10066,$F$2:$F10066,$J10,$E$2:$E10066,$P$1)","v":0},{"$f":"SUMIFS($G$2:$G10066,$F$2:$F10066,$J10,$E$2:$E10066,$Q$1)","v":0},{"$f":"SUMIFS($G$2:$G10066,$F$2:$F10066,$J10,$E$2:$E10066,$R$1)","v":0},{"$f":"SUMIFS($G$2:$G10066,$F$2:$F10066,$J10,$E$2:$E10066,$S$1)","v":0},{"$f":"SUMIFS($G$2:$G10066,$F$2:$F10066,$J10,$E$2:$E10066,$T$1)","v":0},{"$f":"SUMIFS($G$2:$G10066,$F$2:$F10066,$J10,$E$2:$E10066,$U$1)","v":0},{"$f":"SUMIFS($G$2:$G10066,$F$2:$F10066,$J10,$E$2:$E10066,$V$1)","v":0},0]
["MONTAGEM DE FORMAS PAV 2 6A",198,89,17,"MAIO","MONTAGEM DE FORMAS",1,"PAV 2 6A",null,"ESGOTO RADIER",{"$f":"SUMIFS($G$2:$G10067,$F$2:$F10067,$J11,$E$2:$E10067,$K$1)","v":0},{"$f":"SUMIFS($G$2:$G10067,$F$2:$F10067,$J11,$E$2:$E10067,$L$1)","v":0},{"$f":"SUMIFS($G$2:$G10067,$F$2:$F10067,$J11,$E$2:$E10067,$M$1)","v":0},{"$f":"SUMIFS($G$2:$G10067,$F$2:$F10067,$J11,$E$2:$E10067,$N$1)","v":0},{"$f":"SUMIFS($G$2:$G10067,$F$2:$F10067,$J11,$E$2:$E10067,$O$1)","v":0},{"$f":"SUMIFS($G$2:$G10067,$F$2:$F10067,$J11,$E$2:$E10067,$P$1)","v":0},{"$f":"SUMIFS($G$2:$G10067,$F$2:$F10067,$J11,$E$2:$E10067,$Q$1)","v":0},{"$f":"SUMIFS($G$2:$G10067,$F$2:$F10067,$J11,$E$2:$E10067,$R$1)","v":0},{"$f":"SUMIFS($G$2:$G10067,$F$2:$F10067,$J11,$E$2:$E10067,$S$1)","v":0},{"$f":"SUMIFS($G$2:$G10067,$F$2:$F10067,$J11,$E$2:$E10067,$T$1)","v":0},{"$f":"SUMIFS($G$2:$G10067,$F$2:$F10067,$J11,$E$2:$E10067,$U$1)","v":0},{"$f":"SUMIFS($G$2:$G10067,$F$2:$F10067,$J11,$E$2:$E10067,$V$1)","v":0},0]
["MONTAGEM DE FORMAS TERREO 6A",198,89,17,"MAIO","MARCAÇÃO DE LAJE",1,"TERREO 6A",null,"HIDROSANITÁRIO TIPO",{"$f":"SUMIFS($G$2:$G10068,$F$2:$F10068,$J12,$E$2:$E10068,$K$1)","v":0},{"$f":"SUMIFS($G$2:$G10068,$F$2:$F10068,$J12,$E$2:$E10068,$L$1)","v":0},{"$f":"SUMIFS($G$2:$G10068,$F$2:$F10068,$J12,$E$2:$E10068,$M$1)","v":0},{"$f":"SUMIFS($G$2:$G10068,$F$2:$F10068,$J12,$E$2:$E10068,$N$1)","v":0},{"$f":"SUMIFS($G$2:$G10068,$F$2:$F10068,$J12,$E$2:$E10068,$O$1)","v":0},{"$f":"SUMIFS($G$2:$G10068,$F$2:$F10068,$J12,$E$2:$E10068,$P$1)","v":0},{"$f":"SUMIFS($G$2:$G10068,$F$2:$F10068,$J12,$E$2:$E10068,$Q$1)","v":0},{"$f":"SUMIFS($G$2:$G10068,$F$2:$F10068,$J12,$E$2:$E10068,$R$1)","v":0},{"$f":"SUMIFS($G$2:$G10068,$F$2:$F10068,$J12,$E$2:$E10068,$S$1)","v":0},{"$f":"SUMIFS($G$2:$G10068,$F$2:$F10068,$J12,$E$2:$E10068,$T$1)","v":0},{"$f":"SUMIFS($G$2:$G10068,$F$2:$F10068,$J12,$E$2:$E10068,$U$1)","v":0},{"$f":"SUMIFS($G$2:$G10068,$F$2:$F10068,$J12,$E$2:$E10068,$V$1)","v":0},0,null,null,"LÓGICA = SE MAPA ILUMNADO K3 FOR IGUAL A HIDROSAINTÁRIO TIPO ENTÃO FILTRAR OS MESES COM ESSE SERVIÇO EXECUTADO, E CONTAR CADA SERVIÇO EXECUTADO NO MÊS."]
["MONTAGEM DE FORMAS PAV 1 6A",198,89,17,"MAIO","MONTAGEM DE FORMAS",1,"PAV 1 6A",null,"HIDROSSANITÁRIO",{"$f":"SUMIFS($G$2:$G10069,$F$2:$F10069,$J13,$E$2:$E10069,$K$1)","v":0},{"$f":"SUMIFS($G$2:$G10069,$F$2:$F10069,$J13,$E$2:$E10069,$L$1)","v":0},{"$f":"SUMIFS($G$2:$G10069,$F$2:$F10069,$J13,$E$2:$E10069,$M$1)","v":0},{"$f":"SUMIFS($G$2:$G10069,$F$2:$F10069,$J13,$E$2:$E10069,$N$1)","v":0},{"$f":"SUMIFS($G$2:$G10069,$F$2:$F10069,$J13,$E$2:$E10069,$O$1)","v":0},{"$f":"SUMIFS($G$2:$G10069,$F$2:$F10069,$J13,$E$2:$E10069,$P$1)","v":0},{"$f":"SUMIFS($G$2:$G10069,$F$2:$F10069,$J13,$E$2:$E10069,$Q$1)","v":0},{"$f":"SUMIFS($G$2:$G10069,$F$2:$F10069,$J13,$E$2:$E10069,$R$1)","v":0},{"$f":"SUMIFS($G$2:$G10069,$F$2:$F10069,$J13,$E$2:$E10069,$S$1)","v":0},{"$f":"SUMIFS($G$2:$G10069,$F$2:$F10069,$J13,$E$2:$E10069,$T$1)","v":0},{"$f":"SUMIFS($G$2:$G10069,$F$2:$F10069,$J13,$E$2:$E10069,$U$1)","v":0},{"$f":"SUMIFS($G$2:$G10069,$F$2:$F10069,$J13,$E$2:$E10069,$V$1)","v":0},0]
["MONTAGEM DE FORMAS PAV 2 5A",198,89,17,"MAIO","MONTAGEM DE FORMAS",1,"PAV 2 5A",null,"IMPLANTAÇÃO",{"$f":"SUMIFS($G$2:$G10070,$F$2:$F10070,$J14,$E$2:$E10070,$K$1)","v":0},{"$f":"SUMIFS($G$2:$G10070,$F$2:$F10070,$J14,$E$2:$E10070,$L$1)","v":0},{"$f":"SUMIFS($G$2:$G10070,$F$2:$F10070,$J14,$E$2:$E10070,$M$1)","v":0},{"$f":"SUMIFS($G$2:$G10070,$F$2:$F10070,$J14,$E$2:$E10070,$N$1)","v":0},{"$f":"SUMIFS($G$2:$G10070,$F$2:$F10070,$J14,$E$2:$E10070,$O$1)","v":0},{"$f":"SUMIFS($G$2:$G10070,$F$2:$F10070,$J14,$E$2:$E10070,$P$1)","v":0},{"$f":"SUMIFS($G$2:$G10070,$F$2:$F10070,$J14,$E$2:$E10070,$Q$1)","v":0},{"$f":"SUMIFS($G$2:$G10070,$F$2:$F10070,$J14,$E$2:$E10070,$R$1)","v":0},{"$f":"SUMIFS($G$2:$G10070,$F$2:$F10070,$J14,$E$2:$E10070,$S$1)","v":0},{"$f":"SUMIFS($G$2:$G10070,$F$2:$F10070,$J14,$E$2:$E10070,$T$1)","v":0},{"$f":"SUMIFS($G$2:$G10070,$F$2:$F10070,$J14,$E$2:$E10070,$U$1)","v":0},{"$f":"SUMIFS($G$2:$G10070,$F$2:$F10070,$J14,$E$2:$E10070,$V$1)","v":0},0]
["MONTAGEM DE FORMAS PAV 2 4B",198,89,17,"MAIO","MONTAGEM DE FORMAS",1,"PAV 2 4B",null,"KIT LIGA FÁCIL",{"$f":"SUMIFS($G$2:$G10071,$F$2:$F10071,$J15,$E$2:$E10071,$K$1)","v":0},{"$f":"SUMIFS($G$2:$G10071,$F$2:$F10071,$J15,$E$2:$E10071,$L$1)","v":0},{"$f":"SUMIFS($G$2:$G10071,$F$2:$F10071,$J15,$E$2:$E10071,$M$1)","v":0},{"$f":"SUMIFS($G$2:$G10071,$F$2:$F10071,$J15,$E$2:$E10071,$N$1)","v":0},{"$f":"SUMIFS($G$2:$G10071,$F$2:$F10071,$J15,$E$2:$E10071,$O$1)","v":0},{"$f":"SUMIFS($G$2:$G10071,$F$2:$F10071,$J15,$E$2:$E10071,$P$1)","v":0},{"$f":"SUMIFS($G$2:$G10071,$F$2:$F10071,$J15,$E$2:$E10071,$Q$1)","v":0},{"$f":"SUMIFS($G$2:$G10071,$F$2:$F10071,$J15,$E$2:$E10071,$R$1)","v":0},{"$f":"SUMIFS($G$2:$G10071,$F$2:$F10071,$J15,$E$2:$E10071,$S$1)","v":0},{"$f":"SUMIFS($G$2:$G10071,$F$2:$F10071,$J15,$E$2:$E10071,$T$1)","v":0},{"$f":"SUMIFS($G$2:$G10071,$F$2:$F10071,$J15,$E$2:$E10071,$U$1)","v":0},{"$f":"SUMIFS($G$2:$G10071,$F$2:$F10071,$J15,$E$2:$E10071,$V$1)","v":0},0]
{"$rows_left_out":28}