{"text_format":"1","workbook":"xlsx","n_sheets":3,"sheets":["FORMULÁRIO","DADOS","FILTROS"],"not_rendered":{"charts":0,"images":0,"macros":1,"external_links":0,"defined_names":5,"comments":0,"pivot_tables":0},"unopened":[],"bounds":{"document_bytes":16777216,"sheet_cells":100000,"rows_first":2000,"rows_last":500,"rows_between":2000,"halvings":0,"cell_chars":16384,"cell_head_chars":4096},"cells_cut":0,"cells_raw":0,"read":"whole","date_system":"1900"}

{"sheet":"FORMULÁRIO","index":0,"n_rows":14,"n_cols":2,"rows_kept":14,"cut":false,"hidden":false,"merged":[[0,0,0,11]]}
["ASSUNTO"]
[]
[]
[]
[]
[]
[]
[]
[]
[]
[]
[]
[]
[null,"RESULTADO"]

{"sheet":"DADOS","index":1,"n_rows":53,"n_cols":9,"rows_kept":53,"cut":false,"hidden":false,"merged":[]}
["ÁREA","ASSUNTO","CURSO","MANHÃ","TARDE","NOITE","VALOR","INÍCIO","FIM"]
["Software","Access","Access Básico","Sim","Não","Sim",350,"2011-01-03","2011-01-10"]
["Software","Access","Access com VBA","Não","Não","Sim",900,"2011-01-05","2011-01-15"]
["Software","Access","Access Avançado e Macros","Não","Não","Sim",450,"2011-01-07","2011-01-17"]
["Software","Access","Access com VBA","Sim","Não","Sim",900,"2011-01-09","2011-01-19"]
["Software","Access","Access Básico","Sim","Sim","Sim",350,"2011-01-11","2011-01-18"]
["Software","Access","Access Avançado","Não","Não","Não",450,"2011-01-13","2011-01-23"]
["Software","Access","Access Básico","Sim","Não","Sim",350,"2011-01-15","2011-01-22"]
["Software","Access","Access com VBA","Sim","Não","Sim",900,"2011-01-17","2011-01-27"]
["Software","Excel","Excel Avançado","Não","Não","Sim",450,"2011-01-19","2011-01-29"]
["Software","Excel","Excel Básico","Sim","Sim","Sim",350,"2011-01-21","2011-01-28"]
["Software","Excel","Excel Avançado","Sim","Não","Sim",450,"2011-01-23","2011-02-02"]
["Software","Excel","Excel com VBA","Sim","Sim","Sim",900,"2011-01-25","2011-02-04"]
["Software","Excel","Excel Básico","Sim","Não","Sim",350,"2011-01-27","2011-02-03"]
["Software","Excel","Excel Avançado","Sim","Não","Sim",450,"2011-01-29","2011-02-08"]
["Software","Excel","Excel Básico","Não","Não","Sim",350,"2011-01-31","2011-02-07"]
["Software","Word","Word Básico","Não","Não","Sim",300,"2011-02-02","2011-02-09"]
["Software","Word","Word Básico","Sim","Não","Sim",300,"2011-02-04","2011-02-11"]
["Software","Word","Word Avançado","Sim","Sim","Sim",360,"2011-02-06","2011-02-16"]
["Software","Word","Word Básico","Sim","Sim","Sim",300,"2011-02-08","2011-02-15"]
["Software","Word","Word Avançado","Sim","Não","Sim",360,"2011-02-10","2011-02-20"]
["Software","Power Point","Power Point Básico","Não","Não","Sim",230,"2011-02-12","2011-02-17"]
["Software","Power Point","Power Point Básico","Sim","Sim","Sim",230,"2011-02-14","2011-02-19"]
["Software","Power Point","Power Point Avançado","Sim","Não","Sim",290,"2011-02-16","2011-02-21"]
["Software","Power Point","Power Point Básico","Sim","Não","Sim",230,"2011-02-18","2011-02-23"]
["Software","Power Point","Power Point Básico","Não","Não","Sim",230,"2011-02-20","2011-02-25"]
["Software","Power Point","Power Point Básico","Sim","Não","Não",230,"2011-02-22","2011-02-27"]
["Hardware","Manutenção de Micros","Manutenção I","Não","Não","Sim",578,"2011-02-24","2011-03-21"]
["Hardware","Manutenção de Micros","Manutenção I","Sim","Não","Sim",578,"2011-02-26","2011-03-23"]
["Hardware","Manutenção de Micros","Manutenção II","Sim","Sim","Sim",590,"2011-02-28","2011-03-25"]
["Hardware","Manutenção de Micros","Manutenção II","Sim","Não","Sim",590,"2011-03-02","2011-03-27"]
["Hardware","Manutenção de Micros","Manutenção I","Sim","Sim","Sim",578,"2011-03-04","2011-03-29"]
["Hardware","Manutenção de Micros","Manutenção I","Não","Não","Sim",578,"2011-03-06","2011-03-31"]
["Hardware","Manutenção de Micros","Manutenção II","Sim","Não","Sim",590,"2011-03-08","2011-04-02"]
["Hardware","Manutenção de Micros","Manutenção II","Sim","Não","Sim",590,"2011-03-10","2011-04-04"]
["Hardware","Manutenção de Periféricos","Impressoras","Sim","Sim","Sim",230,"2011-03-12","2011-03-17"]
["Hardware","Manutenção de Periféricos","Vídeo","Não","Não","Sim",250,"2011-03-14","2011-03-17"]
["Hardware","Manutenção de Periféricos","Impressoras","Sim","Não","Sim",230,"2011-03-16","2011-03-21"]
["Hardware","Manutenção de Periféricos","Placa de Som","Sim","Não","Sim",200,"2011-03-18","2011-03-21"]
["Hardware","Manutenção de Periféricos","Placa de Som","Sim","Não","Sim",200,"2011-03-20","2011-03-23"]
["Hardware","Manutenção de Periféricos","Impressoras","Sim","Sim","Sim",230,"2011-03-22","2011-03-27"]
["Hardware","Manutenção de Periféricos","Impressoras","Não","Não","Sim",230,"2011-03-24","2011-03-29"]
["Hardware","Manutenção de Notebook","Manutenção Básica","Não","Não","Sim",560,"2011-03-26","2011-04-15"]
["Hardware","Manutenção de Notebook","Manutenção Básica","Sim","Não","Sim",560,"2011-03-28","2011-04-17"]
["Hardware","Manutenção de Notebook","Teclado e vídeo","Sim","Não","Sim",300,"2011-03-30","2011-04-04"]
["Hardware","Manutenção de Notebook","Teclado e vídeo","Sim","Não","Sim",300,"2011-04-01","2011-04-06"]
["Hardware","Manutenção de Notebook","Manutenção Básica","Não","Não","Sim",560,"2011-04-03","2011-04-23"]
["Hardware","Redes","Instalação","Sim","Não","Sim",1000,"2011-04-05","2011-05-05"]
["Hardware","Redes","Configuração","Sim","Não","Sim",1200,"2011-04-07","2011-05-07"]
["Hardware","Redes","Instalação","Não","Não","Sim",1000,"2011-04-09","2011-05-09"]
["Hardware","Redes","Configuração","Sim","Não","Sim",1200,"2011-04-11","2011-05-11"]
["Hardware","Redes","Instalação","Sim","Não","Sim",1000,"2011-04-13","2011-05-13"]
["Hardware","Redes","Instalação","Sim","Não","Não",1000,"2011-04-15","2011-05-15"]

{"sheet":"FILTROS","index":2,"n_rows":4,"n_cols":8,"rows_kept":4,"cut":false,"hidden":false,"merged":[]}
["ÁREA","ASSUNTO","CURSO","MANHÃ","TARDE","NOITE",null,"Access"]
[{"$f":"IF(A3=1,\"SOFTWARE\",\"HARDWARE\")","v":"HARDWARE"},{"$f":"INDEX(H:H,B3,1)","v":"Excel"},{"$f":"INDEX(J:J,C3,1)","v":0},{"$f":"IF(D3=TRUE,\"SIM\",\"NÃO\")","v":"NÃO"},{"$f":"IF(E3=TRUE,\"SIM\",\"NÃO\")","v":"NÃO"},{"$f":"IF(F3=TRUE,\"SIM\",\"NÃO\")","v":"NÃO"},null,"Excel"]
[2,2,1,false,false,false,null,"Word"]
[null,null,null,null,null,null,null,"Power Point"]