{"text_format":"1","workbook":"xlsx","n_sheets":9,"sheets":["1.x PC","2.1 PC Rec.","2.2 PC. Desp.","2.3 PC. Transf.","2.4 PC. Contas","2.5 PC. C. Custo","2.6 PC. Cli. Fon.","Lançamentos","Validações"],"not_rendered":{"charts":0,"images":0,"macros":1,"external_links":4,"defined_names":25,"comments":9,"pivot_tables":0},"unopened":[],"bounds":{"document_bytes":16777216,"sheet_cells":100000,"rows_first":2000,"rows_last":500,"rows_between":2000,"halvings":0,"cell_chars":16384,"cell_head_chars":4096},"cells_cut":0,"cells_raw":0,"read":"whole","date_system":"1900"}

{"sheet":"1.x PC","index":0,"n_rows":59,"n_cols":14,"rows_kept":59,"cut":false,"hidden":false,"merged":[[7,0,7,2],[7,3,7,11],[7,12,7,13]]}
[]
[]
[]
[]
[]
[]
[]
["ENTRADAS",null,null,"SAÍDAS",null,null,null,null,null,null,null,null,"TRANSFERÊNCIAS"]
{"$rows_left_out":52}
{"sheet":"2.1 PC Rec.","index":1,"n_rows":21,"n_cols":8,"rows_kept":21,"cut":false,"hidden":false,"merged":[]}
[]
[]
["Entradas"]
[]
["1.01","Receita de vendas",null,"1.02","Receitas financeiras",null,"1.03","Outras entradas"]
["1.01.01","CEPA",null,"1.02.01","Rendimentos",null,"1.03.01","Receita não identificada"]
["1.01.02","GAC",null,"1.02.02","Estorno",null,"1.03.02","Estorno de pagamento"]
["1.01.03","RE",null,"1.02.03",null,null,"1.03.03","Aporte de capital"]
{"$rows_left_out":14}
{"sheet":"2.2 PC. Desp.","index":2,"n_rows":35,"n_cols":26,"rows_kept":35,"cut":false,"hidden":false,"merged":[]}
[]
[]
["Saídas"]
[]
["2.01","Despesa Operacional",null,"2.02","Despesa com pessoal",null,"2.03","Despesas comerciais",null,"2.04","Despesas administrativas",null,"2.05","Despesas financeiras",null,"2.06","Impostos",null,"2.07","Investimentos",null,"2.08","Retirada de sócios",null,"2.09","Outras saídas"]
["2.01.01","Materiais de Consumo",null,"2.02.01","Pró labore",null,"2.03.01","Comissões",null,"2.04.01","Aluguel",null,"2.05.01","Despesas bancárias",null,"2.06.01","DAS",null,"2.07.01","TI",null,"2.08.01","Distribuição de Lucros",null,"2.09.01","Pagamento indevido"]
["2.01.02","Fretes e Carretos",null,"2.02.02","Salário mensal",null,"2.03.02","Institucional",null,"2.04.02","Materiais de escritório",null,"2.05.02","Juros e multas",null,"2.06.02","Pis / Cofins",null,"2.07.02",null,null,"2.08.02","Mensal",null,"2.09.02","Devolução de estorno"]
["2.01.03","Serviços de Terceiros",null,"2.02.03","13º salário",null,"2.03.03","Reuniões / Visitas",null,"2.04.03","Contas de Consumo",null,"2.05.03",null,null,"2.06.03","IR/CS",null,"2.07.03",null,null,"2.08.03",null,null,"2.09.03","Dev. de aporte de capital"]
{"$rows_left_out":28}
{"sheet":"2.3 PC. Transf.","index":3,"n_rows":21,"n_cols":5,"rows_kept":21,"cut":false,"hidden":false,"merged":[]}
[]
[]
["Transferências"]
[]
["3.01","TRANSFERÊNCIAS (CRÉDITO)",null,"3.02","TRANSFERÊNCIAS (DÉBITO)"]
["3.01.01",null,null,"3.02.01"]
["3.01.02",null,null,"3.02.02"]
["3.01.03",null,null,"3.02.03"]
{"$rows_left_out":14}
{"sheet":"2.4 PC. Contas","index":4,"n_rows":11,"n_cols":9,"rows_kept":11,"cut":false,"hidden":false,"merged":[]}
[]
[]
["Rescursos Financeiros",null,null,"Defina a data de início do controle:","Mês",null,"Ano",null,{"$f":"DATE($G$4,VLOOKUP($E$4,Validações!$N:$O,2,FALSE),1)","v":"2017-01-01"}]
[null,null,null,null,"Janeiro",null,2017]
[]
["Id","Tipo","Identificação","Instituição","Agência","Conta",{"$f":"CONCATENATE(\"Saldo em \",TEXT($I$3,\"dd/mm/aa\"))","v":"Saldo em 01/01/17"},null,"Tipo  existentes"]
["4.01",null,"Itau","Itau (341)",1223,"123456-6",9548.74,null,"Caixa"]
["4.02",null,"Santander","Santander (033)",2345,"4567898-9",null,null,"Conta Corrente"]
{"$rows_left_out":4}
{"sheet":"2.5 PC. C. Custo","index":5,"n_rows":105,"n_cols":4,"rows_kept":105,"cut":false,"hidden":false,"merged":[]}
[]
[]
["Centro de custo"]
[]
["5.01","Centro de Custo","Descrição (opcional)","Nomenclatura"]
["5.01.01","Sócios",null,{"$f":"A6&\" - \"&B6","v":"5.01.01 - Sócios"}]
["5.01.02","Administrativo",null,{"$f":"A7&\" - \"&B7","v":"5.01.02 - Administrativo"}]
["5.01.03","Argo",null,"5.01.03 - Argo"]
{"$rows_left_out":98}
{"sheet":"2.6 PC. Cli. Fon.","index":6,"n_rows":1005,"n_cols":19,"rows_kept":1005,"cut":false,"hidden":false,"merged":[]}
[]
[]
["Clientes e Fornecedores"]
[]
["6.01","Clientes e Fornecedores","Cliente / Fornecedor","Descrição (opcional)",null,null,null,null,null,null,null,null,null,null,null,"6.01","Clientes e Fornecedores","Cliente / Fornecedor","Descrição (opcional)"]
["6.01.159","AAAAAAA","Fornecedor",null,null,null,null,null,null,null,null,null,null,null,null,null,{"$f":"D3","v":0}]
["6.01.335","BBBBBBB","Cliente"]
["6.01.199","CCCCCCCC","Fornecedor"]
{"$rows_left_out":998}
{"sheet":"Lançamentos","index":7,"n_rows":64,"n_cols":76,"rows_kept":64,"cut":false,"hidden":false,"merged":[]}
[]
[]
["Lançamentos",null,null,null,null,null,null,null,null,null,null,null,null,null,null,null,null,null,null,null,{"$f":"TODAY()","v":"2023-01-23"}]
[null,null,null,null,null,null,null,null,null,null,null,null,null,null,null,null,null,null,null,null,null,null,null,null,null,"Centro de Custo","Conta","Centro de Custo","Conta","Status","Cliente/Forn","Centro de Custo","Conta","Status","Cliente/Forn","Centro de Custo","Conta","Status","Cliente/Forn","Centro de Custo","Conta","Status","Cliente/Forn","Centro de Custo","Conta","Status","Cliente/Forn","Centro de Custo","Conta","Status","Cliente/Forn","Centro de Custo","Cliente/Forn","Mês",null,null,null,null,null,null,null,null,null,null,null,null,null,null,null,null,null,"Centro Custo","Cliente","Mês","Centro Custo","Cliente"]
["Data inclusão","Data VCTO","Competência","Dia PGTO","Parcela","Classificação","Plano de contas","Descrição","Cliente ou Fornecedor","Centro de Custo","Status","Conta","Valor","Data PGTO","Forma Pgto","Acumulado","VENCIDO","DIA PGTO","MÊS PGTO","ANO PGTO","Realizado + Previsto do mês",null,null,"Tipo","Mês","FC - 4.1","FC - 4.1","FC - 4.2","FC - 4.2","FC - 4.2","FC - 4.2","FC - 4.3","FC - 4.3","FC - 4.3","FC - 4.3","FC - 4.4","FC - 4.4","FC - 4.4","FC - 4.4","5.1","5.1","5.1","5.1","5.2","5.2","5.2","5.2","5.3","5.3","5.3","5.3","Dash","Dash","Dash",null,null,"Data inclusão","Data vencimento","Competência","Dia PGTO","Classificação","Plano de contas","Descrição","Cliente ou Fornecedor","Centro de Custo","Status","Conta","Valor","Data PGTO","Acumulado",null,"Desp.Adm.","Desp.Adm.","DRE","DRE","DRE"]
["2022-12-01","2023-01-11","2022-12-22",{"$f":"DAY(N6)","v":11},"única","2.01 - Despesa Operacional","2.01.03 - Serviços de Terceiros","Douglas - Elaboração RIT - Cabo Frio (parc.1/2)","Synaz (Douglas - RIT)","5.01.30 - Sao Jose Desenv. Imob. SA","Em aberto","Santander",-6200,"2023-01-11","Transferência",{"$f":"IFERROR(IF(OR(VLOOKUP(F6,Validações!$C$2:$D$17,2,FALSE)=1,VLOOKUP(F6,Validações!$C$2:$D$17,2,FALSE)=3),SUM(P5,M6),SUM(P5,-M6)),P5)","v":6200},{"$f":"IF(AND(N6<$U$3,K6=\"Em aberto\"),\"VENCIDO\",\"-\")","v":"VENCIDO"},{"$f":"DAY(N6)","v":11},{"$f":"TEXT($N6,\"mmmm\")","v":"janeiro"},{"$f":"YEAR(N6)","v":2023},"Saldo anterior",null,null,{"$f":"IFERROR(VLOOKUP(F6,Validações!$C$2:$D$17,2,FALSE),\"\")","v":2},{"$f":"IF(A6=\"\",\"\",TEXT($N6,\"mmmm\"))","v":"janeiro"},{"$f":"IF(#REF!=\"TODOS\",\"TODOS\",$J6)","v":{"$error":"#REF!"}},{"$f":"IF(#REF!=\"TODAS\",\"TODAS\",$L6)","v":{"$error":"#REF!"}},{"$f":"IF(#REF!=\"TODOS\",\"TODOS\",$J6)","v":{"$error":"#REF!"}},{"$f":"IF(#REF!=\"TODAS\",\"TODAS\",$L6)","v":{"$error":"#REF!"}},{"$f":"IF(#REF!=\"TODOS\",\"TODOS\",$K6)","v":{"$error":"#REF!"}},{"$f":"IF(#REF!=\"TODOS\",\"TODOS\",$I6)","v":{"$error":"#REF!"}},{"$f":"IF(#REF!=\"TODOS\",\"TODOS\",$J6)","v":{"$error":"#REF!"}},{"$f":"IF(#REF!=\"TODAS\",\"TODAS\",$L6)","v":{"$error":"#REF!"}},{"$f":"IF(#REF!=\"TODOS\",\"TODOS\",$K6)","v":{"$error":"#REF!"}},{"$f":"IF(#REF!=\"TODOS\",\"TODOS\",$I6)","v":{"$error":"#REF!"}},{"$f":"IF(#REF!=\"TODOS\",\"TODOS\",$J6)","v":{"$error":"#REF!"}},{"$f":"IF(#REF!=\"TODAS\",\"TODAS\",$L6)","v":{"$error":"#REF!"}},{"$f":"IF(#REF!=\"TODOS\",\"TODOS\",$K6)","v":{"$error":"#REF!"}},{"$f":"IF(#REF!=\"TODOS\",\"TODOS\",$I6)","v":{"$error":"#REF!"}},{"$f":"IF(#REF!=\"TODOS\",\"TODOS\",$J6)","v":{"$error":"#REF!"}},{"$f":"IF(#REF!=\"TODAS\",\"TODAS\",$L6)","v":{"$error":"#REF!"}},{"$f":"IF(#REF!=\"TODOS\",\"TODOS\",$K6)","v":{"$error":"#REF!"}},{"$f":"IF(#REF!=\"TODOS\",\"TODOS\",$I6)","v":{"$error":"#REF!"}},{"$f":"IF(#REF!=\"TODOS\",\"TODOS\",$J6)","v":{"$error":"#REF!"}},{"$f":"IF(#REF!=\"TODAS\",\"TODAS\",$L6)","v":{"$error":"#REF!"}},{"$f":"IF(#REF!=\"TODOS\",\"TODOS\",$K6)","v":{"$error":"#REF!"}},{"$f":"IF(#REF!=\"TODOS\",\"TODOS\",$I6)","v":{"$error":"#REF!"}},{"$f":"IF(#REF!=\"TODOS\",\"TODOS\",$J6)","v":{"$error":"#REF!"}},{"$f":"IF(#REF!=\"TODAS\",\"TODAS\",$L6)","v":{"$error":"#REF!"}},{"$f":"IF(#REF!=\"TODOS\",\"TODOS\",$K6)","v":{"$error":"#REF!"}},{"$f":"IF(#REF!=\"TODOS\",\"TODOS\",$I6)","v":{"$error":"#REF!"}},{"$f":"IF(#REF!=\"TODOS\",\"TODOS\",$J6)","v":{"$error":"#REF!"}},{"$f":"IF(#REF!=\"TODOS\",\"TODOS\",$I6)","v":{"$error":"#REF!"}},{"$f":"IF(#REF!=\"TODOS\",\"TODOS\",$Y6)","v":{"$error":"#REF!"}},null,null,null,null,null,null,null,null,null,null,null,"Em aberto",null,null,{"$f":"$U$3","v":"2023-01-23"},null,null,{"$f":"IF(#REF!=\"TODOS\",\"TODOS\",$J6)","v":{"$error":"#REF!"}},{"$f":"IF(#REF!=\"TODOS\",\"TODOS\",$I6)","v":{"$error":"#REF!"}},{"$f":"IF(#REF!=\"TODOS\",\"TODOS\",$C6)","v":{"$error":"#REF!"}},{"$f":"IF(#REF!=\"TODOS\",\"TODOS\",$J6)","v":{"$error":"#REF!"}},{"$f":"IF(#REF!=\"TODOS\",\"TODOS\",$I6)","v":{"$error":"#REF!"}}]
["2023-01-07","2023-01-16","2022-12-01",{"$f":"DAY(N7)","v":16},"única","2.01 - Despesa Operacional","2.01.03 - Serviços de Terceiros","Ana Moura - Serviços de comunicação - Planos de Manejo","Ana Moura","5.01.32 - IDG - Padua - Plano de Manejo","Pago","Santander",-360,"2023-01-16","Transferência",{"$f":"IFERROR(IF(OR(VLOOKUP(F7,Validações!$C$2:$D$17,2,FALSE)=1,VLOOKUP(F7,Validações!$C$2:$D$17,2,FALSE)=3),SUM(P6,M7),SUM(P6,-M7)),P6)","v":6560},{"$f":"IF(AND(N7<$U$3,K7=\"Em aberto\"),\"VENCIDO\",\"-\")","v":"-"},16,{"$f":"TEXT($N7,\"mmmm\")","v":"janeiro"},2023,{"$f":"#REF!","v":{"$error":"#REF!"}},null,null,{"$f":"IFERROR(VLOOKUP(F7,Validações!$C$2:$D$17,2,FALSE),\"\")","v":2},"janeiro",{"$f":"IF(#REF!=\"TODOS\",\"TODOS\",$J7)","v":{"$error":"#REF!"}},{"$f":"IF(#REF!=\"TODAS\",\"TODAS\",$L7)","v":{"$error":"#REF!"}},{"$f":"IF(#REF!=\"TODOS\",\"TODOS\",$J7)","v":{"$error":"#REF!"}},{"$f":"IF(#REF!=\"TODAS\",\"TODAS\",$L7)","v":{"$error":"#REF!"}},{"$f":"IF(#REF!=\"TODOS\",\"TODOS\",$K7)","v":{"$error":"#REF!"}},{"$f":"IF(#REF!=\"TODOS\",\"TODOS\",$I7)","v":{"$error":"#REF!"}},{"$f":"IF(#REF!=\"TODOS\",\"TODOS\",$J7)","v":{"$error":"#REF!"}},{"$f":"IF(#REF!=\"TODAS\",\"TODAS\",$L7)","v":{"$error":"#REF!"}},{"$f":"IF(#REF!=\"TODOS\",\"TODOS\",$K7)","v":{"$error":"#REF!"}},{"$f":"IF(#REF!=\"TODOS\",\"TODOS\",$I7)","v":{"$error":"#REF!"}},{"$f":"IF(#REF!=\"TODOS\",\"TODOS\",$J7)","v":{"$error":"#REF!"}},{"$f":"IF(#REF!=\"TODAS\",\"TODAS\",$L7)","v":{"$error":"#REF!"}},{"$f":"IF(#REF!=\"TODOS\",\"TODOS\",$K7)","v":{"$error":"#REF!"}},{"$f":"IF(#REF!=\"TODOS\",\"TODOS\",$I7)","v":{"$error":"#REF!"}},{"$f":"IF(#REF!=\"TODOS\",\"TODOS\",$J7)","v":{"$error":"#REF!"}},{"$f":"IF(#REF!=\"TODAS\",\"TODAS\",$L7)","v":{"$error":"#REF!"}},{"$f":"IF(#REF!=\"TODOS\",\"TODOS\",$K7)","v":{"$error":"#REF!"}},{"$f":"IF(#REF!=\"TODOS\",\"TODOS\",$I7)","v":{"$error":"#REF!"}},{"$f":"IF(#REF!=\"TODOS\",\"TODOS\",$J7)","v":{"$error":"#REF!"}},{"$f":"IF(#REF!=\"TODAS\",\"TODAS\",$L7)","v":{"$error":"#REF!"}},{"$f":"IF(#REF!=\"TODOS\",\"TODOS\",$K7)","v":{"$error":"#REF!"}},{"$f":"IF(#REF!=\"TODOS\",\"TODOS\",$I7)","v":{"$error":"#REF!"}},{"$f":"IF(#REF!=\"TODOS\",\"TODOS\",$J7)","v":{"$error":"#REF!"}},{"$f":"IF(#REF!=\"TODAS\",\"TODAS\",$L7)","v":{"$error":"#REF!"}},{"$f":"IF(#REF!=\"TODOS\",\"TODOS\",$K7)","v":{"$error":"#REF!"}},{"$f":"IF(#REF!=\"TODOS\",\"TODOS\",$I7)","v":{"$error":"#REF!"}},{"$f":"IF(#REF!=\"TODOS\",\"TODOS\",$J7)","v":{"$error":"#REF!"}},{"$f":"IF(#REF!=\"TODOS\",\"TODOS\",$I7)","v":{"$error":"#REF!"}},{"$f":"IF(#REF!=\"TODOS\",\"TODOS\",$Y7)","v":{"$error":"#REF!"}},null,null,null,null,null,null,null,null,null,null,null,null,null,null,null,null,null,{"$f":"IF(#REF!=\"TODOS\",\"TODOS\",$J7)","v":{"$error":"#REF!"}},{"$f":"IF(#REF!=\"TODOS\",\"TODOS\",$I7)","v":{"$error":"#REF!"}},{"$f":"IF(#REF!=\"TODOS\",\"TODOS\",$C7)","v":{"$error":"#REF!"}},{"$f":"IF(#REF!=\"TODOS\",\"TODOS\",$J7)","v":{"$error":"#REF!"}},{"$f":"IF(#REF!=\"TODOS\",\"TODOS\",$I7)","v":{"$error":"#REF!"}}]
["2022-12-15","2023-01-16","2022-12-22",16,"única","1.01 - Receita de vendas","1.01.03 - RE","NF 0259 - ETE Obra 640.01 Parque Tijuca (Proj. Layout)","Obra 640.01 - Parque Tijuca","5.01.51 - ETE 640.01 - Parque Tijuca","Em aberto","Santander",3500,"2023-01-16","Transferência",{"$f":"IFERROR(IF(OR(VLOOKUP(F8,Validações!$C$2:$D$17,2,FALSE)=1,VLOOKUP(F8,Validações!$C$2:$D$17,2,FALSE)=3),SUM(P7,M8),SUM(P7,-M8)),P7)","v":10060},"VENCIDO",16,"janeiro",2023,"Total de entradas",null,null,{"$f":"IFERROR(VLOOKUP(F8,Validações!$C$2:$D$17,2,FALSE),\"\")","v":1},"janeiro",{"$f":"IF(#REF!=\"TODOS\",\"TODOS\",$J8)","v":{"$error":"#REF!"}},{"$f":"IF(#REF!=\"TODAS\",\"TODAS\",$L8)","v":{"$error":"#REF!"}},{"$f":"IF(#REF!=\"TODOS\",\"TODOS\",$J8)","v":{"$error":"#REF!"}},{"$f":"IF(#REF!=\"TODAS\",\"TODAS\",$L8)","v":{"$error":"#REF!"}},{"$f":"IF(#REF!=\"TODOS\",\"TODOS\",$K8)","v":{"$error":"#REF!"}},{"$f":"IF(#REF!=\"TODOS\",\"TODOS\",$I8)","v":{"$error":"#REF!"}},{"$f":"IF(#REF!=\"TODOS\",\"TODOS\",$J8)","v":{"$error":"#REF!"}},{"$f":"IF(#REF!=\"TODAS\",\"TODAS\",$L8)","v":{"$error":"#REF!"}},{"$f":"IF(#REF!=\"TODOS\",\"TODOS\",$K8)","v":{"$error":"#REF!"}},{"$f":"IF(#REF!=\"TODOS\",\"TODOS\",$I8)","v":{"$error":"#REF!"}},{"$f":"IF(#REF!=\"TODOS\",\"TODOS\",$J8)","v":{"$error":"#REF!"}},{"$f":"IF(#REF!=\"TODAS\",\"TODAS\",$L8)","v":{"$error":"#REF!"}},{"$f":"IF(#REF!=\"TODOS\",\"TODOS\",$K8)","v":{"$error":"#REF!"}},{"$f":"IF(#REF!=\"TODOS\",\"TODOS\",$I8)","v":{"$error":"#REF!"}},{"$f":"IF(#REF!=\"TODOS\",\"TODOS\",$J8)","v":{"$error":"#REF!"}},{"$f":"IF(#REF!=\"TODAS\",\"TODAS\",$L8)","v":{"$error":"#REF!"}},{"$f":"IF(#REF!=\"TODOS\",\"TODOS\",$K8)","v":{"$error":"#REF!"}},{"$f":"IF(#REF!=\"TODOS\",\"TODOS\",$I8)","v":{"$error":"#REF!"}},{"$f":"IF(#REF!=\"TODOS\",\"TODOS\",$J8)","v":{"$error":"#REF!"}},{"$f":"IF(#REF!=\"TODAS\",\"TODAS\",$L8)","v":{"$error":"#REF!"}},{"$f":"IF(#REF!=\"TODOS\",\"TODOS\",$K8)","v":{"$error":"#REF!"}},{"$f":"IF(#REF!=\"TODOS\",\"TODOS\",$I8)","v":{"$error":"#REF!"}},{"$f":"IF(#REF!=\"TODOS\",\"TODOS\",$J8)","v":{"$error":"#REF!"}},{"$f":"IF(#REF!=\"TODAS\",\"TODAS\",$L8)","v":{"$error":"#REF!"}},{"$f":"IF(#REF!=\"TODOS\",\"TODOS\",$K8)","v":{"$error":"#REF!"}},{"$f":"IF(#REF!=\"TODOS\",\"TODOS\",$I8)","v":{"$error":"#REF!"}},{"$f":"IF(#REF!=\"TODOS\",\"TODOS\",$J8)","v":{"$error":"#REF!"}},{"$f":"IF(#REF!=\"TODOS\",\"TODOS\",$I8)","v":{"$error":"#REF!"}},{"$f":"IF(#REF!=\"TODOS\",\"TODOS\",$Y8)","v":{"$error":"#REF!"}},null,null,null,null,null,null,null,null,null,null,null,null,null,null,null,null,null,{"$f":"IF(#REF!=\"TODOS\",\"TODOS\",$J8)","v":{"$error":"#REF!"}},{"$f":"IF(#REF!=\"TODOS\",\"TODOS\",$I8)","v":{"$error":"#REF!"}},{"$f":"IF(#REF!=\"TODOS\",\"TODOS\",$C8)","v":{"$error":"#REF!"}},{"$f":"IF(#REF!=\"TODOS\",\"TODOS\",$J8)","v":{"$error":"#REF!"}},{"$f":"IF(#REF!=\"TODOS\",\"TODOS\",$I8)","v":{"$error":"#REF!"}}]
{"$rows_left_out":57}
{"sheet":"Validações","index":8,"n_rows":1002,"n_cols":23,"rows_kept":1002,"cut":false,"hidden":false,"merged":[[0,2,0,3],[0,13,0,14]]}
["Pagamento",null,"Entradas ou saídas",null,null,"Contas",null,"Centro de Custo",null,"Clientes e Fornecedores",null,"Status Forecast",null,"Meses",null,null,"Status",null,"Meses TODOS",null,"Forma Pgto",null,"Parcela"]
["Em aberto",null,{"$f":"'1.x PC'!A$9","v":"1.01 - Receita de vendas"},1,null,"TODAS",null,"TODOS",null,"TODOS",null,"Realizado",null,"Janeiro",1,null,"TODOS",null,"TODOS",null,"Boleto",null,"única"]
["Pago",null,{"$f":"'1.x PC'!B$9","v":"1.02 - Receitas financeiras"},1,null,{"$f":"'2.4 PC. Contas'!C7","v":"Itau"},null,{"$f":"'2.5 PC. C. Custo'!B6","v":"Sócios"},null,{"$f":"'2.6 PC. Cli. Fon.'!B6","v":"AAAAAAA"},null,"Prev. Inicial",null,"Fevereiro",2,null,"Em aberto",null,"Janeiro",null,"Débito",null,1]
["Cancelado",null,{"$f":"'1.x PC'!C$9","v":"1.03 - Outras entradas"},1,null,{"$f":"'2.4 PC. Contas'!C8","v":"Santander"},null,{"$f":"'2.5 PC. C. Custo'!B7","v":"Administrativo"},null,{"$f":"'2.6 PC. Cli. Fon.'!B7","v":"BBBBBBB"},null,"Prev. Ajustada",null,"Março",3,null,"Pago",null,"Fevereiro",null,"Transferência",null,2]
[null,null,{"$f":"'1.x PC'!D$9","v":"2.01 - Despesa Operacional"},2,null,{"$f":"'2.4 PC. Contas'!C9","v":0},null,{"$f":"'2.5 PC. C. Custo'!B8","v":"Argo"},null,{"$f":"'2.6 PC. Cli. Fon.'!B8","v":"CCCCCCCC"},null,null,null,"Abril",4,null,null,null,"Março",null,"Saque",null,3]
[null,null,{"$f":"'1.x PC'!E$9","v":"2.02 - Despesa com pessoal"},2,null,{"$f":"'2.4 PC. Contas'!C10","v":0},null,{"$f":"'2.5 PC. C. Custo'!B9","v":"PJI"},null,{"$f":"'2.6 PC. Cli. Fon.'!B9","v":"DDDDDDDDDDDDD"},null,null,null,"Maio",5,null,null,null,"Abril",null,"Débito Automático",null,4]
[null,null,{"$f":"'1.x PC'!F$9","v":"2.03 - Despesas comerciais"},2,null,{"$f":"'2.4 PC. Contas'!C11","v":0},null,{"$f":"'2.5 PC. C. Custo'!B10","v":"Downstream"},null,{"$f":"'2.6 PC. Cli. Fon.'!B10","v":"EEEEEEEEEEEEEEEE"},null,null,null,"Junho",6,null,null,null,"Maio",null,"Crédito",null,5]
[null,null,{"$f":"'1.x PC'!G$9","v":"2.04 - Despesas administrativas"},2,null,null,null,{"$f":"'2.5 PC. C. Custo'!B11","v":"AF 233/17"},null,{"$f":"'2.6 PC. Cli. Fon.'!B11","v":"FFFFFFFFFFFFFFF"},null,null,null,"Julho",7,null,null,null,"Junho",null,null,null,6]
{"$rows_left_out":994}