{"text_format":"1","workbook":"xlsx","n_sheets":6,"sheets":["CADASTRO","PRODUTOS","Formulário","ENTRADAS","SAÍDAS","ORDEM DE PRODUÇÃO"],"not_rendered":{"charts":0,"images":1,"macros":1,"external_links":0,"defined_names":7,"comments":0,"pivot_tables":0},"unopened":[],"bounds":{"document_bytes":16777216,"sheet_cells":100000,"rows_first":2000,"rows_last":500,"rows_between":2000,"halvings":0,"cell_chars":16384,"cell_head_chars":4096},"cells_cut":0,"cells_raw":0,"read":"whole","date_system":"1900"}

{"sheet":"CADASTRO","index":0,"n_rows":248,"n_cols":18,"rows_kept":248,"cut":false,"hidden":false,"merged":[]}
["Estoque Atual","Mensagem","CÓD","Descrição","Medida","Setor","Est Mínimo","Custo1   R$","Custo2   R$","Custo3   R$","Custo4   R$","Custo5   R$","Custo6   R$","Custo7   R$","Custo8   R$","Custo9   R$","Custo10   R$","Média"]
[{"$f":"IFERROR(VLOOKUP(C2,PRODUTOS!A3:P251,16,FALSE),0)","v":0},{"$f":"IFERROR(IF(A2<G2,\"PRODUZIR!\"&\" \"&A2-G2&\" \"&\"A MENOR\",\"EST NORMAL\"),\"\")","v":"EST NORMAL"},2,"FORMA DE EMPADA","UND","PADARIA TRADICIONAL",null,5,null,null,null,null,null,null,null,null,null,{"$f":"IFERROR(AVERAGE(H2:Q2),\"\")","v":5}]
[{"$f":"IFERROR(VLOOKUP(C3,PRODUTOS!A4:P252,16,FALSE),0)","v":0},"EST NORMAL",3,"ARO DE QUICHE","UND","PADARIA TRADICIONAL",null,null,null,null,null,null,null,null,null,null,null,""]
[{"$f":"IFERROR(VLOOKUP(C4,PRODUTOS!A5:P253,16,FALSE),0)","v":4},"EST NORMAL",8,"BAGUETE INTEGRAL (PCT C/ 45 UND = 3 KG)",null,"PADARIA TRADICIONAL",null,null,null,null,null,null,null,null,null,null,null,""]
[{"$f":"IFERROR(VLOOKUP(C5,PRODUTOS!A6:P254,16,FALSE),0)","v":0},"EST NORMAL",9,"BAILERINE",null,"CONFEITARIA DOCE",null,null,null,null,null,null,null,null,null,null,null,""]
[{"$f":"IFERROR(VLOOKUP(C6,PRODUTOS!A7:P255,16,FALSE),0)","v":1},"EST NORMAL",11,"BISCOITO ACEBOLADO",null,"PADARIA TRADICIONAL",null,null,null,null,null,null,null,null,null,null,null,""]
[{"$f":"IFERROR(VLOOKUP(C7,PRODUTOS!A8:P256,16,FALSE),0)","v":0},"EST NORMAL",12,"BISCOITO CASTANHA",null,"PADARIA TRADICIONAL",null,null,null,null,null,null,null,null,null,null,null,""]
[{"$f":"IFERROR(VLOOKUP(C8,PRODUTOS!A9:P257,16,FALSE),0)","v":6.57},"EST NORMAL",13,"BISCOITO CATUPIRI",null,"PADARIA TRADICIONAL",null,null,null,null,null,null,null,null,null,null,null,""]
[{"$f":"IFERROR(VLOOKUP(C9,PRODUTOS!A10:P258,16,FALSE),0)","v":1},"EST NORMAL",14,"BISCOITO COCO",null,"PADARIA TRADICIONAL",null,null,null,null,null,null,null,null,null,null,null,""]
[{"$f":"IFERROR(VLOOKUP(C10,PRODUTOS!A11:P259,16,FALSE),0)","v":0},"EST NORMAL",15,"BISCOITO DE BOLO",null,"PADARIA TRADICIONAL",null,null,null,null,null,null,null,null,null,null,null,""]
[{"$f":"IFERROR(VLOOKUP(C11,PRODUTOS!A12:P260,16,FALSE),0)","v":0},"EST NORMAL",16,"BISCOITO MAISENA",null,"PADARIA TRADICIONAL",null,null,null,null,null,null,null,null,null,null,null,""]
[{"$f":"IFERROR(VLOOKUP(C12,PRODUTOS!A13:P261,16,FALSE),0)","v":11},"EST NORMAL",17,"BISCOITO MONTEIRO LOPES",null,"PADARIA TRADICIONAL",null,null,null,null,null,null,null,null,null,null,null,""]
[{"$f":"IFERROR(VLOOKUP(C13,PRODUTOS!A14:P262,16,FALSE),0)","v":0},"EST NORMAL",18,"BISCOITO OLHO DE BOI",null,"PADARIA TRADICIONAL",null,null,null,null,null,null,null,null,null,null,null,""]
[{"$f":"IFERROR(VLOOKUP(C14,PRODUTOS!A15:P263,16,FALSE),0)","v":5},"EST NORMAL",19,"BISCOITO PAI D'ÉGUA",null,"PADARIA TRADICIONAL",null,null,null,null,null,null,null,null,null,null,null,""]
[{"$f":"IFERROR(VLOOKUP(C15,PRODUTOS!A16:P264,16,FALSE),0)","v":0},"EST NORMAL",20,"BOLO CASEIRO ",null,"CONFEITARIA DOCE",null,null,null,null,null,null,null,null,null,null,null,""]
[{"$f":"IFERROR(VLOOKUP(C16,PRODUTOS!A17:P265,16,FALSE),0)","v":0},"EST NORMAL",21,"BOLO MILHO CREMOSO G50",null,"CONFEITARIA DOCE",null,null,null,null,null,null,null,null,null,null,null,""]
[{"$f":"IFERROR(VLOOKUP(C17,PRODUTOS!A18:P266,16,FALSE),0)","v":173},"EST NORMAL",26,"CARRET",null,"FOLHATERIA",null,null,null,null,null,null,null,null,null,null,null,""]
[{"$f":"IFERROR(VLOOKUP(C18,PRODUTOS!A19:P267,16,FALSE),0)","v":0},"EST NORMAL",27,"CASADINHO G50",null,"CONFEITARIA DOCE",null,null,null,null,null,null,null,null,null,null,null,""]
[{"$f":"IFERROR(VLOOKUP(C19,PRODUTOS!A20:P268,16,FALSE),0)","v":3},"EST NORMAL",28,"CATARINA DE BACALHAU ",null,"FOLHATERIA",null,null,null,null,null,null,null,null,null,null,null,""]
[{"$f":"IFERROR(VLOOKUP(C20,PRODUTOS!A21:P269,16,FALSE),0)","v":2},"EST NORMAL",29,"CATARINA DE FRANGO",null,"FOLHATERIA",null,null,null,null,null,null,null,null,null,null,null,""]
{"$rows_left_out":229}
{"sheet":"PRODUTOS","index":1,"n_rows":250,"n_cols":23,"rows_kept":250,"cut":false,"hidden":false,"merged":[]}
[null,"Estoque Geral     Produto Acabado"]
["CÓD","DESCRIÇÃO","MEDIDA","SETOR","CUSTO    R$",null,"SALDO INICIAL","CUSTO    R$",null,"ENTRADA","CUSTO    R$",null,"SAÍDAS","CUSTO    R$",null,"SALDO","CUSTO    R$",null,"INVENTÁRIO","CUSTO    R$",null,"AJUSTE","CUSTO    R$"]
[2,{"$f":"IF(A3=\"\",\"\",IFERROR(VLOOKUP(A3,CADASTRO!C:F,2,FALSE),\"\"))","v":"FORMA DE EMPADA"},{"$f":"IFERROR(VLOOKUP(A3,CADASTRO!C:F,3,FALSE),\"\")","v":"UND"},{"$f":"IFERROR(VLOOKUP(A3,CADASTRO!C:F,4,0),\"\")","v":"PADARIA TRADICIONAL"},{"$f":"IFERROR(VLOOKUP(A3,CADASTRO!C:R,16,0),\"\")","v":5},null,null,0,null,{"$f":"SUMIF(ENTRADAS!A:E,A3,ENTRADAS!E:E)","v":205},{"$f":"IFERROR(J3*$E3,\"\")","v":1025},null,{"$f":"SUMIF(SAÍDAS!A:E,PRODUTOS!A3,SAÍDAS!E:E)","v":205},{"$f":"IFERROR(M3*$E3,\"\")","v":1025},null,{"$f":"G3+J3-M3","v":0},{"$f":"IFERROR(P3*$E3,\"\")","v":0},null,{"$f":"P3","v":0},{"$f":"IFERROR(S3*$E3,\"\")","v":0},null,{"$f":"S3-P3","v":0},{"$f":"IFERROR(V3*$E3,\"\")","v":0}]
[3,{"$f":"IF(A4=\"\",\"\",IFERROR(VLOOKUP(A4,CADASTRO!C:F,2,FALSE),\"\"))","v":"ARO DE QUICHE"},{"$f":"IFERROR(VLOOKUP(A4,CADASTRO!C:F,3,FALSE),\"\")","v":"UND"},{"$f":"IFERROR(VLOOKUP(A4,CADASTRO!C:F,4,0),\"\")","v":"PADARIA TRADICIONAL"},{"$f":"IFERROR(VLOOKUP(A4,CADASTRO!C:R,16,0),\"\")","v":""},null,null,0,null,{"$f":"SUMIF(ENTRADAS!A:E,A4,ENTRADAS!E:E)","v":0},{"$f":"IFERROR(J4*$E4,\"\")","v":""},null,{"$f":"SUMIF(SAÍDAS!A:E,PRODUTOS!A4,SAÍDAS!E:E)","v":0},{"$f":"IFERROR(M4*$E4,\"\")","v":""},null,{"$f":"G4+J4-M4","v":0},{"$f":"IFERROR(P4*$E4,\"\")","v":""},null,{"$f":"P4","v":0},{"$f":"IFERROR(S4*$E4,\"\")","v":""},null,{"$f":"S4-P4","v":0},{"$f":"IFERROR(V4*$E4,\"\")","v":""}]
[8,{"$f":"IF(A5=\"\",\"\",IFERROR(VLOOKUP(A5,CADASTRO!C:F,2,FALSE),\"\"))","v":"BAGUETE INTEGRAL (PCT C/ 45 UND = 3 KG)"},{"$f":"IFERROR(VLOOKUP(A5,CADASTRO!C:F,3,FALSE),\"\")","v":0},{"$f":"IFERROR(VLOOKUP(A5,CADASTRO!C:F,4,0),\"\")","v":"PADARIA TRADICIONAL"},{"$f":"IFERROR(VLOOKUP(A5,CADASTRO!C:R,16,0),\"\")","v":""},null,1,0,null,{"$f":"SUMIF(ENTRADAS!A:E,A5,ENTRADAS!E:E)","v":12},"",null,{"$f":"SUMIF(SAÍDAS!A:E,PRODUTOS!A5,SAÍDAS!E:E)","v":9},"",null,4,"",null,4,"",null,0,""]
[9,{"$f":"IF(A6=\"\",\"\",IFERROR(VLOOKUP(A6,CADASTRO!C:F,2,FALSE),\"\"))","v":"BAILERINE"},{"$f":"IFERROR(VLOOKUP(A6,CADASTRO!C:F,3,FALSE),\"\")","v":0},{"$f":"IFERROR(VLOOKUP(A6,CADASTRO!C:F,4,0),\"\")","v":"CONFEITARIA DOCE"},{"$f":"IFERROR(VLOOKUP(A6,CADASTRO!C:R,16,0),\"\")","v":""},null,null,null,null,{"$f":"SUMIF(ENTRADAS!A:E,A6,ENTRADAS!E:E)","v":0},"",null,{"$f":"SUMIF(SAÍDAS!A:E,PRODUTOS!A6,SAÍDAS!E:E)","v":0},"",null,0,"",null,0,"",null,0,""]
[11,{"$f":"IF(A7=\"\",\"\",IFERROR(VLOOKUP(A7,CADASTRO!C:F,2,FALSE),\"\"))","v":"BISCOITO ACEBOLADO"},{"$f":"IFERROR(VLOOKUP(A7,CADASTRO!C:F,3,FALSE),\"\")","v":0},{"$f":"IFERROR(VLOOKUP(A7,CADASTRO!C:F,4,0),\"\")","v":"PADARIA TRADICIONAL"},{"$f":"IFERROR(VLOOKUP(A7,CADASTRO!C:R,16,0),\"\")","v":""},null,null,null,null,{"$f":"SUMIF(ENTRADAS!A:E,A7,ENTRADAS!E:E)","v":9.5500000000000007},"",null,{"$f":"SUMIF(SAÍDAS!A:E,PRODUTOS!A7,SAÍDAS!E:E)","v":8.5500000000000007},"",null,1,"",null,1,"",null,0,""]
[12,{"$f":"IF(A8=\"\",\"\",IFERROR(VLOOKUP(A8,CADASTRO!C:F,2,FALSE),\"\"))","v":"BISCOITO CASTANHA"},{"$f":"IFERROR(VLOOKUP(A8,CADASTRO!C:F,3,FALSE),\"\")","v":0},{"$f":"IFERROR(VLOOKUP(A8,CADASTRO!C:F,4,0),\"\")","v":"PADARIA TRADICIONAL"},{"$f":"IFERROR(VLOOKUP(A8,CADASTRO!C:R,16,0),\"\")","v":""},null,5,null,null,{"$f":"SUMIF(ENTRADAS!A:E,A8,ENTRADAS!E:E)","v":0},"",null,{"$f":"SUMIF(SAÍDAS!A:E,PRODUTOS!A8,SAÍDAS!E:E)","v":5},"",null,0,"",null,0,"",null,0,""]
[13,{"$f":"IF(A9=\"\",\"\",IFERROR(VLOOKUP(A9,CADASTRO!C:F,2,FALSE),\"\"))","v":"BISCOITO CATUPIRI"},{"$f":"IFERROR(VLOOKUP(A9,CADASTRO!C:F,3,FALSE),\"\")","v":0},{"$f":"IFERROR(VLOOKUP(A9,CADASTRO!C:F,4,0),\"\")","v":"PADARIA TRADICIONAL"},{"$f":"IFERROR(VLOOKUP(A9,CADASTRO!C:R,16,0),\"\")","v":""},null,1,null,null,{"$f":"SUMIF(ENTRADAS!A:E,A9,ENTRADAS!E:E)","v":9.57},"",null,{"$f":"SUMIF(SAÍDAS!A:E,PRODUTOS!A9,SAÍDAS!E:E)","v":4},"",null,6.57,"",null,6.57,"",null,0,""]
[14,{"$f":"IF(A10=\"\",\"\",IFERROR(VLOOKUP(A10,CADASTRO!C:F,2,FALSE),\"\"))","v":"BISCOITO COCO"},{"$f":"IFERROR(VLOOKUP(A10,CADASTRO!C:F,3,FALSE),\"\")","v":0},{"$f":"IFERROR(VLOOKUP(A10,CADASTRO!C:F,4,0),\"\")","v":"PADARIA TRADICIONAL"},{"$f":"IFERROR(VLOOKUP(A10,CADASTRO!C:R,16,0),\"\")","v":""},null,3,null,null,{"$f":"SUMIF(ENTRADAS!A:E,A10,ENTRADAS!E:E)","v":11.25},"",null,{"$f":"SUMIF(SAÍDAS!A:E,PRODUTOS!A10,SAÍDAS!E:E)","v":13.25},"",null,1,"",null,1,"",null,0,""]
[15,{"$f":"IF(A11=\"\",\"\",IFERROR(VLOOKUP(A11,CADASTRO!C:F,2,FALSE),\"\"))","v":"BISCOITO DE BOLO"},{"$f":"IFERROR(VLOOKUP(A11,CADASTRO!C:F,3,FALSE),\"\")","v":0},{"$f":"IFERROR(VLOOKUP(A11,CADASTRO!C:F,4,0),\"\")","v":"PADARIA TRADICIONAL"},{"$f":"IFERROR(VLOOKUP(A11,CADASTRO!C:R,16,0),\"\")","v":""},null,null,null,null,{"$f":"SUMIF(ENTRADAS!A:E,A11,ENTRADAS!E:E)","v":0},"",null,{"$f":"SUMIF(SAÍDAS!A:E,PRODUTOS!A11,SAÍDAS!E:E)","v":0},"",null,0,"",null,0,"",null,0,""]
[16,{"$f":"IF(A12=\"\",\"\",IFERROR(VLOOKUP(A12,CADASTRO!C:F,2,FALSE),\"\"))","v":"BISCOITO MAISENA"},{"$f":"IFERROR(VLOOKUP(A12,CADASTRO!C:F,3,FALSE),\"\")","v":0},{"$f":"IFERROR(VLOOKUP(A12,CADASTRO!C:F,4,0),\"\")","v":"PADARIA TRADICIONAL"},{"$f":"IFERROR(VLOOKUP(A12,CADASTRO!C:R,16,0),\"\")","v":""},null,2,null,null,{"$f":"SUMIF(ENTRADAS!A:E,A12,ENTRADAS!E:E)","v":0},"",null,{"$f":"SUMIF(SAÍDAS!A:E,PRODUTOS!A12,SAÍDAS!E:E)","v":2},"",null,0,"",null,0,"",null,0,""]
[17,{"$f":"IF(A13=\"\",\"\",IFERROR(VLOOKUP(A13,CADASTRO!C:F,2,FALSE),\"\"))","v":"BISCOITO MONTEIRO LOPES"},{"$f":"IFERROR(VLOOKUP(A13,CADASTRO!C:F,3,FALSE),\"\")","v":0},{"$f":"IFERROR(VLOOKUP(A13,CADASTRO!C:F,4,0),\"\")","v":"PADARIA TRADICIONAL"},{"$f":"IFERROR(VLOOKUP(A13,CADASTRO!C:R,16,0),\"\")","v":""},null,8,null,null,{"$f":"SUMIF(ENTRADAS!A:E,A13,ENTRADAS!E:E)","v":37.730000000000004},"",null,{"$f":"SUMIF(SAÍDAS!A:E,PRODUTOS!A13,SAÍDAS!E:E)","v":34.730000000000004},"",null,11,"",null,11,"",null,0,""]
[18,{"$f":"IF(A14=\"\",\"\",IFERROR(VLOOKUP(A14,CADASTRO!C:F,2,FALSE),\"\"))","v":"BISCOITO OLHO DE BOI"},{"$f":"IFERROR(VLOOKUP(A14,CADASTRO!C:F,3,FALSE),\"\")","v":0},{"$f":"IFERROR(VLOOKUP(A14,CADASTRO!C:F,4,0),\"\")","v":"PADARIA TRADICIONAL"},{"$f":"IFERROR(VLOOKUP(A14,CADASTRO!C:R,16,0),\"\")","v":""},null,5,null,null,{"$f":"SUMIF(ENTRADAS!A:E,A14,ENTRADAS!E:E)","v":0},"",null,{"$f":"SUMIF(SAÍDAS!A:E,PRODUTOS!A14,SAÍDAS!E:E)","v":5},"",null,0,"",null,0,"",null,0,""]
[19,{"$f":"IF(A15=\"\",\"\",IFERROR(VLOOKUP(A15,CADASTRO!C:F,2,FALSE),\"\"))","v":"BISCOITO PAI D'ÉGUA"},{"$f":"IFERROR(VLOOKUP(A15,CADASTRO!C:F,3,FALSE),\"\")","v":0},{"$f":"IFERROR(VLOOKUP(A15,CADASTRO!C:F,4,0),\"\")","v":"PADARIA TRADICIONAL"},{"$f":"IFERROR(VLOOKUP(A15,CADASTRO!C:R,16,0),\"\")","v":""},null,1,null,null,{"$f":"SUMIF(ENTRADAS!A:E,A15,ENTRADAS!E:E)","v":11.35},"",null,{"$f":"SUMIF(SAÍDAS!A:E,PRODUTOS!A15,SAÍDAS!E:E)","v":7.35},"",null,5,"",null,5,"",null,0,""]
[20,{"$f":"IF(A16=\"\",\"\",IFERROR(VLOOKUP(A16,CADASTRO!C:F,2,FALSE),\"\"))","v":"BOLO CASEIRO "},{"$f":"IFERROR(VLOOKUP(A16,CADASTRO!C:F,3,FALSE),\"\")","v":0},{"$f":"IFERROR(VLOOKUP(A16,CADASTRO!C:F,4,0),\"\")","v":"CONFEITARIA DOCE"},{"$f":"IFERROR(VLOOKUP(A16,CADASTRO!C:R,16,0),\"\")","v":""},null,null,null,null,{"$f":"SUMIF(ENTRADAS!A:E,A16,ENTRADAS!E:E)","v":0},"",null,{"$f":"SUMIF(SAÍDAS!A:E,PRODUTOS!A16,SAÍDAS!E:E)","v":0},"",null,0,"",null,0,"",null,0,""]
[21,{"$f":"IF(A17=\"\",\"\",IFERROR(VLOOKUP(A17,CADASTRO!C:F,2,FALSE),\"\"))","v":"BOLO MILHO CREMOSO G50"},{"$f":"IFERROR(VLOOKUP(A17,CADASTRO!C:F,3,FALSE),\"\")","v":0},{"$f":"IFERROR(VLOOKUP(A17,CADASTRO!C:F,4,0),\"\")","v":"CONFEITARIA DOCE"},{"$f":"IFERROR(VLOOKUP(A17,CADASTRO!C:R,16,0),\"\")","v":""},null,null,null,null,{"$f":"SUMIF(ENTRADAS!A:E,A17,ENTRADAS!E:E)","v":0},"",null,{"$f":"SUMIF(SAÍDAS!A:E,PRODUTOS!A17,SAÍDAS!E:E)","v":0},"",null,0,"",null,0,"",null,0,""]
[26,{"$f":"IF(A18=\"\",\"\",IFERROR(VLOOKUP(A18,CADASTRO!C:F,2,FALSE),\"\"))","v":"CARRET"},{"$f":"IFERROR(VLOOKUP(A18,CADASTRO!C:F,3,FALSE),\"\")","v":0},{"$f":"IFERROR(VLOOKUP(A18,CADASTRO!C:F,4,0),\"\")","v":"FOLHATERIA"},{"$f":"IFERROR(VLOOKUP(A18,CADASTRO!C:R,16,0),\"\")","v":""},null,38,null,null,{"$f":"SUMIF(ENTRADAS!A:E,A18,ENTRADAS!E:E)","v":220},"",null,{"$f":"SUMIF(SAÍDAS!A:E,PRODUTOS!A18,SAÍDAS!E:E)","v":85},"",null,173,"",null,173,"",null,0,""]
[27,{"$f":"IF(A19=\"\",\"\",IFERROR(VLOOKUP(A19,CADASTRO!C:F,2,FALSE),\"\"))","v":"CASADINHO G50"},{"$f":"IFERROR(VLOOKUP(A19,CADASTRO!C:F,3,FALSE),\"\")","v":0},{"$f":"IFERROR(VLOOKUP(A19,CADASTRO!C:F,4,0),\"\")","v":"CONFEITARIA DOCE"},{"$f":"IFERROR(VLOOKUP(A19,CADASTRO!C:R,16,0),\"\")","v":""},null,null,null,null,{"$f":"SUMIF(ENTRADAS!A:E,A19,ENTRADAS!E:E)","v":0},"",null,{"$f":"SUMIF(SAÍDAS!A:E,PRODUTOS!A19,SAÍDAS!E:E)","v":0},"",null,0,"",null,0,"",null,0,""]
[28,{"$f":"IF(A20=\"\",\"\",IFERROR(VLOOKUP(A20,CADASTRO!C:F,2,FALSE),\"\"))","v":"CATARINA DE BACALHAU "},{"$f":"IFERROR(VLOOKUP(A20,CADASTRO!C:F,3,FALSE),\"\")","v":0},{"$f":"IFERROR(VLOOKUP(A20,CADASTRO!C:F,4,0),\"\")","v":"FOLHATERIA"},{"$f":"IFERROR(VLOOKUP(A20,CADASTRO!C:R,16,0),\"\")","v":""},null,null,null,null,{"$f":"SUMIF(ENTRADAS!A:E,A20,ENTRADAS!E:E)","v":24},"",null,{"$f":"SUMIF(SAÍDAS!A:E,PRODUTOS!A20,SAÍDAS!E:E)","v":21},"",null,3,"",null,3,"",null,0,""]
{"$rows_left_out":231}
{"sheet":"Formulário","index":2,"n_rows":0,"n_cols":0,"rows_kept":0,"cut":false,"hidden":false,"merged":[]}

{"sheet":"ENTRADAS","index":3,"n_rows":409,"n_cols":6,"rows_kept":409,"cut":false,"hidden":false,"merged":[[0,1,0,5]]}
[null,"                Entrada de Produção - Congelados"]
["CÓD","Descrição","Medida","SETOR","Qtde","Data"]
[2,{"$f":"IF(A3=\"\",\"\",IFERROR(VLOOKUP(A3,CADASTRO!C:D,2,FALSE),\"Produto Não Cadastrado\"))","v":"FORMA DE EMPADA"},{"$f":"VLOOKUP(A3,CADASTRO!C:F,3,0)","v":"UND"},{"$f":"VLOOKUP(A3,CADASTRO!C:F,4,0)","v":"PADARIA TRADICIONAL"},205,"2023-02-13"]
[29,{"$f":"IF(A4=\"\",\"\",IFERROR(VLOOKUP(A4,CADASTRO!C:D,2,FALSE),\"Produto Não Cadastrado\"))","v":"CATARINA DE FRANGO"},{"$f":"VLOOKUP(A4,CADASTRO!C:F,3,0)","v":0},{"$f":"VLOOKUP(A4,CADASTRO!C:F,4,0)","v":"FOLHATERIA"},12,"2023-02-13"]
[84,{"$f":"IF(A5=\"\",\"\",IFERROR(VLOOKUP(A5,CADASTRO!C:D,2,FALSE),\"Produto Não Cadastrado\"))","v":"MINI FOLHADO MISTO"},{"$f":"VLOOKUP(A5,CADASTRO!C:F,3,0)","v":0},{"$f":"VLOOKUP(A5,CADASTRO!C:F,4,0)","v":"FOLHATERIA"},4,"2023-02-13"]
[81,{"$f":"IF(A6=\"\",\"\",IFERROR(VLOOKUP(A6,CADASTRO!C:D,2,FALSE),\"Produto Não Cadastrado\"))","v":"MINI FOLHADO DE QUEIJO"},{"$f":"VLOOKUP(A6,CADASTRO!C:F,3,0)","v":0},{"$f":"VLOOKUP(A6,CADASTRO!C:F,4,0)","v":"FOLHATERIA"},3.8,"2023-02-13"]
[144,{"$f":"IF(A7=\"\",\"\",IFERROR(VLOOKUP(A7,CADASTRO!C:D,2,FALSE),\"Produto Não Cadastrado\"))","v":"PÃO DE ROSAS"},{"$f":"VLOOKUP(A7,CADASTRO!C:F,3,0)","v":0},{"$f":"VLOOKUP(A7,CADASTRO!C:F,4,0)","v":"FOLHATERIA"},21,"2023-02-13"]
[80,{"$f":"IF(A8=\"\",\"\",IFERROR(VLOOKUP(A8,CADASTRO!C:D,2,FALSE),\"Produto Não Cadastrado\"))","v":"MINI FOLHADO CUPUAÇU"},{"$f":"IFERROR(VLOOKUP(A8,CADASTRO!C:F,3,0),\"\")","v":0},{"$f":"VLOOKUP(A8,CADASTRO!C:F,4,0)","v":"FOLHATERIA"},7.5,"2023-02-13"]
[81,{"$f":"IF(A9=\"\",\"\",IFERROR(VLOOKUP(A9,CADASTRO!C:D,2,FALSE),\"Produto Não Cadastrado\"))","v":"MINI FOLHADO DE QUEIJO"},{"$f":"IFERROR(VLOOKUP(A9,CADASTRO!C:F,3,0),\"\")","v":0},{"$f":"VLOOKUP(A9,CADASTRO!C:F,4,0)","v":"FOLHATERIA"},7.63,"2023-02-13"]
[82,{"$f":"IF(A10=\"\",\"\",IFERROR(VLOOKUP(A10,CADASTRO!C:D,2,FALSE),\"Produto Não Cadastrado\"))","v":"MINI FOLHADO FRANGO"},{"$f":"IFERROR(VLOOKUP(A10,CADASTRO!C:F,3,0),\"\")","v":0},{"$f":"VLOOKUP(A10,CADASTRO!C:F,4,0)","v":"FOLHATERIA"},7.43,"2023-02-13"]
[89,{"$f":"IF(A11=\"\",\"\",IFERROR(VLOOKUP(A11,CADASTRO!C:D,2,FALSE),\"Produto Não Cadastrado\"))","v":"MINI PÃO BATATA HAMBÚRGUER"},{"$f":"IFERROR(VLOOKUP(A11,CADASTRO!C:F,3,0),\"\")","v":0},{"$f":"VLOOKUP(A11,CADASTRO!C:F,4,0)","v":"PADARIA TRADICIONAL"},306,"2023-02-13"]
[135,{"$f":"IF(A12=\"\",\"\",IFERROR(VLOOKUP(A12,CADASTRO!C:D,2,FALSE),\"Produto Não Cadastrado\"))","v":"PÃO DE BATATA FILÃO"},{"$f":"IFERROR(VLOOKUP(A12,CADASTRO!C:F,3,0),\"\")","v":0},{"$f":"VLOOKUP(A12,CADASTRO!C:F,4,0)","v":"PADARIA TRADICIONAL"},300,"2023-02-13"]
[92,{"$f":"IF(A13=\"\",\"\",IFERROR(VLOOKUP(A13,CADASTRO!C:D,2,FALSE),\"Produto Não Cadastrado\"))","v":"MINI PÃO DELÍCIA  (PCT C/ 24UND)"},{"$f":"IFERROR(VLOOKUP(A13,CADASTRO!C:F,3,0),\"\")","v":0},{"$f":"VLOOKUP(A13,CADASTRO!C:F,4,0)","v":"PADARIA TRADICIONAL"},18,"2023-02-13"]
[49,{"$f":"IF(A14=\"\",\"\",IFERROR(VLOOKUP(A14,CADASTRO!C:D,2,FALSE),\"Produto Não Cadastrado\"))","v":"DONNUTS"},{"$f":"IFERROR(VLOOKUP(A14,CADASTRO!C:F,3,0),\"\")","v":0},{"$f":"VLOOKUP(A14,CADASTRO!C:F,4,0)","v":"PADARIA TRADICIONAL"},94,"2023-02-13"]
[158,{"$f":"IF(A15=\"\",\"\",IFERROR(VLOOKUP(A15,CADASTRO!C:D,2,FALSE),\"Produto Não Cadastrado\"))","v":"PÃO FORMA MILHO A25"},{"$f":"IFERROR(VLOOKUP(A15,CADASTRO!C:F,3,0),\"\")","v":0},{"$f":"VLOOKUP(A15,CADASTRO!C:F,4,0)","v":"PADARIA TRADICIONAL"},86,"2023-02-13"]
[71,{"$f":"IF(A16=\"\",\"\",IFERROR(VLOOKUP(A16,CADASTRO!C:D,2,FALSE),\"Produto Não Cadastrado\"))","v":"MASSA MINI PIZZA"},{"$f":"IFERROR(VLOOKUP(A16,CADASTRO!C:F,3,0),\"\")","v":0},{"$f":"VLOOKUP(A16,CADASTRO!C:F,4,0)","v":"PADARIA TRADICIONAL"},5,"2023-02-13"]
[88,{"$f":"IF(A17=\"\",\"\",IFERROR(VLOOKUP(A17,CADASTRO!C:D,2,FALSE),\"Produto Não Cadastrado\"))","v":"MINI PÃO BATATA (ERVAS,PARMESÃO)"},{"$f":"IFERROR(VLOOKUP(A17,CADASTRO!C:F,3,0),\"\")","v":0},{"$f":"VLOOKUP(A17,CADASTRO!C:F,4,0)","v":"PADARIA TRADICIONAL"},1400,"2023-02-14"]
[89,{"$f":"IF(A18=\"\",\"\",IFERROR(VLOOKUP(A18,CADASTRO!C:D,2,FALSE),\"Produto Não Cadastrado\"))","v":"MINI PÃO BATATA HAMBÚRGUER"},{"$f":"IFERROR(VLOOKUP(A18,CADASTRO!C:F,3,0),\"\")","v":0},{"$f":"VLOOKUP(A18,CADASTRO!C:F,4,0)","v":"PADARIA TRADICIONAL"},558,"2023-02-14"]
[91,{"$f":"IF(A19=\"\",\"\",IFERROR(VLOOKUP(A19,CADASTRO!C:D,2,FALSE),\"Produto Não Cadastrado\"))","v":"MINI PÃO BRIOCHE (PCT C/ 24UND)"},{"$f":"IFERROR(VLOOKUP(A19,CADASTRO!C:F,3,0),\"\")","v":0},{"$f":"VLOOKUP(A19,CADASTRO!C:F,4,0)","v":"PADARIA TRADICIONAL"},8,"2023-02-14"]
[123,{"$f":"IF(A20=\"\",\"\",IFERROR(VLOOKUP(A20,CADASTRO!C:D,2,FALSE),\"Produto Não Cadastrado\"))","v":"PÃO BRIOCHE DE FORMA  1000"},{"$f":"IFERROR(VLOOKUP(A20,CADASTRO!C:F,3,0),\"\")","v":0},{"$f":"VLOOKUP(A20,CADASTRO!C:F,4,0)","v":"PADARIA TRADICIONAL"},14,"2023-02-14"]
{"$rows_left_out":390}
{"sheet":"SAÍDAS","index":4,"n_rows":535,"n_cols":6,"rows_kept":535,"cut":false,"hidden":false,"merged":[[0,1,0,5]]}
[null,"               Saída de Estoque - Congelados"]
["CÓD","Descriçao","Medida","SETOR","Qtde","Data"]
[28,{"$f":"IF(A3=\"\",\"\",IFERROR(VLOOKUP(A3,CADASTRO!C:D,2,FALSE),\"Produto Não Cadastrado\"))","v":"CATARINA DE BACALHAU "},{"$f":"VLOOKUP(A3,CADASTRO!C:F,3,0)","v":0},{"$f":"VLOOKUP(A3,CADASTRO!C:F,4,0)","v":"FOLHATERIA"},3,"2023-02-14"]
[29,{"$f":"IF(A4=\"\",\"\",IFERROR(VLOOKUP(A4,CADASTRO!C:D,2,FALSE),\"Produto Não Cadastrado\"))","v":"CATARINA DE FRANGO"},{"$f":"VLOOKUP(A4,CADASTRO!C:F,3,0)","v":0},{"$f":"VLOOKUP(A4,CADASTRO!C:F,4,0)","v":"FOLHATERIA"},3,"2023-02-14"]
[79,{"$f":"IF(A5=\"\",\"\",IFERROR(VLOOKUP(A5,CADASTRO!C:D,2,FALSE),\"Produto Não Cadastrado\"))","v":"MINI FOLHADO CALABRESA"},{"$f":"VLOOKUP(A5,CADASTRO!C:F,3,0)","v":0},{"$f":"VLOOKUP(A5,CADASTRO!C:F,4,0)","v":"FOLHATERIA"},7.39,"2023-02-14"]
[108,{"$f":"IF(A6=\"\",\"\",IFERROR(VLOOKUP(A6,CADASTRO!C:D,2,FALSE),\"Produto Não Cadastrado\"))","v":"ORELINHA TRADICIONAL"},{"$f":"VLOOKUP(A6,CADASTRO!C:F,3,0)","v":0},{"$f":"VLOOKUP(A6,CADASTRO!C:F,4,0)","v":"FOLHATERIA"},3.38,"2023-02-14"]
[111,{"$f":"IF(A7=\"\",\"\",IFERROR(VLOOKUP(A7,CADASTRO!C:D,2,FALSE),\"Produto Não Cadastrado\"))","v":"PALITO QUEIJO"},{"$f":"VLOOKUP(A7,CADASTRO!C:F,3,0)","v":0},{"$f":"VLOOKUP(A7,CADASTRO!C:F,4,0)","v":"FOLHATERIA"},3.55,"2023-02-14"]
[263,{"$f":"IF(A8=\"\",\"\",IFERROR(VLOOKUP(A8,CADASTRO!C:D,2,FALSE),\"Produto Não Cadastrado\"))","v":"TRANÇA FOLHADA BACALHAU"},{"$f":"IFERROR(VLOOKUP(A8,CADASTRO!C:F,3,0),\"\")","v":0},{"$f":"VLOOKUP(A8,CADASTRO!C:F,4,0)","v":"FOLHATERIA"},2,"2023-02-14"]
[264,{"$f":"IF(A9=\"\",\"\",IFERROR(VLOOKUP(A9,CADASTRO!C:D,2,FALSE),\"Produto Não Cadastrado\"))","v":"TRANÇA FOLHADA CALABRESA"},{"$f":"IFERROR(VLOOKUP(A9,CADASTRO!C:F,3,0),\"\")","v":0},{"$f":"VLOOKUP(A9,CADASTRO!C:F,4,0)","v":"FOLHATERIA"},2,"2023-02-14"]
[268,{"$f":"IF(A10=\"\",\"\",IFERROR(VLOOKUP(A10,CADASTRO!C:D,2,FALSE),\"Produto Não Cadastrado\"))","v":"TRANÇA FOLHADA MORTADELA DEFUMADA"},{"$f":"IFERROR(VLOOKUP(A10,CADASTRO!C:F,3,0),\"\")","v":0},{"$f":"VLOOKUP(A10,CADASTRO!C:F,4,0)","v":"FOLHATERIA"},1,"2023-02-14"]
[271,{"$f":"IF(A11=\"\",\"\",IFERROR(VLOOKUP(A11,CADASTRO!C:D,2,FALSE),\"Produto Não Cadastrado\"))","v":"TRANÇA FOLHADA PERU/JAMBU"},{"$f":"IFERROR(VLOOKUP(A11,CADASTRO!C:F,3,0),\"\")","v":0},{"$f":"VLOOKUP(A11,CADASTRO!C:F,4,0)","v":"FOLHATERIA"},1,"2023-02-14"]
[272,{"$f":"IF(A12=\"\",\"\",IFERROR(VLOOKUP(A12,CADASTRO!C:D,2,FALSE),\"Produto Não Cadastrado\"))","v":"TRANÇA FOLHADA SALAME"},{"$f":"IFERROR(VLOOKUP(A12,CADASTRO!C:F,3,0),\"\")","v":0},{"$f":"VLOOKUP(A12,CADASTRO!C:F,4,0)","v":"FOLHATERIA"},1,"2023-02-14"]
[8,{"$f":"IF(A13=\"\",\"\",IFERROR(VLOOKUP(A13,CADASTRO!C:D,2,FALSE),\"Produto Não Cadastrado\"))","v":"BAGUETE INTEGRAL (PCT C/ 45 UND = 3 KG)"},{"$f":"IFERROR(VLOOKUP(A13,CADASTRO!C:F,3,0),\"\")","v":0},{"$f":"VLOOKUP(A13,CADASTRO!C:F,4,0)","v":"PADARIA TRADICIONAL"},1,"2023-02-14"]
[13,{"$f":"IF(A14=\"\",\"\",IFERROR(VLOOKUP(A14,CADASTRO!C:D,2,FALSE),\"Produto Não Cadastrado\"))","v":"BISCOITO CATUPIRI"},{"$f":"IFERROR(VLOOKUP(A14,CADASTRO!C:F,3,0),\"\")","v":0},{"$f":"VLOOKUP(A14,CADASTRO!C:F,4,0)","v":"PADARIA TRADICIONAL"},1,"2023-02-14"]
[14,{"$f":"IF(A15=\"\",\"\",IFERROR(VLOOKUP(A15,CADASTRO!C:D,2,FALSE),\"Produto Não Cadastrado\"))","v":"BISCOITO COCO"},{"$f":"IFERROR(VLOOKUP(A15,CADASTRO!C:F,3,0),\"\")","v":0},{"$f":"VLOOKUP(A15,CADASTRO!C:F,4,0)","v":"PADARIA TRADICIONAL"},1,"2023-02-14"]
[16,{"$f":"IF(A16=\"\",\"\",IFERROR(VLOOKUP(A16,CADASTRO!C:D,2,FALSE),\"Produto Não Cadastrado\"))","v":"BISCOITO MAISENA"},{"$f":"IFERROR(VLOOKUP(A16,CADASTRO!C:F,3,0),\"\")","v":0},{"$f":"VLOOKUP(A16,CADASTRO!C:F,4,0)","v":"PADARIA TRADICIONAL"},1,"2023-02-14"]
[17,{"$f":"IF(A17=\"\",\"\",IFERROR(VLOOKUP(A17,CADASTRO!C:D,2,FALSE),\"Produto Não Cadastrado\"))","v":"BISCOITO MONTEIRO LOPES"},{"$f":"IFERROR(VLOOKUP(A17,CADASTRO!C:F,3,0),\"\")","v":0},{"$f":"VLOOKUP(A17,CADASTRO!C:F,4,0)","v":"PADARIA TRADICIONAL"},5,"2023-02-14"]
[18,{"$f":"IF(A18=\"\",\"\",IFERROR(VLOOKUP(A18,CADASTRO!C:D,2,FALSE),\"Produto Não Cadastrado\"))","v":"BISCOITO OLHO DE BOI"},{"$f":"IFERROR(VLOOKUP(A18,CADASTRO!C:F,3,0),\"\")","v":0},{"$f":"VLOOKUP(A18,CADASTRO!C:F,4,0)","v":"PADARIA TRADICIONAL"},1,"2023-02-14"]
[39,{"$f":"IF(A19=\"\",\"\",IFERROR(VLOOKUP(A19,CADASTRO!C:D,2,FALSE),\"Produto Não Cadastrado\"))","v":"CROISSANT AMÊNDOAS"},{"$f":"IFERROR(VLOOKUP(A19,CADASTRO!C:F,3,0),\"\")","v":0},{"$f":"VLOOKUP(A19,CADASTRO!C:F,4,0)","v":"PADARIA TRADICIONAL"},20,"2023-02-14"]
[41,{"$f":"IF(A20=\"\",\"\",IFERROR(VLOOKUP(A20,CADASTRO!C:D,2,FALSE),\"Produto Não Cadastrado\"))","v":"CROISSANT CONGELADO "},{"$f":"IFERROR(VLOOKUP(A20,CADASTRO!C:F,3,0),\"\")","v":0},{"$f":"VLOOKUP(A20,CADASTRO!C:F,4,0)","v":"PADARIA TRADICIONAL"},350,"2023-02-14"]
{"$rows_left_out":516}
{"sheet":"ORDEM DE PRODUÇÃO","index":5,"n_rows":10,"n_cols":4,"rows_kept":10,"cut":false,"hidden":false,"merged":[]}
["Estoque Atual","Mensagem","CÓD","Descrição"]
[null,"PRODUZIR!*"]
["Estoque Atual","Mensagem","CÓD","Descrição"]
[-3.421999999999997,"PRODUZIR! -3,422 A MENOR",79,"MINI FOLHADO CALABRESA"]
[-3.9000000000000004,"PRODUZIR! -3,9 A MENOR",82,"MINI FOLHADO FRANGO"]
[-3.3200000000000003,"PRODUZIR! -3,32 A MENOR",84,"MINI FOLHADO MISTO"]
[-4.0000000000013358E-3,"PRODUZIR! -0,00400000000000134 A MENOR",93,"MINI PASTEL FOLHADO"]
[-30,"PRODUZIR! -30 A MENOR",161,"PÃO FRANCÊS 10H"]
[-35,"PRODUZIR! -35 A MENOR",162,"PÃO FRANCÊS 18H"]
[-10,"PRODUZIR! -10 A MENOR",163,"PÃO FRANCÊS 5H"]