{"text_format":"1","workbook":"xlsx","n_sheets":6,"sheets":["CADASTRO","PRODUTOS","Formulário","ENTRADAS","SAÍDAS","ORDEM DE PRODUÇÃO"],"not_rendered":{"charts":0,"images":1,"macros":1,"external_links":0,"defined_names":7,"comments":0,"pivot_tables":0},"unopened":[],"bounds":{"document_bytes":16777216,"sheet_cells":100000,"rows_first":2000,"rows_last":500,"rows_between":2000,"halvings":0,"cell_chars":16384,"cell_head_chars":4096},"cells_cut":0,"cells_raw":0,"read":"whole","date_system":"1900"}

{"sheet":"CADASTRO","index":0,"n_rows":248,"n_cols":18,"rows_kept":248,"cut":false,"hidden":false,"merged":[]}
["Estoque Atual","Mensagem","CÓD","Descrição","Medida","Setor","Est Mínimo","Custo1   R$","Custo2   R$","Custo3   R$","Custo4   R$","Custo5   R$","Custo6   R$","Custo7   R$","Custo8   R$","Custo9   R$","Custo10   R$","Média"]
[{"$f":"IFERROR(VLOOKUP(C2,PRODUTOS!A3:P251,16,FALSE),0)","v":0},{"$f":"IFERROR(IF(A2<G2,\"PRODUZIR!\"&\" \"&A2-G2&\" \"&\"A MENOR\",\"EST NORMAL\"),\"\")","v":"EST NORMAL"},2,"FORMA DE EMPADA","UND","PADARIA TRADICIONAL",null,5,null,null,null,null,null,null,null,null,null,{"$f":"IFERROR(AVERAGE(H2:Q2),\"\")","v":5}]
[{"$f":"IFERROR(VLOOKUP(C3,PRODUTOS!A4:P252,16,FALSE),0)","v":0},"EST NORMAL",3,"ARO DE QUICHE","UND","PADARIA TRADICIONAL",null,null,null,null,null,null,null,null,null,null,null,""]
[{"$f":"IFERROR(VLOOKUP(C4,PRODUTOS!A5:P253,16,FALSE),0)","v":4},"EST NORMAL",8,"BAGUETE INTEGRAL (PCT C/ 45 UND = 3 KG)",null,"PADARIA TRADICIONAL",null,null,null,null,null,null,null,null,null,null,null,""]
[{"$f":"IFERROR(VLOOKUP(C5,PRODUTOS!A6:P254,16,FALSE),0)","v":0},"EST NORMAL",9,"BAILERINE",null,"CONFEITARIA DOCE",null,null,null,null,null,null,null,null,null,null,null,""]
[{"$f":"IFERROR(VLOOKUP(C6,PRODUTOS!A7:P255,16,FALSE),0)","v":1},"EST NORMAL",11,"BISCOITO ACEBOLADO",null,"PADARIA TRADICIONAL",null,null,null,null,null,null,null,null,null,null,null,""]
[{"$f":"IFERROR(VLOOKUP(C7,PRODUTOS!A8:P256,16,FALSE),0)","v":0},"EST NORMAL",12,"BISCOITO CASTANHA",null,"PADARIA TRADICIONAL",null,null,null,null,null,null,null,null,null,null,null,""]
[{"$f":"IFERROR(VLOOKUP(C8,PRODUTOS!A9:P257,16,FALSE),0)","v":6.57},"EST NORMAL",13,"BISCOITO CATUPIRI",null,"PADARIA TRADICIONAL",null,null,null,null,null,null,null,null,null,null,null,""]
[{"$f":"IFERROR(VLOOKUP(C9,PRODUTOS!A10:P258,16,FALSE),0)","v":1},"EST NORMAL",14,"BISCOITO COCO",null,"PADARIA TRADICIONAL",null,null,null,null,null,null,null,null,null,null,null,""]
[{"$f":"IFERROR(VLOOKUP(C10,PRODUTOS!A11:P259,16,FALSE),0)","v":0},"EST NORMAL",15,"BISCOITO DE BOLO",null,"PADARIA TRADICIONAL",null,null,null,null,null,null,null,null,null,null,null,""]
[{"$f":"IFERROR(VLOOKUP(C11,PRODUTOS!A12:P260,16,FALSE),0)","v":0},"EST NORMAL",16,"BISCOITO MAISENA",null,"PADARIA TRADICIONAL",null,null,null,null,null,null,null,null,null,null,null,""]
[{"$f":"IFERROR(VLOOKUP(C12,PRODUTOS!A13:P261,16,FALSE),0)","v":11},"EST NORMAL",17,"BISCOITO MONTEIRO LOPES",null,"PADARIA TRADICIONAL",null,null,null,null,null,null,null,null,null,null,null,""]
[{"$f":"IFERROR(VLOOKUP(C13,PRODUTOS!A14:P262,16,FALSE),0)","v":0},"EST NORMAL",18,"BISCOITO OLHO DE BOI",null,"PADARIA TRADICIONAL",null,null,null,null,null,null,null,null,null,null,null,""]
[{"$f":"IFERROR(VLOOKUP(C14,PRODUTOS!A15:P263,16,FALSE),0)","v":5},"EST NORMAL",19,"BISCOITO PAI D'ÉGUA",null,"PADARIA TRADICIONAL",null,null,null,null,null,null,null,null,null,null,null,""]
[{"$f":"IFERROR(VLOOKUP(C15,PRODUTOS!A16:P264,16,FALSE),0)","v":0},"EST NORMAL",20,"BOLO CASEIRO ",null,"CONFEITARIA DOCE",null,null,null,null,null,null,null,null,null,null,null,""]
[{"$f":"IFERROR(VLOOKUP(C16,PRODUTOS!A17:P265,16,FALSE),0)","v":0},"EST NORMAL",21,"BOLO MILHO CREMOSO G50",null,"CONFEITARIA DOCE",null,null,null,null,null,null,null,null,null,null,null,""]
[{"$f":"IFERROR(VLOOKUP(C17,PRODUTOS!A18:P266,16,FALSE),0)","v":173},"EST NORMAL",26,"CARRET",null,"FOLHATERIA",null,null,null,null,null,null,null,null,null,null,null,""]
[{"$f":"IFERROR(VLOOKUP(C18,PRODUTOS!A19:P267,16,FALSE),0)","v":0},"EST NORMAL",27,"CASADINHO G50",null,"CONFEITARIA DOCE",null,null,null,null,null,null,null,null,null,null,null,""]
[{"$f":"IFERROR(VLOOKUP(C19,PRODUTOS!A20:P268,16,FALSE),0)","v":3},"EST NORMAL",28,"CATARINA DE BACALHAU ",null,"FOLHATERIA",null,null,null,null,null,null,null,null,null,null,null,""]
[{"$f":"IFERROR(VLOOKUP(C20,PRODUTOS!A21:P269,16,FALSE),0)","v":2},"EST NORMAL",29,"CATARINA DE FRANGO",null,"FOLHATERIA",null,null,null,null,null,null,null,null,null,null,null,""]
[{"$f":"IFERROR(VLOOKUP(C21,PRODUTOS!A22:P270,16,FALSE),0)","v":0},"EST NORMAL",31,"CHOCOMOUSSE G50",null,"CONFEITARIA DOCE",null,null,null,null,null,null,null,null,null,null,null,""]
[{"$f":"IFERROR(VLOOKUP(C22,PRODUTOS!A23:P271,16,FALSE),0)","v":0},"EST NORMAL",32,"CIABATTA P/ SANDUÍCHES",null,"PADARIA RÚSTICA",null,null,null,null,null,null,null,null,null,null,null,""]
[{"$f":"IFERROR(VLOOKUP(C23,PRODUTOS!A24:P272,16,FALSE),0)","v":0},"EST NORMAL",34,"PÃO BENGALA 18H",null,"PADARIA TRADICIONAL",null,null,null,null,null,null,null,null,null,null,null,""]
[{"$f":"IFERROR(VLOOKUP(C24,PRODUTOS!A25:P273,16,FALSE),0)","v":22},"EST NORMAL",39,"CROISSANT AMÊNDOAS",null,"PADARIA TRADICIONAL",null,null,null,null,null,null,null,null,null,null,null,""]
[{"$f":"IFERROR(VLOOKUP(C25,PRODUTOS!A26:P274,16,FALSE),0)","v":0},"EST NORMAL",40,"PÃO BAGUETE 05H",null,"PADARIA TRADICIONAL",null,null,null,null,null,null,null,null,null,null,null,""]
[{"$f":"IFERROR(VLOOKUP(C26,PRODUTOS!A27:P275,16,FALSE),0)","v":190},"EST NORMAL",41,"CROISSANT CONGELADO ",null,"PADARIA TRADICIONAL",null,null,null,null,null,null,null,null,null,null,null,""]
[{"$f":"IFERROR(VLOOKUP(C27,PRODUTOS!A28:P276,16,FALSE),0)","v":0},"EST NORMAL",42,"CROQUE MONSIER",null,"QUITUTERIA",null,null,null,null,null,null,null,null,null,null,null,""]
[{"$f":"IFERROR(VLOOKUP(C28,PRODUTOS!A29:P277,16,FALSE),0)","v":0},"EST NORMAL",43,"CUPCAKE LEITE",null,"CONFEITARIA DOCE",null,null,null,null,null,null,null,null,null,null,null,""]
[{"$f":"IFERROR(VLOOKUP(C29,PRODUTOS!A30:P278,16,FALSE),0)","v":17},"EST NORMAL",44,"DANISH CAPRESE",null,"FOLHATERIA",null,null,null,null,null,null,null,null,null,null,null,""]
[{"$f":"IFERROR(VLOOKUP(C30,PRODUTOS!A31:P279,16,FALSE),0)","v":0},"EST NORMAL",45,"DISCO MINI CAKE CHOCOLATE",null,"CONFEITARIA DOCE",null,null,null,null,null,null,null,null,null,null,null,""]
[{"$f":"IFERROR(VLOOKUP(C31,PRODUTOS!A32:P280,16,FALSE),0)","v":0},"EST NORMAL",46,"DISCOS DE RED VELVET",null,"CONFEITARIA DOCE",null,null,null,null,null,null,null,null,null,null,null,""]
[{"$f":"IFERROR(VLOOKUP(C32,PRODUTOS!A33:P281,16,FALSE),0)","v":0},"EST NORMAL",47,"DISCOS MINI CAKE DE LEITE",null,"CONFEITARIA DOCE",null,null,null,null,null,null,null,null,null,null,null,""]
[{"$f":"IFERROR(VLOOKUP(C33,PRODUTOS!A34:P282,16,FALSE),0)","v":0},"EST NORMAL",48,"DISCOS SUPREMO",null,"CONFEITARIA DOCE",null,null,null,null,null,null,null,null,null,null,null,""]
[{"$f":"IFERROR(VLOOKUP(C34,PRODUTOS!A35:P283,16,FALSE),0)","v":72},"EST NORMAL",49,"DONNUTS",null,"PADARIA TRADICIONAL",null,null,null,null,null,null,null,null,null,null,null,""]
[{"$f":"IFERROR(VLOOKUP(C35,PRODUTOS!A36:P284,16,FALSE),0)","v":61},"EST NORMAL",50,"EMPADA BACALHAU",null,"PADARIA TRADICIONAL",null,null,null,null,null,null,null,null,null,null,null,""]
[{"$f":"IFERROR(VLOOKUP(C36,PRODUTOS!A37:P285,16,FALSE),0)","v":144},"EST NORMAL",51,"EMPADA FRANGO",null,"PADARIA TRADICIONAL",null,null,null,null,null,null,null,null,null,null,null,""]
[{"$f":"IFERROR(VLOOKUP(C37,PRODUTOS!A38:P286,16,FALSE),0)","v":128},"EST NORMAL",52,"EMPADA FRANGO/PALMITO",null,"PADARIA TRADICIONAL",null,null,null,null,null,null,null,null,null,null,null,""]
[{"$f":"IFERROR(VLOOKUP(C38,PRODUTOS!A39:P287,16,FALSE),0)","v":55},"EST NORMAL",53,"EMPADA PALMITO",null,"PADARIA TRADICIONAL",null,null,null,null,null,null,null,null,null,null,null,""]
[{"$f":"IFERROR(VLOOKUP(C39,PRODUTOS!A40:P288,16,FALSE),0)","v":0},"EST NORMAL",54,"EMPADÃO",null,"PADARIA TRADICIONAL",null,null,null,null,null,null,null,null,null,null,null,""]
[{"$f":"IFERROR(VLOOKUP(C40,PRODUTOS!A41:P289,16,FALSE),0)","v":12},"EST NORMAL",60,"FOCACCIA RUSTICA  CALABRESA (MASSA)",null,"PADARIA RÚSTICA",null,null,null,null,null,null,null,null,null,null,null,""]
[{"$f":"IFERROR(VLOOKUP(C41,PRODUTOS!A42:P290,16,FALSE),0)","v":67.2},"EST NORMAL",61,"FOCACCIA TABULEIRO",null,"PADARIA RÚSTICA",null,null,null,null,null,null,null,null,null,null,null,""]
[{"$f":"IFERROR(VLOOKUP(C42,PRODUTOS!A43:P291,16,FALSE),0)","v":1},"EST NORMAL",66,"LASANHA FOLHADA MISTA",null,"FOLHATERIA",null,null,null,null,null,null,null,null,null,null,null,""]
[{"$f":"IFERROR(VLOOKUP(C43,PRODUTOS!A44:P292,16,FALSE),0)","v":0},"EST NORMAL",70,"MASSA DOCINHO BRIGADEIRO",null,"CONFEITARIA DOCE",null,null,null,null,null,null,null,null,null,null,null,""]
[{"$f":"IFERROR(VLOOKUP(C44,PRODUTOS!A45:P293,16,FALSE),0)","v":4},"EST NORMAL",71,"MASSA MINI PIZZA",null,"PADARIA TRADICIONAL",null,null,null,null,null,null,null,null,null,null,null,""]
[{"$f":"IFERROR(VLOOKUP(C45,PRODUTOS!A46:P294,16,FALSE),0)","v":0},"EST NORMAL",72,"MASSAS TARTALETE",null,"CONFEITARIA DOCE",null,null,null,null,null,null,null,null,null,null,null,""]
[{"$f":"IFERROR(VLOOKUP(C46,PRODUTOS!A47:P295,16,FALSE),0)","v":0},"EST NORMAL",73,"MIL FOLHAS",null,"FOLHATERIA",null,null,null,null,null,null,null,null,null,null,null,""]
[{"$f":"IFERROR(VLOOKUP(C47,PRODUTOS!A48:P296,16,FALSE),0)","v":0},"EST NORMAL",74,"MINI BOLO DE CENOURA",null,"CONFEITARIA DOCE",null,null,null,null,null,null,null,null,null,null,null,""]
[{"$f":"IFERROR(VLOOKUP(C48,PRODUTOS!A49:P297,16,FALSE),0)","v":0},"EST NORMAL",75,"MINI CAKE DE CHOCOLATE",null,"CONFEITARIA DOCE",null,null,null,null,null,null,null,null,null,null,null,""]
[{"$f":"IFERROR(VLOOKUP(C49,PRODUTOS!A50:P298,16,FALSE),0)","v":0},"EST NORMAL",76,"MINI CAKE DE LEITE",null,"CONFEITARIA DOCE",null,null,null,null,null,null,null,null,null,null,null,""]
[{"$f":"IFERROR(VLOOKUP(C50,PRODUTOS!A51:P299,16,FALSE),0)","v":12.7},"EST NORMAL",77,"MINI CROISSANT ",null,"FOLHATERIA",null,null,null,null,null,null,null,null,null,null,null,""]
[{"$f":"IFERROR(VLOOKUP(C51,PRODUTOS!A52:P300,16,FALSE),0)","v":3.3940000000000019},"EST NORMAL",78,"MINI FOLHADO BACALHAU",null,"FOLHATERIA",null,null,null,null,null,null,null,null,null,null,null,""]
[{"$f":"IFERROR(VLOOKUP(C52,PRODUTOS!A53:P301,16,FALSE),0)","v":-3.421999999999997},"PRODUZIR! -3,422 A MENOR",79,"MINI FOLHADO CALABRESA",null,"FOLHATERIA",null,null,null,null,null,null,null,null,null,null,null,""]
[{"$f":"IFERROR(VLOOKUP(C53,PRODUTOS!A54:P302,16,FALSE),0)","v":3.5799999999999983},"EST NORMAL",80,"MINI FOLHADO CUPUAÇU",null,"FOLHATERIA",null,null,null,null,null,null,null,null,null,null,null,""]
[{"$f":"IFERROR(VLOOKUP(C54,PRODUTOS!A55:P303,16,FALSE),0)","v":0.40000000000000213},"EST NORMAL",81,"MINI FOLHADO DE QUEIJO",null,"FOLHATERIA",null,null,null,null,null,null,null,null,null,null,null,""]
[{"$f":"IFERROR(VLOOKUP(C55,PRODUTOS!A56:P304,16,FALSE),0)","v":-3.9000000000000004},"PRODUZIR! -3,9 A MENOR",82,"MINI FOLHADO FRANGO",null,"FOLHATERIA",null,null,null,null,null,null,null,null,null,null,null,""]
[{"$f":"IFERROR(VLOOKUP(C56,PRODUTOS!A57:P305,16,FALSE),0)","v":12.66},"EST NORMAL",83,"MINI FOLHADO GOIABADA",null,"FOLHATERIA",null,null,null,null,null,null,null,null,null,null,null,""]
[{"$f":"IFERROR(VLOOKUP(C57,PRODUTOS!A58:P306,16,FALSE),0)","v":-3.3200000000000003},"PRODUZIR! -3,32 A MENOR",84,"MINI FOLHADO MISTO",null,"FOLHATERIA",null,null,null,null,null,null,null,null,null,null,null,""]
[{"$f":"IFERROR(VLOOKUP(C58,PRODUTOS!A59:P307,16,FALSE),0)","v":0},"EST NORMAL",85,"MINI LASANHA FOLHADA",null,"FOLHATERIA",null,null,null,null,null,null,null,null,null,null,null,""]
[{"$f":"IFERROR(VLOOKUP(C59,PRODUTOS!A60:P308,16,FALSE),0)","v":0},"EST NORMAL",86,"MINI LASANHA MISTA",null,"FOLHATERIA",null,null,null,null,null,null,null,null,null,null,null,""]
[{"$f":"IFERROR(VLOOKUP(C60,PRODUTOS!A61:P309,16,FALSE),0)","v":0},"EST NORMAL",87,"MINI PAIN AU CHOCOLAT ",null,"FOLHATERIA",null,null,null,null,null,null,null,null,null,null,null,""]
[{"$f":"IFERROR(VLOOKUP(C61,PRODUTOS!A62:P310,16,FALSE),0)","v":390},"EST NORMAL",88,"MINI PÃO BATATA (ERVAS,PARMESÃO)",null,"PADARIA TRADICIONAL",null,null,null,null,null,null,null,null,null,null,null,""]
[{"$f":"IFERROR(VLOOKUP(C62,PRODUTOS!A63:P311,16,FALSE),0)","v":286},"EST NORMAL",89,"MINI PÃO BATATA HAMBÚRGUER",null,"PADARIA TRADICIONAL",null,null,null,null,null,null,null,null,null,null,null,""]
[{"$f":"IFERROR(VLOOKUP(C63,PRODUTOS!A64:P312,16,FALSE),0)","v":0},"EST NORMAL",90,"MINI PÃO BRIOCHE (C/ 6 UNIDADES = 740G)",null,"PADARIA TRADICIONAL",null,null,null,null,null,null,null,null,null,null,null,""]
[{"$f":"IFERROR(VLOOKUP(C64,PRODUTOS!A65:P313,16,FALSE),0)","v":4},"EST NORMAL",91,"MINI PÃO BRIOCHE (PCT C/ 24UND)",null,"PADARIA TRADICIONAL",null,null,null,null,null,null,null,null,null,null,null,""]
[{"$f":"IFERROR(VLOOKUP(C65,PRODUTOS!A66:P314,16,FALSE),0)","v":8},"EST NORMAL",92,"MINI PÃO DELÍCIA  (PCT C/ 24UND)",null,"PADARIA TRADICIONAL",null,null,null,null,null,null,null,null,null,null,null,""]
[{"$f":"IFERROR(VLOOKUP(C66,PRODUTOS!A67:P315,16,FALSE),0)","v":-4.0000000000013358E-3},{"$f":"IFERROR(IF(A66<G66,\"PRODUZIR!\"&\" \"&A66-G66&\" \"&\"A MENOR\",\"EST NORMAL\"),\"\")","v":"PRODUZIR! -0,00400000000000134 A MENOR"},93,"MINI PASTEL FOLHADO",null,"FOLHATERIA",null,null,null,null,null,null,null,null,null,null,null,{"$f":"IFERROR(AVERAGE(H66:Q66),\"\")","v":""}]
[{"$f":"IFERROR(VLOOKUP(C67,PRODUTOS!A68:P316,16,FALSE),0)","v":10},"EST NORMAL",94,"MINI TRANÇA BACALHAU",null,"FOLHATERIA",null,null,null,null,null,null,null,null,null,null,null,""]
[{"$f":"IFERROR(VLOOKUP(C68,PRODUTOS!A69:P317,16,FALSE),0)","v":2},"EST NORMAL",95,"MINI TRANÇA CALABRESA",null,"FOLHATERIA",null,null,null,null,null,null,null,null,null,null,null,""]
[{"$f":"IFERROR(VLOOKUP(C69,PRODUTOS!A70:P318,16,FALSE),0)","v":0},"EST NORMAL",96,"MINI TRANÇA FILÉ",null,"FOLHATERIA",null,null,null,null,null,null,null,null,null,null,null,""]
[{"$f":"IFERROR(VLOOKUP(C70,PRODUTOS!A71:P319,16,FALSE),0)","v":10},"EST NORMAL",97,"MINI TRANÇA FRANGO",null,"FOLHATERIA",null,null,null,null,null,null,null,null,null,null,null,""]
[{"$f":"IFERROR(VLOOKUP(C71,PRODUTOS!A72:P320,16,FALSE),0)","v":2},"EST NORMAL",98,"MINI TRANÇA MISTA",null,"FOLHATERIA",null,null,null,null,null,null,null,null,null,null,null,""]
[{"$f":"IFERROR(VLOOKUP(C72,PRODUTOS!A73:P321,16,FALSE),0)","v":0},"EST NORMAL",99,"MINI TRANÇA MORTADELA DEFUMADO",null,"FOLHATERIA",null,null,null,null,null,null,null,null,null,null,null,""]
[{"$f":"IFERROR(VLOOKUP(C73,PRODUTOS!A74:P322,16,FALSE),0)","v":0},"EST NORMAL",100,"MINI TRANÇA PATO",null,"FOLHATERIA",null,null,null,null,null,null,null,null,null,null,null,""]
[{"$f":"IFERROR(VLOOKUP(C74,PRODUTOS!A75:P323,16,FALSE),0)","v":0},"EST NORMAL",101,"MINI TRANÇA PEITO DEFUMADO",null,"FOLHATERIA",null,null,null,null,null,null,null,null,null,null,null,""]
[{"$f":"IFERROR(VLOOKUP(C75,PRODUTOS!A76:P324,16,FALSE),0)","v":0},"EST NORMAL",102,"MINI TRANÇA PERNIL",null,"FOLHATERIA",null,null,null,null,null,null,null,null,null,null,null,""]
[{"$f":"IFERROR(VLOOKUP(C76,PRODUTOS!A77:P325,16,FALSE),0)","v":0},"EST NORMAL",103,"MINI TRANÇA PERU/JAMBU",null,"FOLHATERIA",null,null,null,null,null,null,null,null,null,null,null,""]
[{"$f":"IFERROR(VLOOKUP(C77,PRODUTOS!A78:P326,16,FALSE),0)","v":21},"EST NORMAL",104,"MINI TRANÇA SALAME",null,"FOLHATERIA",null,null,null,null,null,null,null,null,null,null,null,""]
[{"$f":"IFERROR(VLOOKUP(C78,PRODUTOS!A79:P327,16,FALSE),0)","v":0},"EST NORMAL",106,"NEGÃO G50",null,"CONFEITARIA DOCE",null,null,null,null,null,null,null,null,null,null,null,""]
[{"$f":"IFERROR(VLOOKUP(C79,PRODUTOS!A80:P328,16,FALSE),0)","v":11.190000000000001},"EST NORMAL",107,"ORELHINHA CANELA",null,"FOLHATERIA",null,null,null,null,null,null,null,null,null,null,null,""]
[{"$f":"IFERROR(VLOOKUP(C80,PRODUTOS!A81:P329,16,FALSE),0)","v":8.3780000000000001},"EST NORMAL",108,"ORELINHA TRADICIONAL",null,"FOLHATERIA",null,null,null,null,null,null,null,null,null,null,null,""]
[{"$f":"IFERROR(VLOOKUP(C81,PRODUTOS!A82:P330,16,FALSE),0)","v":0},"EST NORMAL",109,"PAIN AU CHOCOLAT",null,"FOLHATERIA",null,null,null,null,null,null,null,null,null,null,null,""]
[{"$f":"IFERROR(VLOOKUP(C82,PRODUTOS!A83:P331,16,FALSE),0)","v":4.1400000000000006},"EST NORMAL",110,"PALITO CANELA",null,"FOLHATERIA",null,null,null,null,null,null,null,null,null,null,null,""]
[{"$f":"IFERROR(VLOOKUP(C83,PRODUTOS!A84:P332,16,FALSE),0)","v":-8.5},"PRODUZIR! -8,5 A MENOR",111,"PALITO QUEIJO",null,"FOLHATERIA",null,null,null,null,null,null,null,null,null,null,null,""]
[{"$f":"IFERROR(VLOOKUP(C84,PRODUTOS!A85:P333,16,FALSE),0)","v":130},"EST NORMAL",112,"PALMIER",null,"FOLHATERIA",null,null,null,null,null,null,null,null,null,null,null,""]
[{"$f":"IFERROR(VLOOKUP(C85,PRODUTOS!A86:P334,16,FALSE),0)","v":0},"EST NORMAL",113,"PÃO AUSTRALIANO BAGUETE",null,"PADARIA TRADICIONAL",null,null,null,null,null,null,null,null,null,null,null,""]
[{"$f":"IFERROR(VLOOKUP(C86,PRODUTOS!A87:P335,16,FALSE),0)","v":0},"EST NORMAL",114,"PÃO AUSTRALIANO HAMBÚRGUER",null,"PADARIA TRADICIONAL",null,null,null,null,null,null,null,null,null,null,null,""]
[{"$f":"IFERROR(VLOOKUP(C87,PRODUTOS!A88:P336,16,FALSE),0)","v":0},"EST NORMAL",115,"PÃO AUSTRALIANO RÚSTICO",null,"PADARIA RÚSTICA",null,null,null,null,null,null,null,null,null,null,null,""]
[{"$f":"IFERROR(VLOOKUP(C88,PRODUTOS!A89:P337,16,FALSE),0)","v":0},"EST NORMAL",116,"PÃO BAGUETE 10 HORAS",null,"PADARIA TRADICIONAL",null,null,null,null,null,null,null,null,null,null,null,""]
[{"$f":"IFERROR(VLOOKUP(C89,PRODUTOS!A90:P338,16,FALSE),0)","v":0},"EST NORMAL",117,"PÃO BAGUETE DE TRADIÇÃO",null,"PADARIA RÚSTICA",null,null,null,null,null,null,null,null,null,null,null,""]
[{"$f":"IFERROR(VLOOKUP(C90,PRODUTOS!A91:P339,16,FALSE),0)","v":0},"EST NORMAL",118,"PÃO BAGUETE FRANCESA",null,"PADARIA RÚSTICA",null,null,null,null,null,null,null,null,null,null,null,""]
[{"$f":"IFERROR(VLOOKUP(C91,PRODUTOS!A92:P340,16,FALSE),0)","v":11},"EST NORMAL",119,"PÃO BAGUETE LYON",null,"PADARIA RÚSTICA",null,null,null,null,null,null,null,null,null,null,null,""]
[{"$f":"IFERROR(VLOOKUP(C92,PRODUTOS!A93:P341,16,FALSE),0)","v":0},"EST NORMAL",120,"PÃO BAGUETE PORTUGUESA",null,"PADARIA TRADICIONAL",null,null,null,null,null,null,null,null,null,null,null,""]
[{"$f":"IFERROR(VLOOKUP(C93,PRODUTOS!A94:P342,16,FALSE),0)","v":92},"EST NORMAL",121,"PÃO BAIÃO",null,"PADARIA TRADICIONAL",null,null,null,null,null,null,null,null,null,null,null,""]
[{"$f":"IFERROR(VLOOKUP(C94,PRODUTOS!A95:P343,16,FALSE),0)","v":3},"EST NORMAL",122,"PÃO BENGALA 10 HORAS",null,"PADARIA TRADICIONAL",null,null,null,null,null,null,null,null,null,null,null,""]
[{"$f":"IFERROR(VLOOKUP(C95,PRODUTOS!A96:P344,16,FALSE),0)","v":29},"EST NORMAL",123,"PÃO BRIOCHE DE FORMA  1000",null,"PADARIA TRADICIONAL",null,null,null,null,null,null,null,null,null,null,null,""]
[{"$f":"IFERROR(VLOOKUP(C96,PRODUTOS!A97:P345,16,FALSE),0)","v":10},"EST NORMAL",124,"PÃO BRIOCHE HAMBÚRGUER",null,"PADARIA TRADICIONAL",null,null,null,null,null,null,null,null,null,null,null,""]
[{"$f":"IFERROR(VLOOKUP(C97,PRODUTOS!A98:P346,16,FALSE),0)","v":0},"EST NORMAL",125,"PÃO C/ CEBOLA E ERVAS DE PROVENCE",null,"PADARIA RÚSTICA",null,null,null,null,null,null,null,null,null,null,null,""]
[{"$f":"IFERROR(VLOOKUP(C98,PRODUTOS!A99:P347,16,FALSE),0)","v":81},"EST NORMAL",126,"PÃO CAMPONÊS",null,"PADARIA RÚSTICA",null,null,null,null,null,null,null,null,null,null,null,""]
[{"$f":"IFERROR(VLOOKUP(C99,PRODUTOS!A100:P348,16,FALSE),0)","v":0},"EST NORMAL",127,"PÃO CIABATTA C/ AZEITONAS",null,"PADARIA RÚSTICA",null,null,null,null,null,null,null,null,null,null,null,""]
[{"$f":"IFERROR(VLOOKUP(C100,PRODUTOS!A101:P349,16,FALSE),0)","v":0},"EST NORMAL",128,"PÃO CIABATTA C/ CALABRESA",null,"PADARIA RÚSTICA",null,null,null,null,null,null,null,null,null,null,null,""]
[{"$f":"IFERROR(VLOOKUP(C101,PRODUTOS!A102:P350,16,FALSE),0)","v":0},"EST NORMAL",129,"PÃO CIABATTA C/ CEBOLA",null,"PADARIA RÚSTICA",null,null,null,null,null,null,null,null,null,null,null,""]
[{"$f":"IFERROR(VLOOKUP(C102,PRODUTOS!A103:P351,16,FALSE),0)","v":0},"EST NORMAL",130,"PÃO CIABATTA DE TRADIÇÃO",null,"PADARIA RÚSTICA",null,null,null,null,null,null,null,null,null,null,null,""]
[{"$f":"IFERROR(VLOOKUP(C103,PRODUTOS!A104:P352,16,FALSE),0)","v":13},"EST NORMAL",131,"PÃO CUCA DE BANANA",null,"PADARIA TRADICIONAL",null,null,null,null,null,null,null,null,null,null,null,""]
[{"$f":"IFERROR(VLOOKUP(C104,PRODUTOS!A105:P353,16,FALSE),0)","v":52},"EST NORMAL",132,"PÃO CUCA GOIABADA",null,"PADARIA TRADICIONAL",null,null,null,null,null,null,null,null,null,null,null,""]
[{"$f":"IFERROR(VLOOKUP(C105,PRODUTOS!A106:P354,16,FALSE),0)","v":0},"EST NORMAL",133,"PÃO CUCA PACOCA",null,"PADARIA TRADICIONAL",null,null,null,null,null,null,null,null,null,null,null,""]
[{"$f":"IFERROR(VLOOKUP(C106,PRODUTOS!A107:P355,16,FALSE),0)","v":0},"EST NORMAL",134,"PÃO DAMIEN MONTECER",null,"PADARIA RÚSTICA",null,null,null,null,null,null,null,null,null,null,null,""]
[{"$f":"IFERROR(VLOOKUP(C107,PRODUTOS!A108:P356,16,FALSE),0)","v":104},"EST NORMAL",135,"PÃO DE BATATA FILÃO",null,"PADARIA TRADICIONAL",null,null,null,null,null,null,null,null,null,null,null,""]
[{"$f":"IFERROR(VLOOKUP(C108,PRODUTOS!A109:P357,16,FALSE),0)","v":0},"EST NORMAL",136,"PÃO DE CACAU",null,"PADARIA RÚSTICA",null,null,null,null,null,null,null,null,null,null,null,""]
[{"$f":"IFERROR(VLOOKUP(C109,PRODUTOS!A110:P358,16,FALSE),0)","v":0},"EST NORMAL",137,"PÃO DE CERVEJA C/ GRÃOS TORRADOS",null,"PADARIA RÚSTICA",null,null,null,null,null,null,null,null,null,null,null,""]
[{"$f":"IFERROR(VLOOKUP(C110,PRODUTOS!A111:P359,16,FALSE),0)","v":0},"EST NORMAL",138,"PÃO DE FORMA 100% INTEGRAL",null,"PADARIA RÚSTICA",null,null,null,null,null,null,null,null,null,null,null,""]
[{"$f":"IFERROR(VLOOKUP(C111,PRODUTOS!A112:P360,16,FALSE),0)","v":0},"EST NORMAL",139,"PÃO DE LÓ (BRANCA)",null,"CONFEITARIA DOCE",null,null,null,null,null,null,null,null,null,null,null,""]
[{"$f":"IFERROR(VLOOKUP(C112,PRODUTOS!A113:P361,16,FALSE),0)","v":0},"EST NORMAL",140,"PÃO DE LÓ (CHOCOLATE)",null,"CONFEITARIA DOCE",null,null,null,null,null,null,null,null,null,null,null,""]
[{"$f":"IFERROR(VLOOKUP(C113,PRODUTOS!A114:P362,16,FALSE),0)","v":0},"EST NORMAL",141,"PÃO DE MANIÇOBA",null,"PADARIA RÚSTICA",null,null,null,null,null,null,null,null,null,null,null,""]
[{"$f":"IFERROR(VLOOKUP(C114,PRODUTOS!A115:P363,16,FALSE),0)","v":0},"EST NORMAL",142,"PÃO DE PATO",null,"PADARIA RÚSTICA",null,null,null,null,null,null,null,null,null,null,null,""]
[{"$f":"IFERROR(VLOOKUP(C115,PRODUTOS!A116:P364,16,FALSE),0)","v":0},"EST NORMAL",143,"PÃO DE PUPUNHA",null,"PADARIA RÚSTICA",null,null,null,null,null,null,null,null,null,null,null,""]
[{"$f":"IFERROR(VLOOKUP(C116,PRODUTOS!A117:P365,16,FALSE),0)","v":0},"EST NORMAL",144,"PÃO DE ROSAS",null,"FOLHATERIA",null,null,null,null,null,null,null,null,null,null,null,""]
[{"$f":"IFERROR(VLOOKUP(C117,PRODUTOS!A118:P366,16,FALSE),0)","v":0},"EST NORMAL",145,"PÃO DE VINHO / CALABRESA",null,"PADARIA RÚSTICA",null,null,null,null,null,null,null,null,null,null,null,""]
[{"$f":"IFERROR(VLOOKUP(C118,PRODUTOS!A119:P367,16,FALSE),0)","v":21},"EST NORMAL",146,"PÃO DOCE LIEVITO",null,"PADARIA TRADICIONAL",null,null,null,null,null,null,null,null,null,null,null,""]
[{"$f":"IFERROR(VLOOKUP(C119,PRODUTOS!A120:P368,16,FALSE),0)","v":0},"EST NORMAL",147,"PÃO FOCACCIA C/ AZEITONAS",null,"PADARIA RÚSTICA",null,null,null,null,null,null,null,null,null,null,null,""]
[{"$f":"IFERROR(VLOOKUP(C120,PRODUTOS!A121:P369,16,FALSE),0)","v":0},"EST NORMAL",148,"PÃO FOCACCIA C/ BACON",null,"PADARIA RÚSTICA",null,null,null,null,null,null,null,null,null,null,null,""]
[{"$f":"IFERROR(VLOOKUP(C121,PRODUTOS!A122:P370,16,FALSE),0)","v":0},"EST NORMAL",149,"PÃO FOCACCIA C/ CEBOLA",null,"PADARIA RÚSTICA",null,null,null,null,null,null,null,null,null,null,null,""]
[{"$f":"IFERROR(VLOOKUP(C122,PRODUTOS!A123:P371,16,FALSE),0)","v":0},"EST NORMAL",150,"PÃO FOCACCIA GÊNOVA",null,"PADARIA RÚSTICA",null,null,null,null,null,null,null,null,null,null,null,""]
[{"$f":"IFERROR(VLOOKUP(C123,PRODUTOS!A124:P372,16,FALSE),0)","v":0},"EST NORMAL",151,"PÃO FOCACCIA POMODORI",null,"PADARIA RÚSTICA",null,null,null,null,null,null,null,null,null,null,null,""]
[{"$f":"IFERROR(VLOOKUP(C124,PRODUTOS!A125:P373,16,FALSE),0)","v":0},"EST NORMAL",152,"PÃO BAGUETE 18H",null,"PADARIA TRADICIONAL",null,null,null,null,null,null,null,null,null,null,null,""]
[{"$f":"IFERROR(VLOOKUP(C125,PRODUTOS!A126:P374,16,FALSE),0)","v":26},"EST NORMAL",153,"PÃO FORMA BATATA A25",null,"PADARIA TRADICIONAL",null,null,null,null,null,null,null,null,null,null,null,""]
[{"$f":"IFERROR(VLOOKUP(C126,PRODUTOS!A127:P375,16,FALSE),0)","v":77},"EST NORMAL",154,"PÃO FORMA BRIOCHE A25",null,"PADARIA TRADICIONAL",null,null,null,null,null,null,null,null,null,null,null,""]
[{"$f":"IFERROR(VLOOKUP(C127,PRODUTOS!A128:P376,16,FALSE),0)","v":25},"EST NORMAL",155,"PÃO FORMA INTEGRAL 1000",null,"PADARIA TRADICIONAL",null,null,null,null,null,null,null,null,null,null,null,""]
[{"$f":"IFERROR(VLOOKUP(C128,PRODUTOS!A129:P377,16,FALSE),0)","v":16},"EST NORMAL",156,"PÃO FORMA INTEGRAL 700",null,"PADARIA TRADICIONAL",null,null,null,null,null,null,null,null,null,null,null,""]
[{"$f":"IFERROR(VLOOKUP(C129,PRODUTOS!A130:P378,16,FALSE),0)","v":49},"EST NORMAL",157,"PÃO FORMA LEITE A25",null,"PADARIA TRADICIONAL",null,null,null,null,null,null,null,null,null,null,null,""]
[{"$f":"IFERROR(VLOOKUP(C130,PRODUTOS!A131:P379,16,FALSE),0)","v":0},{"$f":"IFERROR(IF(A130<G130,\"PRODUZIR!\"&\" \"&A130-G130&\" \"&\"A MENOR\",\"EST NORMAL\"),\"\")","v":"EST NORMAL"},158,"PÃO FORMA MILHO A25",null,"PADARIA TRADICIONAL",null,null,null,null,null,null,null,null,null,null,null,{"$f":"IFERROR(AVERAGE(H130:Q130),\"\")","v":""}]
[{"$f":"IFERROR(VLOOKUP(C131,PRODUTOS!A132:P380,16,FALSE),0)","v":21},"EST NORMAL",159,"PÃO FORMA TRADICIONAL 1000",null,"PADARIA TRADICIONAL",null,null,null,null,null,null,null,null,null,null,null,""]
[{"$f":"IFERROR(VLOOKUP(C132,PRODUTOS!A133:P381,16,FALSE),0)","v":7},"EST NORMAL",160,"PÃO FORMA TRADICIONAL 700",null,"PADARIA TRADICIONAL",null,null,null,null,null,null,null,null,null,null,null,""]
[{"$f":"IFERROR(VLOOKUP(C133,PRODUTOS!A134:P382,16,FALSE),0)","v":-30},"PRODUZIR! -30 A MENOR",161,"PÃO FRANCÊS 10H",null,"PADARIA TRADICIONAL",null,null,null,null,null,null,null,null,null,null,null,""]
[{"$f":"IFERROR(VLOOKUP(C134,PRODUTOS!A135:P383,16,FALSE),0)","v":-35},"PRODUZIR! -35 A MENOR",162,"PÃO FRANCÊS 18H",null,"PADARIA TRADICIONAL",null,null,null,null,null,null,null,null,null,null,null,""]
[{"$f":"IFERROR(VLOOKUP(C135,PRODUTOS!A136:P384,16,FALSE),0)","v":-10},"PRODUZIR! -10 A MENOR",163,"PÃO FRANCÊS 5H",null,"PADARIA TRADICIONAL",null,null,null,null,null,null,null,null,null,null,null,""]
[{"$f":"IFERROR(VLOOKUP(C136,PRODUTOS!A137:P385,16,FALSE),0)","v":0},"EST NORMAL",164,"PÃO ITALIANO FILÃO",null,"PADARIA RÚSTICA",null,null,null,null,null,null,null,null,null,null,null,""]
[{"$f":"IFERROR(VLOOKUP(C137,PRODUTOS!A138:P386,16,FALSE),0)","v":0},"EST NORMAL",165,"PÃO ITALIANO PAVÊ",null,"PADARIA RÚSTICA",null,null,null,null,null,null,null,null,null,null,null,""]
[{"$f":"IFERROR(VLOOKUP(C138,PRODUTOS!A139:P387,16,FALSE),0)","v":0},"EST NORMAL",166,"PÃO PORTUGUÊS",null,"PADARIA RÚSTICA",null,null,null,null,null,null,null,null,null,null,null,""]
[{"$f":"IFERROR(VLOOKUP(C139,PRODUTOS!A140:P388,16,FALSE),0)","v":18.5},"EST NORMAL",167,"PÃO QUEIJO CALABRESA",null,"PADARIA TRADICIONAL",null,null,null,null,null,null,null,null,null,null,null,""]
[{"$f":"IFERROR(VLOOKUP(C140,PRODUTOS!A141:P389,16,FALSE),0)","v":0},"EST NORMAL",168,"PÃO QUEIJO CUIA",null,"PADARIA TRADICIONAL",null,null,null,null,null,null,null,null,null,null,null,""]
[{"$f":"IFERROR(VLOOKUP(C141,PRODUTOS!A142:P390,16,FALSE),0)","v":55},"EST NORMAL",169,"PÃO SEMI ITALIANO",null,"PADARIA TRADICIONAL",null,null,null,null,null,null,null,null,null,null,null,""]
[{"$f":"IFERROR(VLOOKUP(C142,PRODUTOS!A143:P391,16,FALSE),0)","v":151},"EST NORMAL",170,"PÃO VIENNOIS",null,"PADARIA TRADICIONAL",null,null,null,null,null,null,null,null,null,null,null,""]
[{"$f":"IFERROR(VLOOKUP(C143,PRODUTOS!A144:P392,16,FALSE),0)","v":0},"EST NORMAL",171,"PÃO BAGUETE 5H",null,"PADARIA TRADICIONAL",null,null,null,null,null,null,null,null,null,null,null,""]
[{"$f":"IFERROR(VLOOKUP(C144,PRODUTOS!A145:P393,16,FALSE),0)","v":16},"EST NORMAL",172,"PASTEL DE BELÉM (MASSA)",null,"FOLHATERIA",null,null,null,null,null,null,null,null,null,null,null,""]
[{"$f":"IFERROR(VLOOKUP(C145,PRODUTOS!A146:P394,16,FALSE),0)","v":57},"EST NORMAL",173,"PASTEL FOLHADO BACALHAU ",null,"FOLHATERIA",null,null,null,null,null,null,null,null,null,null,null,""]
[{"$f":"IFERROR(VLOOKUP(C146,PRODUTOS!A147:P395,16,FALSE),0)","v":69},"EST NORMAL",174,"PASTEL FOLHADO FRANGO ",null,"FOLHATERIA",null,null,null,null,null,null,null,null,null,null,null,""]
[{"$f":"IFERROR(VLOOKUP(C147,PRODUTOS!A148:P396,16,FALSE),0)","v":0},"EST NORMAL",175,"PASTEL FOLHADO MISTO ",null,"FOLHATERIA",null,null,null,null,null,null,null,null,null,null,null,""]
[{"$f":"IFERROR(VLOOKUP(C148,PRODUTOS!A149:P397,16,FALSE),0)","v":72},"EST NORMAL",176,"PASTEL FOLHADO QUEIJO ",null,"FOLHATERIA",null,null,null,null,null,null,null,null,null,null,null,""]
[{"$f":"IFERROR(VLOOKUP(C149,PRODUTOS!A150:P398,16,FALSE),0)","v":20},"EST NORMAL",180,"PIZZA FOLHADA MIX FRIOS ",null,"FOLHATERIA",null,null,null,null,null,null,null,null,null,null,null,""]
[{"$f":"IFERROR(VLOOKUP(C150,PRODUTOS!A151:P399,16,FALSE),0)","v":32},"EST NORMAL",181,"PIZZA INTEGRAL (MASSA)",null,"PADARIA TRADICIONAL",null,null,null,null,null,null,null,null,null,null,null,""]
[{"$f":"IFERROR(VLOOKUP(C151,PRODUTOS!A152:P400,16,FALSE),0)","v":0},"EST NORMAL",182,"PIZZA ROMANA BACON",null,"PADARIA RÚSTICA",null,null,null,null,null,null,null,null,null,null,null,""]
[{"$f":"IFERROR(VLOOKUP(C152,PRODUTOS!A153:P401,16,FALSE),0)","v":0},"EST NORMAL",183,"PIZZA ROMANA CALABRESA",null,"PADARIA RÚSTICA",null,null,null,null,null,null,null,null,null,null,null,""]
[{"$f":"IFERROR(VLOOKUP(C153,PRODUTOS!A154:P402,16,FALSE),0)","v":0},"EST NORMAL",184,"PIZZA ROMANA MARGUERITA",null,"PADARIA RÚSTICA",null,null,null,null,null,null,null,null,null,null,null,""]
[{"$f":"IFERROR(VLOOKUP(C154,PRODUTOS!A155:P403,16,FALSE),0)","v":0},"EST NORMAL",185,"PIZZA ROMANA MEXICANA",null,"PADARIA RÚSTICA",null,null,null,null,null,null,null,null,null,null,null,""]
[{"$f":"IFERROR(VLOOKUP(C155,PRODUTOS!A156:P404,16,FALSE),0)","v":0},"EST NORMAL",186,"PLACA BRANCA",null,"CONFEITARIA DOCE",null,null,null,null,null,null,null,null,null,null,null,""]
[{"$f":"IFERROR(VLOOKUP(C156,PRODUTOS!A157:P405,16,FALSE),0)","v":0},"EST NORMAL",187,"PLACA CHOCOLATE",null,"CONFEITARIA DOCE",null,null,null,null,null,null,null,null,null,null,null,""]
[{"$f":"IFERROR(VLOOKUP(C157,PRODUTOS!A158:P406,16,FALSE),0)","v":0},"EST NORMAL",188,"PLACA QUADRADINHO",null,"CONFEITARIA DOCE",null,null,null,null,null,null,null,null,null,null,null,""]
[{"$f":"IFERROR(VLOOKUP(C158,PRODUTOS!A159:P407,16,FALSE),0)","v":0},"EST NORMAL",189,"PLACA UVINHA",null,"CONFEITARIA DOCE",null,null,null,null,null,null,null,null,null,null,null,""]
[{"$f":"IFERROR(VLOOKUP(C159,PRODUTOS!A160:P408,16,FALSE),0)","v":43},"EST NORMAL",222,"QUICHE 4 QUEIJOS",null,"QUITUTERIA",null,null,null,null,null,null,null,null,null,null,null,""]
[{"$f":"IFERROR(VLOOKUP(C160,PRODUTOS!A161:P409,16,FALSE),0)","v":1},"EST NORMAL",223,"QUICHE ALHO PORO",null,"QUITUTERIA",null,null,null,null,null,null,null,null,null,null,null,""]
[{"$f":"IFERROR(VLOOKUP(C161,PRODUTOS!A162:P410,16,FALSE),0)","v":16},"EST NORMAL",224,"QUICHE BACALHAU",null,"QUITUTERIA",null,null,null,null,null,null,null,null,null,null,null,""]
[{"$f":"IFERROR(VLOOKUP(C162,PRODUTOS!A163:P411,16,FALSE),0)","v":42},"EST NORMAL",225,"QUICHE FRANGO",null,"QUITUTERIA",null,null,null,null,null,null,null,null,null,null,null,""]
[{"$f":"IFERROR(VLOOKUP(C163,PRODUTOS!A164:P412,16,FALSE),0)","v":0},"EST NORMAL",226,"QUICHE LORRAINE",null,"QUITUTERIA",null,null,null,null,null,null,null,null,null,null,null,""]
[{"$f":"IFERROR(VLOOKUP(C164,PRODUTOS!A165:P413,16,FALSE),0)","v":45.9},"EST NORMAL",227,"QUICHE MARAJOARA",null,"QUITUTERIA",null,null,null,null,null,null,null,null,null,null,null,""]
[{"$f":"IFERROR(VLOOKUP(C165,PRODUTOS!A166:P414,16,FALSE),0)","v":0},"EST NORMAL",228,"QUICHE MARGUERITA",null,"QUITUTERIA",null,null,null,null,null,null,null,null,null,null,null,""]
[{"$f":"IFERROR(VLOOKUP(C166,PRODUTOS!A167:P415,16,FALSE),0)","v":27},"EST NORMAL",229,"QUICHE QUEIJO CUIA",null,"QUITUTERIA",null,null,null,null,null,null,null,null,null,null,null,""]
[{"$f":"IFERROR(VLOOKUP(C167,PRODUTOS!A168:P416,16,FALSE),0)","v":0},"EST NORMAL",230,"QUICHE QUEIJO CUIA/JAMBU",null,"QUITUTERIA",null,null,null,null,null,null,null,null,null,null,null,""]
[{"$f":"IFERROR(VLOOKUP(C168,PRODUTOS!A169:P417,16,FALSE),0)","v":0},"EST NORMAL",231,"QUICHE TOMATE SECO",null,"QUITUTERIA",null,null,null,null,null,null,null,null,null,null,null,""]
[{"$f":"IFERROR(VLOOKUP(C169,PRODUTOS!A170:P418,16,FALSE),0)","v":0},"EST NORMAL",233,"RECHEIO BRANCO",null,"CONFEITARIA DOCE",null,null,null,null,null,null,null,null,null,null,null,""]
[{"$f":"IFERROR(VLOOKUP(C170,PRODUTOS!A171:P419,16,FALSE),0)","v":0},"EST NORMAL",234,"RECHEIO DE CHOCOLATE",null,"CONFEITARIA DOCE",null,null,null,null,null,null,null,null,null,null,null,""]
[{"$f":"IFERROR(VLOOKUP(C171,PRODUTOS!A172:P420,16,FALSE),0)","v":0},"EST NORMAL",242,"RECHEIO NEGÃO",null,"CONFEITARIA DOCE",null,null,null,null,null,null,null,null,null,null,null,""]
[{"$f":"IFERROR(VLOOKUP(C172,PRODUTOS!A173:P421,16,FALSE),0)","v":0},"EST NORMAL",243,"ROSCA DE CHUVA",null,"PADARIA TRADICIONAL",null,null,null,null,null,null,null,null,null,null,null,""]
[{"$f":"IFERROR(VLOOKUP(C173,PRODUTOS!A174:P422,16,FALSE),0)","v":887},"EST NORMAL",244,"ROSQUINHA DE LEITE (PCT C/ 32UND)",null,"PADARIA TRADICIONAL",null,null,null,null,null,null,null,null,null,null,null,""]
[{"$f":"IFERROR(VLOOKUP(C174,PRODUTOS!A175:P423,16,FALSE),0)","v":6},"EST NORMAL",245,"SALGADO ITALIANO FRANGO",null,"PADARIA TRADICIONAL",null,null,null,null,null,null,null,null,null,null,null,""]
[{"$f":"IFERROR(VLOOKUP(C175,PRODUTOS!A176:P424,16,FALSE),0)","v":64},"EST NORMAL",246,"SALGADO ITALIANO MIX FRIOS",null,"PADARIA TRADICIONAL",null,null,null,null,null,null,null,null,null,null,null,""]
[{"$f":"IFERROR(VLOOKUP(C176,PRODUTOS!A177:P425,16,FALSE),0)","v":15},"EST NORMAL",247,"SONHO",null,"PADARIA TRADICIONAL",null,null,null,null,null,null,null,null,null,null,null,""]
[{"$f":"IFERROR(VLOOKUP(C177,PRODUTOS!A178:P426,16,FALSE),0)","v":0},"EST NORMAL",248,"TARTELETES",null,"CONFEITARIA DOCE",null,null,null,null,null,null,null,null,null,null,null,""]
[{"$f":"IFERROR(VLOOKUP(C178,PRODUTOS!A179:P427,16,FALSE),0)","v":0},"EST NORMAL",249,"TORTA ALEMÃ",null,"CONFEITARIA DOCE",null,null,null,null,null,null,null,null,null,null,null,""]
[{"$f":"IFERROR(VLOOKUP(C179,PRODUTOS!A180:P428,16,FALSE),0)","v":0},"EST NORMAL",250,"TORTA BACURI",null,"CONFEITARIA DOCE",null,null,null,null,null,null,null,null,null,null,null,""]
[{"$f":"IFERROR(VLOOKUP(C180,PRODUTOS!A181:P429,16,FALSE),0)","v":0},"EST NORMAL",251,"TORTA BULGARA",null,"CONFEITARIA DOCE",null,null,null,null,null,null,null,null,null,null,null,""]
[{"$f":"IFERROR(VLOOKUP(C181,PRODUTOS!A182:P430,16,FALSE),0)","v":0},"EST NORMAL",252,"TORTA CHEESE CAKE ROMEU JULIETA",null,"CONFEITARIA DOCE",null,null,null,null,null,null,null,null,null,null,null,""]
[{"$f":"IFERROR(VLOOKUP(C182,PRODUTOS!A183:P431,16,FALSE),0)","v":0},"EST NORMAL",253,"TORTA CHEESECAKE FRUTAS VERMELHAS",null,"CONFEITARIA DOCE",null,null,null,null,null,null,null,null,null,null,null,""]
[{"$f":"IFERROR(VLOOKUP(C183,PRODUTOS!A184:P432,16,FALSE),0)","v":0},"EST NORMAL",254,"TORTA CUPUAÇU",null,"CONFEITARIA DOCE",null,null,null,null,null,null,null,null,null,null,null,""]
[{"$f":"IFERROR(VLOOKUP(C184,PRODUTOS!A185:P433,16,FALSE),0)","v":0},"EST NORMAL",255,"TORTA LIMÃO",null,"CONFEITARIA DOCE",null,null,null,null,null,null,null,null,null,null,null,""]
[{"$f":"IFERROR(VLOOKUP(C185,PRODUTOS!A186:P434,16,FALSE),0)","v":0},"EST NORMAL",256,"TORTA MORANGO",null,"CONFEITARIA DOCE",null,null,null,null,null,null,null,null,null,null,null,""]
[{"$f":"IFERROR(VLOOKUP(C186,PRODUTOS!A187:P435,16,FALSE),0)","v":0},"EST NORMAL",257,"TORTA NEGA MALUCA",null,"CONFEITARIA DOCE",null,null,null,null,null,null,null,null,null,null,null,""]
[{"$f":"IFERROR(VLOOKUP(C187,PRODUTOS!A188:P436,16,FALSE),0)","v":0},"EST NORMAL",258,"TORTA RED VELVET",null,"CONFEITARIA DOCE",null,null,null,null,null,null,null,null,null,null,null,""]
[{"$f":"IFERROR(VLOOKUP(C188,PRODUTOS!A189:P437,16,FALSE),0)","v":0},"EST NORMAL",259,"TORTA SUPREMO",null,"CONFEITARIA DOCE",null,null,null,null,null,null,null,null,null,null,null,""]
[{"$f":"IFERROR(VLOOKUP(C189,PRODUTOS!A190:P438,16,FALSE),0)","v":0},"EST NORMAL",260,"TRANÇA DELICIA CALABRESA",null,"FOLHATERIA",null,null,null,null,null,null,null,null,null,null,null,""]
[{"$f":"IFERROR(VLOOKUP(C190,PRODUTOS!A191:P439,16,FALSE),0)","v":0},"EST NORMAL",261,"TRANÇA DELICIA CARNE",null,"FOLHATERIA",null,null,null,null,null,null,null,null,null,null,null,""]
[{"$f":"IFERROR(VLOOKUP(C191,PRODUTOS!A192:P440,16,FALSE),0)","v":0},"EST NORMAL",262,"TRANÇA DELICIA PEITO DEFUMADO",null,"FOLHATERIA",null,null,null,null,null,null,null,null,null,null,null,""]
[{"$f":"IFERROR(VLOOKUP(C192,PRODUTOS!A193:P441,16,FALSE),0)","v":10},"EST NORMAL",263,"TRANÇA FOLHADA BACALHAU",null,"FOLHATERIA",null,null,null,null,null,null,null,null,null,null,null,""]
[{"$f":"IFERROR(VLOOKUP(C193,PRODUTOS!A194:P442,16,FALSE),0)","v":12},"EST NORMAL",264,"TRANÇA FOLHADA CALABRESA",null,"FOLHATERIA",null,null,null,null,null,null,null,null,null,null,null,""]
[{"$f":"IFERROR(VLOOKUP(C194,PRODUTOS!A195:P443,16,FALSE),0)","v":0},{"$f":"IFERROR(IF(A194<G194,\"PRODUZIR!\"&\" \"&A194-G194&\" \"&\"A MENOR\",\"EST NORMAL\"),\"\")","v":"EST NORMAL"},265,"TRANÇA FOLHADA FILÉ",null,"FOLHATERIA",null,null,null,null,null,null,null,null,null,null,null,{"$f":"IFERROR(AVERAGE(H194:Q194),\"\")","v":""}]
[{"$f":"IFERROR(VLOOKUP(C195,PRODUTOS!A196:P444,16,FALSE),0)","v":9},"EST NORMAL",266,"TRANÇA FOLHADA FRANGO/JAMBU",null,"FOLHATERIA",null,null,null,null,null,null,null,null,null,null,null,""]
[{"$f":"IFERROR(VLOOKUP(C196,PRODUTOS!A197:P445,16,FALSE),0)","v":6},"EST NORMAL",267,"TRANÇA FOLHADA MISTA",null,"FOLHATERIA",null,null,null,null,null,null,null,null,null,null,null,""]
[{"$f":"IFERROR(VLOOKUP(C197,PRODUTOS!A198:P446,16,FALSE),0)","v":14},"EST NORMAL",268,"TRANÇA FOLHADA MORTADELA DEFUMADA",null,"FOLHATERIA",null,null,null,null,null,null,null,null,null,null,null,""]
[{"$f":"IFERROR(VLOOKUP(C198,PRODUTOS!A199:P447,16,FALSE),0)","v":12},"EST NORMAL",269,"TRANÇA FOLHADA PEITO DEFUMADO",null,"FOLHATERIA",null,null,null,null,null,null,null,null,null,null,null,""]
[{"$f":"IFERROR(VLOOKUP(C199,PRODUTOS!A200:P448,16,FALSE),0)","v":13},"EST NORMAL",270,"TRANÇA FOLHADA PERNIL",null,"FOLHATERIA",null,null,null,null,null,null,null,null,null,null,null,""]
[{"$f":"IFERROR(VLOOKUP(C200,PRODUTOS!A201:P449,16,FALSE),0)","v":4},"EST NORMAL",271,"TRANÇA FOLHADA PERU/JAMBU",null,"FOLHATERIA",null,null,null,null,null,null,null,null,null,null,null,""]
[{"$f":"IFERROR(VLOOKUP(C201,PRODUTOS!A202:P450,16,FALSE),0)","v":0},"EST NORMAL",272,"TRANÇA FOLHADA SALAME",null,"FOLHATERIA",null,null,null,null,null,null,null,null,null,null,null,""]
[{"$f":"IFERROR(VLOOKUP(C202,PRODUTOS!A203:P451,16,FALSE),0)","v":45},"EST NORMAL",273,"PÃO BENGALA 5 HORAS",null,"PADARIA TRADICIONAL",null,null,null,null,null,null,null,null,null,null,null,""]
[{"$f":"IFERROR(VLOOKUP(C203,PRODUTOS!A204:P452,16,FALSE),0)","v":0},"EST NORMAL",274,"TRANÇA FOLHADA MIX DE FRIOS",null,"FOLHATERIA",null,null,null,null,null,null,null,null,null,null,null,""]
[{"$f":"IFERROR(VLOOKUP(C204,PRODUTOS!A205:P453,16,FALSE),0)","v":0},"EST NORMAL",275,"TRANÇA FOLHADA CHAPA MISTA",null,"FOLHATERIA",null,null,null,null,null,null,null,null,null,null,null,""]
[{"$f":"IFERROR(VLOOKUP(C205,PRODUTOS!A206:P454,16,FALSE),0)","v":0},"EST NORMAL",276,"TRANÇA FOLHADA FRANGO",null,"FOLHATERIA",null,null,null,null,null,null,null,null,null,null,null,""]
[{"$f":"IFERROR(VLOOKUP(C206,PRODUTOS!A207:P455,16,FALSE),0)","v":0},"EST NORMAL",277,"TRANÇA FOLHADA FRANGO/BACON",null,"FOLHATERIA",null,null,null,null,null,null,null,null,null,null,null,""]
[{"$f":"IFERROR(VLOOKUP(C207,PRODUTOS!A208:P456,16,FALSE),0)","v":0},"EST NORMAL",null,null,null,null,null,null,null,null,null,null,null,null,null,null,null,""]
[{"$f":"IFERROR(VLOOKUP(C208,PRODUTOS!A209:P457,16,FALSE),0)","v":0},"EST NORMAL",null,null,null,null,null,null,null,null,null,null,null,null,null,null,null,""]
[{"$f":"IFERROR(VLOOKUP(C209,PRODUTOS!A210:P458,16,FALSE),0)","v":0},"EST NORMAL",null,null,null,null,null,null,null,null,null,null,null,null,null,null,null,""]
[{"$f":"IFERROR(VLOOKUP(C210,PRODUTOS!A211:P459,16,FALSE),0)","v":0},"EST NORMAL",null,null,null,null,null,null,null,null,null,null,null,null,null,null,null,""]
[{"$f":"IFERROR(VLOOKUP(C211,PRODUTOS!A212:P460,16,FALSE),0)","v":0},"EST NORMAL",null,null,null,null,null,null,null,null,null,null,null,null,null,null,null,""]
[{"$f":"IFERROR(VLOOKUP(C212,PRODUTOS!A213:P461,16,FALSE),0)","v":0},"EST NORMAL",null,null,null,null,null,null,null,null,null,null,null,null,null,null,null,""]
[{"$f":"IFERROR(VLOOKUP(C213,PRODUTOS!A214:P462,16,FALSE),0)","v":0},"EST NORMAL",null,null,null,null,null,null,null,null,null,null,null,null,null,null,null,""]
[{"$f":"IFERROR(VLOOKUP(C214,PRODUTOS!A215:P463,16,FALSE),0)","v":0},"EST NORMAL",null,null,null,null,null,null,null,null,null,null,null,null,null,null,null,""]
[{"$f":"IFERROR(VLOOKUP(C215,PRODUTOS!A216:P464,16,FALSE),0)","v":0},"EST NORMAL",null,null,null,null,null,null,null,null,null,null,null,null,null,null,null,""]
[{"$f":"IFERROR(VLOOKUP(C216,PRODUTOS!A217:P465,16,FALSE),0)","v":0},"EST NORMAL",null,null,null,null,null,null,null,null,null,null,null,null,null,null,null,""]
[{"$f":"IFERROR(VLOOKUP(C217,PRODUTOS!A218:P466,16,FALSE),0)","v":0},"EST NORMAL",null,null,null,null,null,null,null,null,null,null,null,null,null,null,null,""]
[{"$f":"IFERROR(VLOOKUP(C218,PRODUTOS!A219:P467,16,FALSE),0)","v":0},"EST NORMAL",null,null,null,null,null,null,null,null,null,null,null,null,null,null,null,""]
[{"$f":"IFERROR(VLOOKUP(C219,PRODUTOS!A220:P468,16,FALSE),0)","v":0},"EST NORMAL",null,null,null,null,null,null,null,null,null,null,null,null,null,null,null,""]
[{"$f":"IFERROR(VLOOKUP(C220,PRODUTOS!A221:P469,16,FALSE),0)","v":0},"EST NORMAL",null,null,null,null,null,null,null,null,null,null,null,null,null,null,null,""]
[{"$f":"IFERROR(VLOOKUP(C221,PRODUTOS!A222:P470,16,FALSE),0)","v":0},"EST NORMAL",null,null,null,null,null,null,null,null,null,null,null,null,null,null,null,""]
[{"$f":"IFERROR(VLOOKUP(C222,PRODUTOS!A223:P471,16,FALSE),0)","v":0},"EST NORMAL",null,null,null,null,null,null,null,null,null,null,null,null,null,null,null,""]
[{"$f":"IFERROR(VLOOKUP(C223,PRODUTOS!A224:P472,16,FALSE),0)","v":0},"EST NORMAL",null,null,null,null,null,null,null,null,null,null,null,null,null,null,null,""]
[{"$f":"IFERROR(VLOOKUP(C224,PRODUTOS!A225:P473,16,FALSE),0)","v":0},"EST NORMAL",null,null,null,null,null,null,null,null,null,null,null,null,null,null,null,""]
[{"$f":"IFERROR(VLOOKUP(C225,PRODUTOS!A226:P474,16,FALSE),0)","v":0},"EST NORMAL",null,null,null,null,null,null,null,null,null,null,null,null,null,null,null,""]
[{"$f":"IFERROR(VLOOKUP(C226,PRODUTOS!A227:P475,16,FALSE),0)","v":0},"EST NORMAL",null,null,null,null,null,null,null,null,null,null,null,null,null,null,null,""]
[{"$f":"IFERROR(VLOOKUP(C227,PRODUTOS!A228:P476,16,FALSE),0)","v":0},"EST NORMAL",null,null,null,null,null,null,null,null,null,null,null,null,null,null,null,""]
[{"$f":"IFERROR(VLOOKUP(C228,PRODUTOS!A229:P477,16,FALSE),0)","v":0},"EST NORMAL",null,null,null,null,null,null,null,null,null,null,null,null,null,null,null,""]
[{"$f":"IFERROR(VLOOKUP(C229,PRODUTOS!A230:P478,16,FALSE),0)","v":0},"EST NORMAL",null,null,null,null,null,null,null,null,null,null,null,null,null,null,null,""]
[{"$f":"IFERROR(VLOOKUP(C230,PRODUTOS!A231:P479,16,FALSE),0)","v":0},"EST NORMAL",null,null,null,null,null,null,null,null,null,null,null,null,null,null,null,""]
[{"$f":"IFERROR(VLOOKUP(C231,PRODUTOS!A232:P480,16,FALSE),0)","v":0},"EST NORMAL",null,null,null,null,null,null,null,null,null,null,null,null,null,null,null,""]
[{"$f":"IFERROR(VLOOKUP(C232,PRODUTOS!A233:P481,16,FALSE),0)","v":0},"EST NORMAL",null,null,null,null,null,null,null,null,null,null,null,null,null,null,null,""]
[{"$f":"IFERROR(VLOOKUP(C233,PRODUTOS!A234:P482,16,FALSE),0)","v":0},"EST NORMAL",null,null,null,null,null,null,null,null,null,null,null,null,null,null,null,""]
[{"$f":"IFERROR(VLOOKUP(C234,PRODUTOS!A235:P483,16,FALSE),0)","v":0},"EST NORMAL",null,null,null,null,null,null,null,null,null,null,null,null,null,null,null,""]
[{"$f":"IFERROR(VLOOKUP(C235,PRODUTOS!A236:P484,16,FALSE),0)","v":0},"EST NORMAL",null,null,null,null,null,null,null,null,null,null,null,null,null,null,null,""]
[{"$f":"IFERROR(VLOOKUP(C236,PRODUTOS!A237:P485,16,FALSE),0)","v":0},"EST NORMAL",null,null,null,null,null,null,null,null,null,null,null,null,null,null,null,""]
[{"$f":"IFERROR(VLOOKUP(C237,PRODUTOS!A238:P486,16,FALSE),0)","v":0},"EST NORMAL",null,null,null,null,null,null,null,null,null,null,null,null,null,null,null,""]
[{"$f":"IFERROR(VLOOKUP(C238,PRODUTOS!A239:P487,16,FALSE),0)","v":0},"EST NORMAL",null,null,null,null,null,null,null,null,null,null,null,null,null,null,null,""]
[{"$f":"IFERROR(VLOOKUP(C239,PRODUTOS!A240:P488,16,FALSE),0)","v":0},"EST NORMAL",null,null,null,null,null,null,null,null,null,null,null,null,null,null,null,""]
[{"$f":"IFERROR(VLOOKUP(C240,PRODUTOS!A241:P489,16,FALSE),0)","v":0},"EST NORMAL",null,null,null,null,null,null,null,null,null,null,null,null,null,null,null,""]
[{"$f":"IFERROR(VLOOKUP(C241,PRODUTOS!A242:P490,16,FALSE),0)","v":0},"EST NORMAL",null,null,null,null,null,null,null,null,null,null,null,null,null,null,null,""]
[{"$f":"IFERROR(VLOOKUP(C242,PRODUTOS!A243:P491,16,FALSE),0)","v":0},"EST NORMAL",null,null,null,null,null,null,null,null,null,null,null,null,null,null,null,""]
[{"$f":"IFERROR(VLOOKUP(C243,PRODUTOS!A244:P492,16,FALSE),0)","v":0},"EST NORMAL",null,null,null,null,null,null,null,null,null,null,null,null,null,null,null,""]
[{"$f":"IFERROR(VLOOKUP(C244,PRODUTOS!A245:P493,16,FALSE),0)","v":0},"EST NORMAL",null,null,null,null,null,null,null,null,null,null,null,null,null,null,null,""]
[{"$f":"IFERROR(VLOOKUP(C245,PRODUTOS!A246:P494,16,FALSE),0)","v":0},"EST NORMAL",null,null,null,null,null,null,null,null,null,null,null,null,null,null,null,""]
[{"$f":"IFERROR(VLOOKUP(C246,PRODUTOS!A247:P495,16,FALSE),0)","v":0},"EST NORMAL",null,null,null,null,null,null,null,null,null,null,null,null,null,null,null,""]
[{"$f":"IFERROR(VLOOKUP(C247,PRODUTOS!A248:P496,16,FALSE),0)","v":0},"EST NORMAL",null,null,null,null,null,null,null,null,null,null,null,null,null,null,null,""]
[{"$f":"IFERROR(VLOOKUP(C248,PRODUTOS!A249:P497,16,FALSE),0)","v":0},"EST NORMAL",null,null,null,null,null,null,null,null,null,null,null,null,null,null,null,""]

{"sheet":"PRODUTOS","index":1,"n_rows":250,"n_cols":23,"rows_kept":250,"cut":false,"hidden":false,"merged":[]}
[null,"Estoque Geral     Produto Acabado"]
["CÓD","DESCRIÇÃO","MEDIDA","SETOR","CUSTO    R$",null,"SALDO INICIAL","CUSTO    R$",null,"ENTRADA","CUSTO    R$",null,"SAÍDAS","CUSTO    R$",null,"SALDO","CUSTO    R$",null,"INVENTÁRIO","CUSTO    R$",null,"AJUSTE","CUSTO    R$"]
[2,{"$f":"IF(A3=\"\",\"\",IFERROR(VLOOKUP(A3,CADASTRO!C:F,2,FALSE),\"\"))","v":"FORMA DE EMPADA"},{"$f":"IFERROR(VLOOKUP(A3,CADASTRO!C:F,3,FALSE),\"\")","v":"UND"},{"$f":"IFERROR(VLOOKUP(A3,CADASTRO!C:F,4,0),\"\")","v":"PADARIA TRADICIONAL"},{"$f":"IFERROR(VLOOKUP(A3,CADASTRO!C:R,16,0),\"\")","v":5},null,null,0,null,{"$f":"SUMIF(ENTRADAS!A:E,A3,ENTRADAS!E:E)","v":205},{"$f":"IFERROR(J3*$E3,\"\")","v":1025},null,{"$f":"SUMIF(SAÍDAS!A:E,PRODUTOS!A3,SAÍDAS!E:E)","v":205},{"$f":"IFERROR(M3*$E3,\"\")","v":1025},null,{"$f":"G3+J3-M3","v":0},{"$f":"IFERROR(P3*$E3,\"\")","v":0},null,{"$f":"P3","v":0},{"$f":"IFERROR(S3*$E3,\"\")","v":0},null,{"$f":"S3-P3","v":0},{"$f":"IFERROR(V3*$E3,\"\")","v":0}]
[3,{"$f":"IF(A4=\"\",\"\",IFERROR(VLOOKUP(A4,CADASTRO!C:F,2,FALSE),\"\"))","v":"ARO DE QUICHE"},{"$f":"IFERROR(VLOOKUP(A4,CADASTRO!C:F,3,FALSE),\"\")","v":"UND"},{"$f":"IFERROR(VLOOKUP(A4,CADASTRO!C:F,4,0),\"\")","v":"PADARIA TRADICIONAL"},{"$f":"IFERROR(VLOOKUP(A4,CADASTRO!C:R,16,0),\"\")","v":""},null,null,0,null,{"$f":"SUMIF(ENTRADAS!A:E,A4,ENTRADAS!E:E)","v":0},{"$f":"IFERROR(J4*$E4,\"\")","v":""},null,{"$f":"SUMIF(SAÍDAS!A:E,PRODUTOS!A4,SAÍDAS!E:E)","v":0},{"$f":"IFERROR(M4*$E4,\"\")","v":""},null,{"$f":"G4+J4-M4","v":0},{"$f":"IFERROR(P4*$E4,\"\")","v":""},null,{"$f":"P4","v":0},{"$f":"IFERROR(S4*$E4,\"\")","v":""},null,{"$f":"S4-P4","v":0},{"$f":"IFERROR(V4*$E4,\"\")","v":""}]
[8,{"$f":"IF(A5=\"\",\"\",IFERROR(VLOOKUP(A5,CADASTRO!C:F,2,FALSE),\"\"))","v":"BAGUETE INTEGRAL (PCT C/ 45 UND = 3 KG)"},{"$f":"IFERROR(VLOOKUP(A5,CADASTRO!C:F,3,FALSE),\"\")","v":0},{"$f":"IFERROR(VLOOKUP(A5,CADASTRO!C:F,4,0),\"\")","v":"PADARIA TRADICIONAL"},{"$f":"IFERROR(VLOOKUP(A5,CADASTRO!C:R,16,0),\"\")","v":""},null,1,0,null,{"$f":"SUMIF(ENTRADAS!A:E,A5,ENTRADAS!E:E)","v":12},"",null,{"$f":"SUMIF(SAÍDAS!A:E,PRODUTOS!A5,SAÍDAS!E:E)","v":9},"",null,4,"",null,4,"",null,0,""]
[9,{"$f":"IF(A6=\"\",\"\",IFERROR(VLOOKUP(A6,CADASTRO!C:F,2,FALSE),\"\"))","v":"BAILERINE"},{"$f":"IFERROR(VLOOKUP(A6,CADASTRO!C:F,3,FALSE),\"\")","v":0},{"$f":"IFERROR(VLOOKUP(A6,CADASTRO!C:F,4,0),\"\")","v":"CONFEITARIA DOCE"},{"$f":"IFERROR(VLOOKUP(A6,CADASTRO!C:R,16,0),\"\")","v":""},null,null,null,null,{"$f":"SUMIF(ENTRADAS!A:E,A6,ENTRADAS!E:E)","v":0},"",null,{"$f":"SUMIF(SAÍDAS!A:E,PRODUTOS!A6,SAÍDAS!E:E)","v":0},"",null,0,"",null,0,"",null,0,""]
[11,{"$f":"IF(A7=\"\",\"\",IFERROR(VLOOKUP(A7,CADASTRO!C:F,2,FALSE),\"\"))","v":"BISCOITO ACEBOLADO"},{"$f":"IFERROR(VLOOKUP(A7,CADASTRO!C:F,3,FALSE),\"\")","v":0},{"$f":"IFERROR(VLOOKUP(A7,CADASTRO!C:F,4,0),\"\")","v":"PADARIA TRADICIONAL"},{"$f":"IFERROR(VLOOKUP(A7,CADASTRO!C:R,16,0),\"\")","v":""},null,null,null,null,{"$f":"SUMIF(ENTRADAS!A:E,A7,ENTRADAS!E:E)","v":9.5500000000000007},"",null,{"$f":"SUMIF(SAÍDAS!A:E,PRODUTOS!A7,SAÍDAS!E:E)","v":8.5500000000000007},"",null,1,"",null,1,"",null,0,""]
[12,{"$f":"IF(A8=\"\",\"\",IFERROR(VLOOKUP(A8,CADASTRO!C:F,2,FALSE),\"\"))","v":"BISCOITO CASTANHA"},{"$f":"IFERROR(VLOOKUP(A8,CADASTRO!C:F,3,FALSE),\"\")","v":0},{"$f":"IFERROR(VLOOKUP(A8,CADASTRO!C:F,4,0),\"\")","v":"PADARIA TRADICIONAL"},{"$f":"IFERROR(VLOOKUP(A8,CADASTRO!C:R,16,0),\"\")","v":""},null,5,null,null,{"$f":"SUMIF(ENTRADAS!A:E,A8,ENTRADAS!E:E)","v":0},"",null,{"$f":"SUMIF(SAÍDAS!A:E,PRODUTOS!A8,SAÍDAS!E:E)","v":5},"",null,0,"",null,0,"",null,0,""]
[13,{"$f":"IF(A9=\"\",\"\",IFERROR(VLOOKUP(A9,CADASTRO!C:F,2,FALSE),\"\"))","v":"BISCOITO CATUPIRI"},{"$f":"IFERROR(VLOOKUP(A9,CADASTRO!C:F,3,FALSE),\"\")","v":0},{"$f":"IFERROR(VLOOKUP(A9,CADASTRO!C:F,4,0),\"\")","v":"PADARIA TRADICIONAL"},{"$f":"IFERROR(VLOOKUP(A9,CADASTRO!C:R,16,0),\"\")","v":""},null,1,null,null,{"$f":"SUMIF(ENTRADAS!A:E,A9,ENTRADAS!E:E)","v":9.57},"",null,{"$f":"SUMIF(SAÍDAS!A:E,PRODUTOS!A9,SAÍDAS!E:E)","v":4},"",null,6.57,"",null,6.57,"",null,0,""]
[14,{"$f":"IF(A10=\"\",\"\",IFERROR(VLOOKUP(A10,CADASTRO!C:F,2,FALSE),\"\"))","v":"BISCOITO COCO"},{"$f":"IFERROR(VLOOKUP(A10,CADASTRO!C:F,3,FALSE),\"\")","v":0},{"$f":"IFERROR(VLOOKUP(A10,CADASTRO!C:F,4,0),\"\")","v":"PADARIA TRADICIONAL"},{"$f":"IFERROR(VLOOKUP(A10,CADASTRO!C:R,16,0),\"\")","v":""},null,3,null,null,{"$f":"SUMIF(ENTRADAS!A:E,A10,ENTRADAS!E:E)","v":11.25},"",null,{"$f":"SUMIF(SAÍDAS!A:E,PRODUTOS!A10,SAÍDAS!E:E)","v":13.25},"",null,1,"",null,1,"",null,0,""]
[15,{"$f":"IF(A11=\"\",\"\",IFERROR(VLOOKUP(A11,CADASTRO!C:F,2,FALSE),\"\"))","v":"BISCOITO DE BOLO"},{"$f":"IFERROR(VLOOKUP(A11,CADASTRO!C:F,3,FALSE),\"\")","v":0},{"$f":"IFERROR(VLOOKUP(A11,CADASTRO!C:F,4,0),\"\")","v":"PADARIA TRADICIONAL"},{"$f":"IFERROR(VLOOKUP(A11,CADASTRO!C:R,16,0),\"\")","v":""},null,null,null,null,{"$f":"SUMIF(ENTRADAS!A:E,A11,ENTRADAS!E:E)","v":0},"",null,{"$f":"SUMIF(SAÍDAS!A:E,PRODUTOS!A11,SAÍDAS!E:E)","v":0},"",null,0,"",null,0,"",null,0,""]
[16,{"$f":"IF(A12=\"\",\"\",IFERROR(VLOOKUP(A12,CADASTRO!C:F,2,FALSE),\"\"))","v":"BISCOITO MAISENA"},{"$f":"IFERROR(VLOOKUP(A12,CADASTRO!C:F,3,FALSE),\"\")","v":0},{"$f":"IFERROR(VLOOKUP(A12,CADASTRO!C:F,4,0),\"\")","v":"PADARIA TRADICIONAL"},{"$f":"IFERROR(VLOOKUP(A12,CADASTRO!C:R,16,0),\"\")","v":""},null,2,null,null,{"$f":"SUMIF(ENTRADAS!A:E,A12,ENTRADAS!E:E)","v":0},"",null,{"$f":"SUMIF(SAÍDAS!A:E,PRODUTOS!A12,SAÍDAS!E:E)","v":2},"",null,0,"",null,0,"",null,0,""]
[17,{"$f":"IF(A13=\"\",\"\",IFERROR(VLOOKUP(A13,CADASTRO!C:F,2,FALSE),\"\"))","v":"BISCOITO MONTEIRO LOPES"},{"$f":"IFERROR(VLOOKUP(A13,CADASTRO!C:F,3,FALSE),\"\")","v":0},{"$f":"IFERROR(VLOOKUP(A13,CADASTRO!C:F,4,0),\"\")","v":"PADARIA TRADICIONAL"},{"$f":"IFERROR(VLOOKUP(A13,CADASTRO!C:R,16,0),\"\")","v":""},null,8,null,null,{"$f":"SUMIF(ENTRADAS!A:E,A13,ENTRADAS!E:E)","v":37.730000000000004},"",null,{"$f":"SUMIF(SAÍDAS!A:E,PRODUTOS!A13,SAÍDAS!E:E)","v":34.730000000000004},"",null,11,"",null,11,"",null,0,""]
[18,{"$f":"IF(A14=\"\",\"\",IFERROR(VLOOKUP(A14,CADASTRO!C:F,2,FALSE),\"\"))","v":"BISCOITO OLHO DE BOI"},{"$f":"IFERROR(VLOOKUP(A14,CADASTRO!C:F,3,FALSE),\"\")","v":0},{"$f":"IFERROR(VLOOKUP(A14,CADASTRO!C:F,4,0),\"\")","v":"PADARIA TRADICIONAL"},{"$f":"IFERROR(VLOOKUP(A14,CADASTRO!C:R,16,0),\"\")","v":""},null,5,null,null,{"$f":"SUMIF(ENTRADAS!A:E,A14,ENTRADAS!E:E)","v":0},"",null,{"$f":"SUMIF(SAÍDAS!A:E,PRODUTOS!A14,SAÍDAS!E:E)","v":5},"",null,0,"",null,0,"",null,0,""]
[19,{"$f":"IF(A15=\"\",\"\",IFERROR(VLOOKUP(A15,CADASTRO!C:F,2,FALSE),\"\"))","v":"BISCOITO PAI D'ÉGUA"},{"$f":"IFERROR(VLOOKUP(A15,CADASTRO!C:F,3,FALSE),\"\")","v":0},{"$f":"IFERROR(VLOOKUP(A15,CADASTRO!C:F,4,0),\"\")","v":"PADARIA TRADICIONAL"},{"$f":"IFERROR(VLOOKUP(A15,CADASTRO!C:R,16,0),\"\")","v":""},null,1,null,null,{"$f":"SUMIF(ENTRADAS!A:E,A15,ENTRADAS!E:E)","v":11.35},"",null,{"$f":"SUMIF(SAÍDAS!A:E,PRODUTOS!A15,SAÍDAS!E:E)","v":7.35},"",null,5,"",null,5,"",null,0,""]
[20,{"$f":"IF(A16=\"\",\"\",IFERROR(VLOOKUP(A16,CADASTRO!C:F,2,FALSE),\"\"))","v":"BOLO CASEIRO "},{"$f":"IFERROR(VLOOKUP(A16,CADASTRO!C:F,3,FALSE),\"\")","v":0},{"$f":"IFERROR(VLOOKUP(A16,CADASTRO!C:F,4,0),\"\")","v":"CONFEITARIA DOCE"},{"$f":"IFERROR(VLOOKUP(A16,CADASTRO!C:R,16,0),\"\")","v":""},null,null,null,null,{"$f":"SUMIF(ENTRADAS!A:E,A16,ENTRADAS!E:E)","v":0},"",null,{"$f":"SUMIF(SAÍDAS!A:E,PRODUTOS!A16,SAÍDAS!E:E)","v":0},"",null,0,"",null,0,"",null,0,""]
[21,{"$f":"IF(A17=\"\",\"\",IFERROR(VLOOKUP(A17,CADASTRO!C:F,2,FALSE),\"\"))","v":"BOLO MILHO CREMOSO G50"},{"$f":"IFERROR(VLOOKUP(A17,CADASTRO!C:F,3,FALSE),\"\")","v":0},{"$f":"IFERROR(VLOOKUP(A17,CADASTRO!C:F,4,0),\"\")","v":"CONFEITARIA DOCE"},{"$f":"IFERROR(VLOOKUP(A17,CADASTRO!C:R,16,0),\"\")","v":""},null,null,null,null,{"$f":"SUMIF(ENTRADAS!A:E,A17,ENTRADAS!E:E)","v":0},"",null,{"$f":"SUMIF(SAÍDAS!A:E,PRODUTOS!A17,SAÍDAS!E:E)","v":0},"",null,0,"",null,0,"",null,0,""]
[26,{"$f":"IF(A18=\"\",\"\",IFERROR(VLOOKUP(A18,CADASTRO!C:F,2,FALSE),\"\"))","v":"CARRET"},{"$f":"IFERROR(VLOOKUP(A18,CADASTRO!C:F,3,FALSE),\"\")","v":0},{"$f":"IFERROR(VLOOKUP(A18,CADASTRO!C:F,4,0),\"\")","v":"FOLHATERIA"},{"$f":"IFERROR(VLOOKUP(A18,CADASTRO!C:R,16,0),\"\")","v":""},null,38,null,null,{"$f":"SUMIF(ENTRADAS!A:E,A18,ENTRADAS!E:E)","v":220},"",null,{"$f":"SUMIF(SAÍDAS!A:E,PRODUTOS!A18,SAÍDAS!E:E)","v":85},"",null,173,"",null,173,"",null,0,""]
[27,{"$f":"IF(A19=\"\",\"\",IFERROR(VLOOKUP(A19,CADASTRO!C:F,2,FALSE),\"\"))","v":"CASADINHO G50"},{"$f":"IFERROR(VLOOKUP(A19,CADASTRO!C:F,3,FALSE),\"\")","v":0},{"$f":"IFERROR(VLOOKUP(A19,CADASTRO!C:F,4,0),\"\")","v":"CONFEITARIA DOCE"},{"$f":"IFERROR(VLOOKUP(A19,CADASTRO!C:R,16,0),\"\")","v":""},null,null,null,null,{"$f":"SUMIF(ENTRADAS!A:E,A19,ENTRADAS!E:E)","v":0},"",null,{"$f":"SUMIF(SAÍDAS!A:E,PRODUTOS!A19,SAÍDAS!E:E)","v":0},"",null,0,"",null,0,"",null,0,""]
[28,{"$f":"IF(A20=\"\",\"\",IFERROR(VLOOKUP(A20,CADASTRO!C:F,2,FALSE),\"\"))","v":"CATARINA DE BACALHAU "},{"$f":"IFERROR(VLOOKUP(A20,CADASTRO!C:F,3,FALSE),\"\")","v":0},{"$f":"IFERROR(VLOOKUP(A20,CADASTRO!C:F,4,0),\"\")","v":"FOLHATERIA"},{"$f":"IFERROR(VLOOKUP(A20,CADASTRO!C:R,16,0),\"\")","v":""},null,null,null,null,{"$f":"SUMIF(ENTRADAS!A:E,A20,ENTRADAS!E:E)","v":24},"",null,{"$f":"SUMIF(SAÍDAS!A:E,PRODUTOS!A20,SAÍDAS!E:E)","v":21},"",null,3,"",null,3,"",null,0,""]
[29,{"$f":"IF(A21=\"\",\"\",IFERROR(VLOOKUP(A21,CADASTRO!C:F,2,FALSE),\"\"))","v":"CATARINA DE FRANGO"},{"$f":"IFERROR(VLOOKUP(A21,CADASTRO!C:F,3,FALSE),\"\")","v":0},{"$f":"IFERROR(VLOOKUP(A21,CADASTRO!C:F,4,0),\"\")","v":"FOLHATERIA"},{"$f":"IFERROR(VLOOKUP(A21,CADASTRO!C:R,16,0),\"\")","v":""},null,null,null,null,{"$f":"SUMIF(ENTRADAS!A:E,A21,ENTRADAS!E:E)","v":24},"",null,{"$f":"SUMIF(SAÍDAS!A:E,PRODUTOS!A21,SAÍDAS!E:E)","v":22},"",null,2,"",null,2,"",null,0,""]
[31,{"$f":"IF(A22=\"\",\"\",IFERROR(VLOOKUP(A22,CADASTRO!C:F,2,FALSE),\"\"))","v":"CHOCOMOUSSE G50"},{"$f":"IFERROR(VLOOKUP(A22,CADASTRO!C:F,3,FALSE),\"\")","v":0},{"$f":"IFERROR(VLOOKUP(A22,CADASTRO!C:F,4,0),\"\")","v":"CONFEITARIA DOCE"},{"$f":"IFERROR(VLOOKUP(A22,CADASTRO!C:R,16,0),\"\")","v":""},null,null,null,null,{"$f":"SUMIF(ENTRADAS!A:E,A22,ENTRADAS!E:E)","v":0},"",null,{"$f":"SUMIF(SAÍDAS!A:E,PRODUTOS!A22,SAÍDAS!E:E)","v":0},"",null,0,"",null,0,"",null,0,""]
[32,{"$f":"IF(A23=\"\",\"\",IFERROR(VLOOKUP(A23,CADASTRO!C:F,2,FALSE),\"\"))","v":"CIABATTA P/ SANDUÍCHES"},{"$f":"IFERROR(VLOOKUP(A23,CADASTRO!C:F,3,FALSE),\"\")","v":0},{"$f":"IFERROR(VLOOKUP(A23,CADASTRO!C:F,4,0),\"\")","v":"PADARIA RÚSTICA"},{"$f":"IFERROR(VLOOKUP(A23,CADASTRO!C:R,16,0),\"\")","v":""},null,null,null,null,{"$f":"SUMIF(ENTRADAS!A:E,A23,ENTRADAS!E:E)","v":0},"",null,{"$f":"SUMIF(SAÍDAS!A:E,PRODUTOS!A23,SAÍDAS!E:E)","v":0},"",null,0,"",null,0,"",null,0,""]
[34,{"$f":"IF(A24=\"\",\"\",IFERROR(VLOOKUP(A24,CADASTRO!C:F,2,FALSE),\"\"))","v":"PÃO BENGALA 18H"},{"$f":"IFERROR(VLOOKUP(A24,CADASTRO!C:F,3,FALSE),\"\")","v":0},{"$f":"IFERROR(VLOOKUP(A24,CADASTRO!C:F,4,0),\"\")","v":"PADARIA TRADICIONAL"},{"$f":"IFERROR(VLOOKUP(A24,CADASTRO!C:R,16,0),\"\")","v":""},null,null,null,null,{"$f":"SUMIF(ENTRADAS!A:E,A24,ENTRADAS!E:E)","v":0},"",null,{"$f":"SUMIF(SAÍDAS!A:E,PRODUTOS!A24,SAÍDAS!E:E)","v":0},"",null,0,"",null,0,"",null,0,""]
[39,{"$f":"IF(A25=\"\",\"\",IFERROR(VLOOKUP(A25,CADASTRO!C:F,2,FALSE),\"\"))","v":"CROISSANT AMÊNDOAS"},{"$f":"IFERROR(VLOOKUP(A25,CADASTRO!C:F,3,FALSE),\"\")","v":0},{"$f":"IFERROR(VLOOKUP(A25,CADASTRO!C:F,4,0),\"\")","v":"PADARIA TRADICIONAL"},{"$f":"IFERROR(VLOOKUP(A25,CADASTRO!C:R,16,0),\"\")","v":""},null,53,null,null,{"$f":"SUMIF(ENTRADAS!A:E,A25,ENTRADAS!E:E)","v":122},"",null,{"$f":"SUMIF(SAÍDAS!A:E,PRODUTOS!A25,SAÍDAS!E:E)","v":153},"",null,22,"",null,22,"",null,0,""]
[40,{"$f":"IF(A26=\"\",\"\",IFERROR(VLOOKUP(A26,CADASTRO!C:F,2,FALSE),\"\"))","v":"PÃO BAGUETE 05H"},{"$f":"IFERROR(VLOOKUP(A26,CADASTRO!C:F,3,FALSE),\"\")","v":0},{"$f":"IFERROR(VLOOKUP(A26,CADASTRO!C:F,4,0),\"\")","v":"PADARIA TRADICIONAL"},{"$f":"IFERROR(VLOOKUP(A26,CADASTRO!C:R,16,0),\"\")","v":""},null,null,null,null,{"$f":"SUMIF(ENTRADAS!A:E,A26,ENTRADAS!E:E)","v":0},"",null,{"$f":"SUMIF(SAÍDAS!A:E,PRODUTOS!A26,SAÍDAS!E:E)","v":0},"",null,0,"",null,0,"",null,0,""]
[41,{"$f":"IF(A27=\"\",\"\",IFERROR(VLOOKUP(A27,CADASTRO!C:F,2,FALSE),\"\"))","v":"CROISSANT CONGELADO "},{"$f":"IFERROR(VLOOKUP(A27,CADASTRO!C:F,3,FALSE),\"\")","v":0},{"$f":"IFERROR(VLOOKUP(A27,CADASTRO!C:F,4,0),\"\")","v":"PADARIA TRADICIONAL"},{"$f":"IFERROR(VLOOKUP(A27,CADASTRO!C:R,16,0),\"\")","v":""},null,465,null,null,{"$f":"SUMIF(ENTRADAS!A:E,A27,ENTRADAS!E:E)","v":3018},"",null,{"$f":"SUMIF(SAÍDAS!A:E,PRODUTOS!A27,SAÍDAS!E:E)","v":3293},"",null,190,"",null,190,"",null,0,""]
[42,{"$f":"IF(A28=\"\",\"\",IFERROR(VLOOKUP(A28,CADASTRO!C:F,2,FALSE),\"\"))","v":"CROQUE MONSIER"},{"$f":"IFERROR(VLOOKUP(A28,CADASTRO!C:F,3,FALSE),\"\")","v":0},{"$f":"IFERROR(VLOOKUP(A28,CADASTRO!C:F,4,0),\"\")","v":"QUITUTERIA"},{"$f":"IFERROR(VLOOKUP(A28,CADASTRO!C:R,16,0),\"\")","v":""},null,null,null,null,{"$f":"SUMIF(ENTRADAS!A:E,A28,ENTRADAS!E:E)","v":0},"",null,{"$f":"SUMIF(SAÍDAS!A:E,PRODUTOS!A28,SAÍDAS!E:E)","v":0},"",null,0,"",null,0,"",null,0,""]
[43,{"$f":"IF(A29=\"\",\"\",IFERROR(VLOOKUP(A29,CADASTRO!C:F,2,FALSE),\"\"))","v":"CUPCAKE LEITE"},{"$f":"IFERROR(VLOOKUP(A29,CADASTRO!C:F,3,FALSE),\"\")","v":0},{"$f":"IFERROR(VLOOKUP(A29,CADASTRO!C:F,4,0),\"\")","v":"CONFEITARIA DOCE"},{"$f":"IFERROR(VLOOKUP(A29,CADASTRO!C:R,16,0),\"\")","v":""},null,null,null,null,{"$f":"SUMIF(ENTRADAS!A:E,A29,ENTRADAS!E:E)","v":0},"",null,{"$f":"SUMIF(SAÍDAS!A:E,PRODUTOS!A29,SAÍDAS!E:E)","v":0},"",null,0,"",null,0,"",null,0,""]
[44,{"$f":"IF(A30=\"\",\"\",IFERROR(VLOOKUP(A30,CADASTRO!C:F,2,FALSE),\"\"))","v":"DANISH CAPRESE"},{"$f":"IFERROR(VLOOKUP(A30,CADASTRO!C:F,3,FALSE),\"\")","v":0},{"$f":"IFERROR(VLOOKUP(A30,CADASTRO!C:F,4,0),\"\")","v":"FOLHATERIA"},{"$f":"IFERROR(VLOOKUP(A30,CADASTRO!C:R,16,0),\"\")","v":""},null,11,null,null,{"$f":"SUMIF(ENTRADAS!A:E,A30,ENTRADAS!E:E)","v":52},"",null,{"$f":"SUMIF(SAÍDAS!A:E,PRODUTOS!A30,SAÍDAS!E:E)","v":46},"",null,17,"",null,17,"",null,0,""]
[45,{"$f":"IF(A31=\"\",\"\",IFERROR(VLOOKUP(A31,CADASTRO!C:F,2,FALSE),\"\"))","v":"DISCO MINI CAKE CHOCOLATE"},{"$f":"IFERROR(VLOOKUP(A31,CADASTRO!C:F,3,FALSE),\"\")","v":0},{"$f":"IFERROR(VLOOKUP(A31,CADASTRO!C:F,4,0),\"\")","v":"CONFEITARIA DOCE"},{"$f":"IFERROR(VLOOKUP(A31,CADASTRO!C:R,16,0),\"\")","v":""},null,null,null,null,{"$f":"SUMIF(ENTRADAS!A:E,A31,ENTRADAS!E:E)","v":0},"",null,{"$f":"SUMIF(SAÍDAS!A:E,PRODUTOS!A31,SAÍDAS!E:E)","v":0},"",null,0,"",null,0,"",null,0,""]
[46,{"$f":"IF(A32=\"\",\"\",IFERROR(VLOOKUP(A32,CADASTRO!C:F,2,FALSE),\"\"))","v":"DISCOS DE RED VELVET"},{"$f":"IFERROR(VLOOKUP(A32,CADASTRO!C:F,3,FALSE),\"\")","v":0},{"$f":"IFERROR(VLOOKUP(A32,CADASTRO!C:F,4,0),\"\")","v":"CONFEITARIA DOCE"},{"$f":"IFERROR(VLOOKUP(A32,CADASTRO!C:R,16,0),\"\")","v":""},null,null,null,null,{"$f":"SUMIF(ENTRADAS!A:E,A32,ENTRADAS!E:E)","v":0},"",null,{"$f":"SUMIF(SAÍDAS!A:E,PRODUTOS!A32,SAÍDAS!E:E)","v":0},"",null,0,"",null,0,"",null,0,""]
[47,{"$f":"IF(A33=\"\",\"\",IFERROR(VLOOKUP(A33,CADASTRO!C:F,2,FALSE),\"\"))","v":"DISCOS MINI CAKE DE LEITE"},{"$f":"IFERROR(VLOOKUP(A33,CADASTRO!C:F,3,FALSE),\"\")","v":0},{"$f":"IFERROR(VLOOKUP(A33,CADASTRO!C:F,4,0),\"\")","v":"CONFEITARIA DOCE"},{"$f":"IFERROR(VLOOKUP(A33,CADASTRO!C:R,16,0),\"\")","v":""},null,null,null,null,{"$f":"SUMIF(ENTRADAS!A:E,A33,ENTRADAS!E:E)","v":0},"",null,{"$f":"SUMIF(SAÍDAS!A:E,PRODUTOS!A33,SAÍDAS!E:E)","v":0},"",null,0,"",null,0,"",null,0,""]
[48,{"$f":"IF(A34=\"\",\"\",IFERROR(VLOOKUP(A34,CADASTRO!C:F,2,FALSE),\"\"))","v":"DISCOS SUPREMO"},{"$f":"IFERROR(VLOOKUP(A34,CADASTRO!C:F,3,FALSE),\"\")","v":0},{"$f":"IFERROR(VLOOKUP(A34,CADASTRO!C:F,4,0),\"\")","v":"CONFEITARIA DOCE"},{"$f":"IFERROR(VLOOKUP(A34,CADASTRO!C:R,16,0),\"\")","v":""},null,null,null,null,{"$f":"SUMIF(ENTRADAS!A:E,A34,ENTRADAS!E:E)","v":0},"",null,{"$f":"SUMIF(SAÍDAS!A:E,PRODUTOS!A34,SAÍDAS!E:E)","v":0},"",null,0,"",null,0,"",null,0,""]
[49,{"$f":"IF(A35=\"\",\"\",IFERROR(VLOOKUP(A35,CADASTRO!C:F,2,FALSE),\"\"))","v":"DONNUTS"},{"$f":"IFERROR(VLOOKUP(A35,CADASTRO!C:F,3,FALSE),\"\")","v":0},{"$f":"IFERROR(VLOOKUP(A35,CADASTRO!C:F,4,0),\"\")","v":"PADARIA TRADICIONAL"},{"$f":"IFERROR(VLOOKUP(A35,CADASTRO!C:R,16,0),\"\")","v":""},null,null,null,null,{"$f":"SUMIF(ENTRADAS!A:E,A35,ENTRADAS!E:E)","v":182},"",null,{"$f":"SUMIF(SAÍDAS!A:E,PRODUTOS!A35,SAÍDAS!E:E)","v":110},"",null,72,"",null,72,"",null,0,""]
[50,{"$f":"IF(A36=\"\",\"\",IFERROR(VLOOKUP(A36,CADASTRO!C:F,2,FALSE),\"\"))","v":"EMPADA BACALHAU"},{"$f":"IFERROR(VLOOKUP(A36,CADASTRO!C:F,3,FALSE),\"\")","v":0},{"$f":"IFERROR(VLOOKUP(A36,CADASTRO!C:F,4,0),\"\")","v":"PADARIA TRADICIONAL"},{"$f":"IFERROR(VLOOKUP(A36,CADASTRO!C:R,16,0),\"\")","v":""},null,26,null,null,{"$f":"SUMIF(ENTRADAS!A:E,A36,ENTRADAS!E:E)","v":76},"",null,{"$f":"SUMIF(SAÍDAS!A:E,PRODUTOS!A36,SAÍDAS!E:E)","v":41},"",null,61,"",null,61,"",null,0,""]
[51,{"$f":"IF(A37=\"\",\"\",IFERROR(VLOOKUP(A37,CADASTRO!C:F,2,FALSE),\"\"))","v":"EMPADA FRANGO"},{"$f":"IFERROR(VLOOKUP(A37,CADASTRO!C:F,3,FALSE),\"\")","v":0},{"$f":"IFERROR(VLOOKUP(A37,CADASTRO!C:F,4,0),\"\")","v":"PADARIA TRADICIONAL"},{"$f":"IFERROR(VLOOKUP(A37,CADASTRO!C:R,16,0),\"\")","v":""},null,208,null,null,{"$f":"SUMIF(ENTRADAS!A:E,A37,ENTRADAS!E:E)","v":0},"",null,{"$f":"SUMIF(SAÍDAS!A:E,PRODUTOS!A37,SAÍDAS!E:E)","v":64},"",null,144,"",null,144,"",null,0,""]
[52,{"$f":"IF(A38=\"\",\"\",IFERROR(VLOOKUP(A38,CADASTRO!C:F,2,FALSE),\"\"))","v":"EMPADA FRANGO/PALMITO"},{"$f":"IFERROR(VLOOKUP(A38,CADASTRO!C:F,3,FALSE),\"\")","v":0},{"$f":"IFERROR(VLOOKUP(A38,CADASTRO!C:F,4,0),\"\")","v":"PADARIA TRADICIONAL"},{"$f":"IFERROR(VLOOKUP(A38,CADASTRO!C:R,16,0),\"\")","v":""},null,172,null,null,{"$f":"SUMIF(ENTRADAS!A:E,A38,ENTRADAS!E:E)","v":0},"",null,{"$f":"SUMIF(SAÍDAS!A:E,PRODUTOS!A38,SAÍDAS!E:E)","v":44},"",null,128,"",null,128,"",null,0,""]
[53,{"$f":"IF(A39=\"\",\"\",IFERROR(VLOOKUP(A39,CADASTRO!C:F,2,FALSE),\"\"))","v":"EMPADA PALMITO"},{"$f":"IFERROR(VLOOKUP(A39,CADASTRO!C:F,3,FALSE),\"\")","v":0},{"$f":"IFERROR(VLOOKUP(A39,CADASTRO!C:F,4,0),\"\")","v":"PADARIA TRADICIONAL"},{"$f":"IFERROR(VLOOKUP(A39,CADASTRO!C:R,16,0),\"\")","v":""},null,null,null,null,{"$f":"SUMIF(ENTRADAS!A:E,A39,ENTRADAS!E:E)","v":72},"",null,{"$f":"SUMIF(SAÍDAS!A:E,PRODUTOS!A39,SAÍDAS!E:E)","v":17},"",null,55,"",null,55,"",null,0,""]
[54,{"$f":"IF(A40=\"\",\"\",IFERROR(VLOOKUP(A40,CADASTRO!C:F,2,FALSE),\"\"))","v":"EMPADÃO"},{"$f":"IFERROR(VLOOKUP(A40,CADASTRO!C:F,3,FALSE),\"\")","v":0},{"$f":"IFERROR(VLOOKUP(A40,CADASTRO!C:F,4,0),\"\")","v":"PADARIA TRADICIONAL"},{"$f":"IFERROR(VLOOKUP(A40,CADASTRO!C:R,16,0),\"\")","v":""},null,null,null,null,{"$f":"SUMIF(ENTRADAS!A:E,A40,ENTRADAS!E:E)","v":0},"",null,{"$f":"SUMIF(SAÍDAS!A:E,PRODUTOS!A40,SAÍDAS!E:E)","v":0},"",null,0,"",null,0,"",null,0,""]
[60,{"$f":"IF(A41=\"\",\"\",IFERROR(VLOOKUP(A41,CADASTRO!C:F,2,FALSE),\"\"))","v":"FOCACCIA RUSTICA  CALABRESA (MASSA)"},{"$f":"IFERROR(VLOOKUP(A41,CADASTRO!C:F,3,FALSE),\"\")","v":0},{"$f":"IFERROR(VLOOKUP(A41,CADASTRO!C:F,4,0),\"\")","v":"PADARIA RÚSTICA"},{"$f":"IFERROR(VLOOKUP(A41,CADASTRO!C:R,16,0),\"\")","v":""},null,2,null,null,{"$f":"SUMIF(ENTRADAS!A:E,A41,ENTRADAS!E:E)","v":18},"",null,{"$f":"SUMIF(SAÍDAS!A:E,PRODUTOS!A41,SAÍDAS!E:E)","v":8},"",null,12,"",null,12,"",null,0,""]
[61,{"$f":"IF(A42=\"\",\"\",IFERROR(VLOOKUP(A42,CADASTRO!C:F,2,FALSE),\"\"))","v":"FOCACCIA TABULEIRO"},{"$f":"IFERROR(VLOOKUP(A42,CADASTRO!C:F,3,FALSE),\"\")","v":0},{"$f":"IFERROR(VLOOKUP(A42,CADASTRO!C:F,4,0),\"\")","v":"PADARIA RÚSTICA"},{"$f":"IFERROR(VLOOKUP(A42,CADASTRO!C:R,16,0),\"\")","v":""},null,2,null,null,{"$f":"SUMIF(ENTRADAS!A:E,A42,ENTRADAS!E:E)","v":80},"",null,{"$f":"SUMIF(SAÍDAS!A:E,PRODUTOS!A42,SAÍDAS!E:E)","v":14.8},"",null,67.2,"",null,67.2,"",null,0,""]
[66,{"$f":"IF(A43=\"\",\"\",IFERROR(VLOOKUP(A43,CADASTRO!C:F,2,FALSE),\"\"))","v":"LASANHA FOLHADA MISTA"},{"$f":"IFERROR(VLOOKUP(A43,CADASTRO!C:F,3,FALSE),\"\")","v":0},{"$f":"IFERROR(VLOOKUP(A43,CADASTRO!C:F,4,0),\"\")","v":"FOLHATERIA"},{"$f":"IFERROR(VLOOKUP(A43,CADASTRO!C:R,16,0),\"\")","v":""},null,null,null,null,{"$f":"SUMIF(ENTRADAS!A:E,A43,ENTRADAS!E:E)","v":5},"",null,{"$f":"SUMIF(SAÍDAS!A:E,PRODUTOS!A43,SAÍDAS!E:E)","v":4},"",null,1,"",null,1,"",null,0,""]
[70,{"$f":"IF(A44=\"\",\"\",IFERROR(VLOOKUP(A44,CADASTRO!C:F,2,FALSE),\"\"))","v":"MASSA DOCINHO BRIGADEIRO"},{"$f":"IFERROR(VLOOKUP(A44,CADASTRO!C:F,3,FALSE),\"\")","v":0},{"$f":"IFERROR(VLOOKUP(A44,CADASTRO!C:F,4,0),\"\")","v":"CONFEITARIA DOCE"},{"$f":"IFERROR(VLOOKUP(A44,CADASTRO!C:R,16,0),\"\")","v":""},null,null,null,null,{"$f":"SUMIF(ENTRADAS!A:E,A44,ENTRADAS!E:E)","v":0},"",null,{"$f":"SUMIF(SAÍDAS!A:E,PRODUTOS!A44,SAÍDAS!E:E)","v":0},"",null,0,"",null,0,"",null,0,""]
[71,{"$f":"IF(A45=\"\",\"\",IFERROR(VLOOKUP(A45,CADASTRO!C:F,2,FALSE),\"\"))","v":"MASSA MINI PIZZA"},{"$f":"IFERROR(VLOOKUP(A45,CADASTRO!C:F,3,FALSE),\"\")","v":0},{"$f":"IFERROR(VLOOKUP(A45,CADASTRO!C:F,4,0),\"\")","v":"PADARIA TRADICIONAL"},{"$f":"IFERROR(VLOOKUP(A45,CADASTRO!C:R,16,0),\"\")","v":""},null,null,null,null,{"$f":"SUMIF(ENTRADAS!A:E,A45,ENTRADAS!E:E)","v":11},"",null,{"$f":"SUMIF(SAÍDAS!A:E,PRODUTOS!A45,SAÍDAS!E:E)","v":7},"",null,4,"",null,4,"",null,0,""]
[72,{"$f":"IF(A46=\"\",\"\",IFERROR(VLOOKUP(A46,CADASTRO!C:F,2,FALSE),\"\"))","v":"MASSAS TARTALETE"},{"$f":"IFERROR(VLOOKUP(A46,CADASTRO!C:F,3,FALSE),\"\")","v":0},{"$f":"IFERROR(VLOOKUP(A46,CADASTRO!C:F,4,0),\"\")","v":"CONFEITARIA DOCE"},{"$f":"IFERROR(VLOOKUP(A46,CADASTRO!C:R,16,0),\"\")","v":""},null,null,null,null,{"$f":"SUMIF(ENTRADAS!A:E,A46,ENTRADAS!E:E)","v":0},"",null,{"$f":"SUMIF(SAÍDAS!A:E,PRODUTOS!A46,SAÍDAS!E:E)","v":0},"",null,0,"",null,0,"",null,0,""]
[73,{"$f":"IF(A47=\"\",\"\",IFERROR(VLOOKUP(A47,CADASTRO!C:F,2,FALSE),\"\"))","v":"MIL FOLHAS"},{"$f":"IFERROR(VLOOKUP(A47,CADASTRO!C:F,3,FALSE),\"\")","v":0},{"$f":"IFERROR(VLOOKUP(A47,CADASTRO!C:F,4,0),\"\")","v":"FOLHATERIA"},{"$f":"IFERROR(VLOOKUP(A47,CADASTRO!C:R,16,0),\"\")","v":""},null,null,null,null,{"$f":"SUMIF(ENTRADAS!A:E,A47,ENTRADAS!E:E)","v":0},"",null,{"$f":"SUMIF(SAÍDAS!A:E,PRODUTOS!A47,SAÍDAS!E:E)","v":0},"",null,0,"",null,0,"",null,0,""]
[74,{"$f":"IF(A48=\"\",\"\",IFERROR(VLOOKUP(A48,CADASTRO!C:F,2,FALSE),\"\"))","v":"MINI BOLO DE CENOURA"},{"$f":"IFERROR(VLOOKUP(A48,CADASTRO!C:F,3,FALSE),\"\")","v":0},{"$f":"IFERROR(VLOOKUP(A48,CADASTRO!C:F,4,0),\"\")","v":"CONFEITARIA DOCE"},{"$f":"IFERROR(VLOOKUP(A48,CADASTRO!C:R,16,0),\"\")","v":""},null,null,null,null,{"$f":"SUMIF(ENTRADAS!A:E,A48,ENTRADAS!E:E)","v":0},"",null,{"$f":"SUMIF(SAÍDAS!A:E,PRODUTOS!A48,SAÍDAS!E:E)","v":0},"",null,0,"",null,0,"",null,0,""]
[75,{"$f":"IF(A49=\"\",\"\",IFERROR(VLOOKUP(A49,CADASTRO!C:F,2,FALSE),\"\"))","v":"MINI CAKE DE CHOCOLATE"},{"$f":"IFERROR(VLOOKUP(A49,CADASTRO!C:F,3,FALSE),\"\")","v":0},{"$f":"IFERROR(VLOOKUP(A49,CADASTRO!C:F,4,0),\"\")","v":"CONFEITARIA DOCE"},{"$f":"IFERROR(VLOOKUP(A49,CADASTRO!C:R,16,0),\"\")","v":""},null,null,null,null,{"$f":"SUMIF(ENTRADAS!A:E,A49,ENTRADAS!E:E)","v":0},"",null,{"$f":"SUMIF(SAÍDAS!A:E,PRODUTOS!A49,SAÍDAS!E:E)","v":0},"",null,0,"",null,0,"",null,0,""]
[76,{"$f":"IF(A50=\"\",\"\",IFERROR(VLOOKUP(A50,CADASTRO!C:F,2,FALSE),\"\"))","v":"MINI CAKE DE LEITE"},{"$f":"IFERROR(VLOOKUP(A50,CADASTRO!C:F,3,FALSE),\"\")","v":0},{"$f":"IFERROR(VLOOKUP(A50,CADASTRO!C:F,4,0),\"\")","v":"CONFEITARIA DOCE"},{"$f":"IFERROR(VLOOKUP(A50,CADASTRO!C:R,16,0),\"\")","v":""},null,null,null,null,{"$f":"SUMIF(ENTRADAS!A:E,A50,ENTRADAS!E:E)","v":0},"",null,{"$f":"SUMIF(SAÍDAS!A:E,PRODUTOS!A50,SAÍDAS!E:E)","v":0},"",null,0,"",null,0,"",null,0,""]
[77,{"$f":"IF(A51=\"\",\"\",IFERROR(VLOOKUP(A51,CADASTRO!C:F,2,FALSE),\"\"))","v":"MINI CROISSANT "},{"$f":"IFERROR(VLOOKUP(A51,CADASTRO!C:F,3,FALSE),\"\")","v":0},{"$f":"IFERROR(VLOOKUP(A51,CADASTRO!C:F,4,0),\"\")","v":"FOLHATERIA"},{"$f":"IFERROR(VLOOKUP(A51,CADASTRO!C:R,16,0),\"\")","v":""},null,12.7,null,null,{"$f":"SUMIF(ENTRADAS!A:E,A51,ENTRADAS!E:E)","v":0},"",null,{"$f":"SUMIF(SAÍDAS!A:E,PRODUTOS!A51,SAÍDAS!E:E)","v":0},"",null,12.7,"",null,12.7,"",null,0,""]
[78,{"$f":"IF(A52=\"\",\"\",IFERROR(VLOOKUP(A52,CADASTRO!C:F,2,FALSE),\"\"))","v":"MINI FOLHADO BACALHAU"},{"$f":"IFERROR(VLOOKUP(A52,CADASTRO!C:F,3,FALSE),\"\")","v":0},{"$f":"IFERROR(VLOOKUP(A52,CADASTRO!C:F,4,0),\"\")","v":"FOLHATERIA"},{"$f":"IFERROR(VLOOKUP(A52,CADASTRO!C:R,16,0),\"\")","v":""},null,7.6440000000000001,null,null,{"$f":"SUMIF(ENTRADAS!A:E,A52,ENTRADAS!E:E)","v":10.73},"",null,{"$f":"SUMIF(SAÍDAS!A:E,PRODUTOS!A52,SAÍDAS!E:E)","v":14.98},"",null,3.3940000000000019,"",null,3.3940000000000019,"",null,0,""]
[79,{"$f":"IF(A53=\"\",\"\",IFERROR(VLOOKUP(A53,CADASTRO!C:F,2,FALSE),\"\"))","v":"MINI FOLHADO CALABRESA"},{"$f":"IFERROR(VLOOKUP(A53,CADASTRO!C:F,3,FALSE),\"\")","v":0},{"$f":"IFERROR(VLOOKUP(A53,CADASTRO!C:F,4,0),\"\")","v":"FOLHATERIA"},{"$f":"IFERROR(VLOOKUP(A53,CADASTRO!C:R,16,0),\"\")","v":""},null,7.3879999999999999,null,null,{"$f":"SUMIF(ENTRADAS!A:E,A53,ENTRADAS!E:E)","v":10.39},"",null,{"$f":"SUMIF(SAÍDAS!A:E,PRODUTOS!A53,SAÍDAS!E:E)","v":21.199999999999996},"",null,-3.421999999999997,"",null,-3.421999999999997,"",null,0,""]
[80,{"$f":"IF(A54=\"\",\"\",IFERROR(VLOOKUP(A54,CADASTRO!C:F,2,FALSE),\"\"))","v":"MINI FOLHADO CUPUAÇU"},{"$f":"IFERROR(VLOOKUP(A54,CADASTRO!C:F,3,FALSE),\"\")","v":0},{"$f":"IFERROR(VLOOKUP(A54,CADASTRO!C:F,4,0),\"\")","v":"FOLHATERIA"},{"$f":"IFERROR(VLOOKUP(A54,CADASTRO!C:R,16,0),\"\")","v":""},null,null,null,null,{"$f":"SUMIF(ENTRADAS!A:E,A54,ENTRADAS!E:E)","v":22.619999999999997},"",null,{"$f":"SUMIF(SAÍDAS!A:E,PRODUTOS!A54,SAÍDAS!E:E)","v":19.04},"",null,3.5799999999999983,"",null,3.5799999999999983,"",null,0,""]
[81,{"$f":"IF(A55=\"\",\"\",IFERROR(VLOOKUP(A55,CADASTRO!C:F,2,FALSE),\"\"))","v":"MINI FOLHADO DE QUEIJO"},{"$f":"IFERROR(VLOOKUP(A55,CADASTRO!C:F,3,FALSE),\"\")","v":0},{"$f":"IFERROR(VLOOKUP(A55,CADASTRO!C:F,4,0),\"\")","v":"FOLHATERIA"},{"$f":"IFERROR(VLOOKUP(A55,CADASTRO!C:R,16,0),\"\")","v":""},null,null,null,null,{"$f":"SUMIF(ENTRADAS!A:E,A55,ENTRADAS!E:E)","v":25.16},"",null,{"$f":"SUMIF(SAÍDAS!A:E,PRODUTOS!A55,SAÍDAS!E:E)","v":24.759999999999998},"",null,0.40000000000000213,"",null,0.40000000000000213,"",null,0,""]
[82,{"$f":"IF(A56=\"\",\"\",IFERROR(VLOOKUP(A56,CADASTRO!C:F,2,FALSE),\"\"))","v":"MINI FOLHADO FRANGO"},{"$f":"IFERROR(VLOOKUP(A56,CADASTRO!C:F,3,FALSE),\"\")","v":0},{"$f":"IFERROR(VLOOKUP(A56,CADASTRO!C:F,4,0),\"\")","v":"FOLHATERIA"},{"$f":"IFERROR(VLOOKUP(A56,CADASTRO!C:R,16,0),\"\")","v":""},null,null,null,null,{"$f":"SUMIF(ENTRADAS!A:E,A56,ENTRADAS!E:E)","v":10.73},"",null,{"$f":"SUMIF(SAÍDAS!A:E,PRODUTOS!A56,SAÍDAS!E:E)","v":14.63},"",null,-3.9000000000000004,"",null,-3.9000000000000004,"",null,0,""]
[83,{"$f":"IF(A57=\"\",\"\",IFERROR(VLOOKUP(A57,CADASTRO!C:F,2,FALSE),\"\"))","v":"MINI FOLHADO GOIABADA"},{"$f":"IFERROR(VLOOKUP(A57,CADASTRO!C:F,3,FALSE),\"\")","v":0},{"$f":"IFERROR(VLOOKUP(A57,CADASTRO!C:F,4,0),\"\")","v":"FOLHATERIA"},{"$f":"IFERROR(VLOOKUP(A57,CADASTRO!C:R,16,0),\"\")","v":""},null,9.9,null,null,{"$f":"SUMIF(ENTRADAS!A:E,A57,ENTRADAS!E:E)","v":6.39},"",null,{"$f":"SUMIF(SAÍDAS!A:E,PRODUTOS!A57,SAÍDAS!E:E)","v":3.63},"",null,12.66,"",null,12.66,"",null,0,""]
[84,{"$f":"IF(A58=\"\",\"\",IFERROR(VLOOKUP(A58,CADASTRO!C:F,2,FALSE),\"\"))","v":"MINI FOLHADO MISTO"},{"$f":"IFERROR(VLOOKUP(A58,CADASTRO!C:F,3,FALSE),\"\")","v":0},{"$f":"IFERROR(VLOOKUP(A58,CADASTRO!C:F,4,0),\"\")","v":"FOLHATERIA"},{"$f":"IFERROR(VLOOKUP(A58,CADASTRO!C:R,16,0),\"\")","v":""},null,null,null,null,{"$f":"SUMIF(ENTRADAS!A:E,A58,ENTRADAS!E:E)","v":14.82},"",null,{"$f":"SUMIF(SAÍDAS!A:E,PRODUTOS!A58,SAÍDAS!E:E)","v":18.14},"",null,-3.3200000000000003,"",null,-3.3200000000000003,"",null,0,""]
[85,{"$f":"IF(A59=\"\",\"\",IFERROR(VLOOKUP(A59,CADASTRO!C:F,2,FALSE),\"\"))","v":"MINI LASANHA FOLHADA"},{"$f":"IFERROR(VLOOKUP(A59,CADASTRO!C:F,3,FALSE),\"\")","v":0},{"$f":"IFERROR(VLOOKUP(A59,CADASTRO!C:F,4,0),\"\")","v":"FOLHATERIA"},{"$f":"IFERROR(VLOOKUP(A59,CADASTRO!C:R,16,0),\"\")","v":""},null,null,null,null,{"$f":"SUMIF(ENTRADAS!A:E,A59,ENTRADAS!E:E)","v":0},"",null,{"$f":"SUMIF(SAÍDAS!A:E,PRODUTOS!A59,SAÍDAS!E:E)","v":0},"",null,0,"",null,0,"",null,0,""]
[86,{"$f":"IF(A60=\"\",\"\",IFERROR(VLOOKUP(A60,CADASTRO!C:F,2,FALSE),\"\"))","v":"MINI LASANHA MISTA"},{"$f":"IFERROR(VLOOKUP(A60,CADASTRO!C:F,3,FALSE),\"\")","v":0},{"$f":"IFERROR(VLOOKUP(A60,CADASTRO!C:F,4,0),\"\")","v":"FOLHATERIA"},{"$f":"IFERROR(VLOOKUP(A60,CADASTRO!C:R,16,0),\"\")","v":""},null,null,null,null,{"$f":"SUMIF(ENTRADAS!A:E,A60,ENTRADAS!E:E)","v":0},"",null,{"$f":"SUMIF(SAÍDAS!A:E,PRODUTOS!A60,SAÍDAS!E:E)","v":0},"",null,0,"",null,0,"",null,0,""]
[87,{"$f":"IF(A61=\"\",\"\",IFERROR(VLOOKUP(A61,CADASTRO!C:F,2,FALSE),\"\"))","v":"MINI PAIN AU CHOCOLAT "},{"$f":"IFERROR(VLOOKUP(A61,CADASTRO!C:F,3,FALSE),\"\")","v":0},{"$f":"IFERROR(VLOOKUP(A61,CADASTRO!C:F,4,0),\"\")","v":"FOLHATERIA"},{"$f":"IFERROR(VLOOKUP(A61,CADASTRO!C:R,16,0),\"\")","v":""},null,null,null,null,{"$f":"SUMIF(ENTRADAS!A:E,A61,ENTRADAS!E:E)","v":7.13},"",null,{"$f":"SUMIF(SAÍDAS!A:E,PRODUTOS!A61,SAÍDAS!E:E)","v":7.13},"",null,0,"",null,0,"",null,0,""]
[88,{"$f":"IF(A62=\"\",\"\",IFERROR(VLOOKUP(A62,CADASTRO!C:F,2,FALSE),\"\"))","v":"MINI PÃO BATATA (ERVAS,PARMESÃO)"},{"$f":"IFERROR(VLOOKUP(A62,CADASTRO!C:F,3,FALSE),\"\")","v":0},{"$f":"IFERROR(VLOOKUP(A62,CADASTRO!C:F,4,0),\"\")","v":"PADARIA TRADICIONAL"},{"$f":"IFERROR(VLOOKUP(A62,CADASTRO!C:R,16,0),\"\")","v":""},null,null,null,null,{"$f":"SUMIF(ENTRADAS!A:E,A62,ENTRADAS!E:E)","v":1700},"",null,{"$f":"SUMIF(SAÍDAS!A:E,PRODUTOS!A62,SAÍDAS!E:E)","v":1310},"",null,390,"",null,390,"",null,0,""]
[89,{"$f":"IF(A63=\"\",\"\",IFERROR(VLOOKUP(A63,CADASTRO!C:F,2,FALSE),\"\"))","v":"MINI PÃO BATATA HAMBÚRGUER"},{"$f":"IFERROR(VLOOKUP(A63,CADASTRO!C:F,3,FALSE),\"\")","v":0},{"$f":"IFERROR(VLOOKUP(A63,CADASTRO!C:F,4,0),\"\")","v":"PADARIA TRADICIONAL"},{"$f":"IFERROR(VLOOKUP(A63,CADASTRO!C:R,16,0),\"\")","v":""},null,null,null,null,{"$f":"SUMIF(ENTRADAS!A:E,A63,ENTRADAS!E:E)","v":1080},"",null,{"$f":"SUMIF(SAÍDAS!A:E,PRODUTOS!A63,SAÍDAS!E:E)","v":794},"",null,286,"",null,286,"",null,0,""]
[90,{"$f":"IF(A64=\"\",\"\",IFERROR(VLOOKUP(A64,CADASTRO!C:F,2,FALSE),\"\"))","v":"MINI PÃO BRIOCHE (C/ 6 UNIDADES = 740G)"},{"$f":"IFERROR(VLOOKUP(A64,CADASTRO!C:F,3,FALSE),\"\")","v":0},{"$f":"IFERROR(VLOOKUP(A64,CADASTRO!C:F,4,0),\"\")","v":"PADARIA TRADICIONAL"},{"$f":"IFERROR(VLOOKUP(A64,CADASTRO!C:R,16,0),\"\")","v":""},null,null,null,null,{"$f":"SUMIF(ENTRADAS!A:E,A64,ENTRADAS!E:E)","v":0},"",null,{"$f":"SUMIF(SAÍDAS!A:E,PRODUTOS!A64,SAÍDAS!E:E)","v":0},"",null,0,"",null,0,"",null,0,""]
[91,{"$f":"IF(A65=\"\",\"\",IFERROR(VLOOKUP(A65,CADASTRO!C:F,2,FALSE),\"\"))","v":"MINI PÃO BRIOCHE (PCT C/ 24UND)"},{"$f":"IFERROR(VLOOKUP(A65,CADASTRO!C:F,3,FALSE),\"\")","v":0},{"$f":"IFERROR(VLOOKUP(A65,CADASTRO!C:F,4,0),\"\")","v":"PADARIA TRADICIONAL"},{"$f":"IFERROR(VLOOKUP(A65,CADASTRO!C:R,16,0),\"\")","v":""},null,null,null,null,{"$f":"SUMIF(ENTRADAS!A:E,A65,ENTRADAS!E:E)","v":16},"",null,{"$f":"SUMIF(SAÍDAS!A:E,PRODUTOS!A65,SAÍDAS!E:E)","v":12},"",null,4,"",null,4,"",null,0,""]
[92,{"$f":"IF(A66=\"\",\"\",IFERROR(VLOOKUP(A66,CADASTRO!C:F,2,FALSE),\"\"))","v":"MINI PÃO DELÍCIA  (PCT C/ 24UND)"},{"$f":"IFERROR(VLOOKUP(A66,CADASTRO!C:F,3,FALSE),\"\")","v":0},{"$f":"IFERROR(VLOOKUP(A66,CADASTRO!C:F,4,0),\"\")","v":"PADARIA TRADICIONAL"},{"$f":"IFERROR(VLOOKUP(A66,CADASTRO!C:R,16,0),\"\")","v":""},null,null,null,null,{"$f":"SUMIF(ENTRADAS!A:E,A66,ENTRADAS!E:E)","v":36},"",null,{"$f":"SUMIF(SAÍDAS!A:E,PRODUTOS!A66,SAÍDAS!E:E)","v":28},"",null,8,"",null,8,"",null,0,""]
[93,{"$f":"IF(A67=\"\",\"\",IFERROR(VLOOKUP(A67,CADASTRO!C:F,2,FALSE),\"\"))","v":"MINI PASTEL FOLHADO"},{"$f":"IFERROR(VLOOKUP(A67,CADASTRO!C:F,3,FALSE),\"\")","v":0},{"$f":"IFERROR(VLOOKUP(A67,CADASTRO!C:F,4,0),\"\")","v":"FOLHATERIA"},{"$f":"IFERROR(VLOOKUP(A67,CADASTRO!C:R,16,0),\"\")","v":""},null,3.2160000000000002,null,null,{"$f":"SUMIF(ENTRADAS!A:E,A67,ENTRADAS!E:E)","v":10.42},"",null,{"$f":"SUMIF(SAÍDAS!A:E,PRODUTOS!A67,SAÍDAS!E:E)","v":13.64},"",null,{"$f":"G67+J67-M67","v":-4.0000000000013358E-3},"",null,-4.0000000000013358E-3,"",null,0,""]
[94,{"$f":"IF(A68=\"\",\"\",IFERROR(VLOOKUP(A68,CADASTRO!C:F,2,FALSE),\"\"))","v":"MINI TRANÇA BACALHAU"},{"$f":"IFERROR(VLOOKUP(A68,CADASTRO!C:F,3,FALSE),\"\")","v":0},{"$f":"IFERROR(VLOOKUP(A68,CADASTRO!C:F,4,0),\"\")","v":"FOLHATERIA"},{"$f":"IFERROR(VLOOKUP(A68,CADASTRO!C:R,16,0),\"\")","v":""},null,9,null,null,{"$f":"SUMIF(ENTRADAS!A:E,A68,ENTRADAS!E:E)","v":16},{"$f":"IFERROR(J68*$E68,\"\")","v":""},null,{"$f":"SUMIF(SAÍDAS!A:E,PRODUTOS!A68,SAÍDAS!E:E)","v":15},{"$f":"IFERROR(M68*$E68,\"\")","v":""},null,10,{"$f":"IFERROR(P68*$E68,\"\")","v":""},null,{"$f":"P68","v":10},{"$f":"IFERROR(S68*$E68,\"\")","v":""},null,{"$f":"S68-P68","v":0},{"$f":"IFERROR(V68*$E68,\"\")","v":""}]
[95,{"$f":"IF(A69=\"\",\"\",IFERROR(VLOOKUP(A69,CADASTRO!C:F,2,FALSE),\"\"))","v":"MINI TRANÇA CALABRESA"},{"$f":"IFERROR(VLOOKUP(A69,CADASTRO!C:F,3,FALSE),\"\")","v":0},{"$f":"IFERROR(VLOOKUP(A69,CADASTRO!C:F,4,0),\"\")","v":"FOLHATERIA"},{"$f":"IFERROR(VLOOKUP(A69,CADASTRO!C:R,16,0),\"\")","v":""},null,null,null,null,{"$f":"SUMIF(ENTRADAS!A:E,A69,ENTRADAS!E:E)","v":16},"",null,{"$f":"SUMIF(SAÍDAS!A:E,PRODUTOS!A69,SAÍDAS!E:E)","v":14},"",null,2,"",null,2,"",null,0,""]
[96,{"$f":"IF(A70=\"\",\"\",IFERROR(VLOOKUP(A70,CADASTRO!C:F,2,FALSE),\"\"))","v":"MINI TRANÇA FILÉ"},{"$f":"IFERROR(VLOOKUP(A70,CADASTRO!C:F,3,FALSE),\"\")","v":0},{"$f":"IFERROR(VLOOKUP(A70,CADASTRO!C:F,4,0),\"\")","v":"FOLHATERIA"},{"$f":"IFERROR(VLOOKUP(A70,CADASTRO!C:R,16,0),\"\")","v":""},null,null,null,null,{"$f":"SUMIF(ENTRADAS!A:E,A70,ENTRADAS!E:E)","v":0},"",null,{"$f":"SUMIF(SAÍDAS!A:E,PRODUTOS!A70,SAÍDAS!E:E)","v":0},"",null,0,"",null,0,"",null,0,""]
[97,{"$f":"IF(A71=\"\",\"\",IFERROR(VLOOKUP(A71,CADASTRO!C:F,2,FALSE),\"\"))","v":"MINI TRANÇA FRANGO"},{"$f":"IFERROR(VLOOKUP(A71,CADASTRO!C:F,3,FALSE),\"\")","v":0},{"$f":"IFERROR(VLOOKUP(A71,CADASTRO!C:F,4,0),\"\")","v":"FOLHATERIA"},{"$f":"IFERROR(VLOOKUP(A71,CADASTRO!C:R,16,0),\"\")","v":""},null,20,null,null,{"$f":"SUMIF(ENTRADAS!A:E,A71,ENTRADAS!E:E)","v":0},"",null,{"$f":"SUMIF(SAÍDAS!A:E,PRODUTOS!A71,SAÍDAS!E:E)","v":10},"",null,10,"",null,10,"",null,0,""]
[98,{"$f":"IF(A72=\"\",\"\",IFERROR(VLOOKUP(A72,CADASTRO!C:F,2,FALSE),\"\"))","v":"MINI TRANÇA MISTA"},{"$f":"IFERROR(VLOOKUP(A72,CADASTRO!C:F,3,FALSE),\"\")","v":0},{"$f":"IFERROR(VLOOKUP(A72,CADASTRO!C:F,4,0),\"\")","v":"FOLHATERIA"},{"$f":"IFERROR(VLOOKUP(A72,CADASTRO!C:R,16,0),\"\")","v":""},null,null,null,null,{"$f":"SUMIF(ENTRADAS!A:E,A72,ENTRADAS!E:E)","v":16},"",null,{"$f":"SUMIF(SAÍDAS!A:E,PRODUTOS!A72,SAÍDAS!E:E)","v":14},"",null,2,"",null,2,"",null,0,""]
[99,{"$f":"IF(A73=\"\",\"\",IFERROR(VLOOKUP(A73,CADASTRO!C:F,2,FALSE),\"\"))","v":"MINI TRANÇA MORTADELA DEFUMADO"},{"$f":"IFERROR(VLOOKUP(A73,CADASTRO!C:F,3,FALSE),\"\")","v":0},{"$f":"IFERROR(VLOOKUP(A73,CADASTRO!C:F,4,0),\"\")","v":"FOLHATERIA"},{"$f":"IFERROR(VLOOKUP(A73,CADASTRO!C:R,16,0),\"\")","v":""},null,null,null,null,{"$f":"SUMIF(ENTRADAS!A:E,A73,ENTRADAS!E:E)","v":0},"",null,{"$f":"SUMIF(SAÍDAS!A:E,PRODUTOS!A73,SAÍDAS!E:E)","v":0},"",null,0,"",null,0,"",null,0,""]
[100,{"$f":"IF(A74=\"\",\"\",IFERROR(VLOOKUP(A74,CADASTRO!C:F,2,FALSE),\"\"))","v":"MINI TRANÇA PATO"},{"$f":"IFERROR(VLOOKUP(A74,CADASTRO!C:F,3,FALSE),\"\")","v":0},{"$f":"IFERROR(VLOOKUP(A74,CADASTRO!C:F,4,0),\"\")","v":"FOLHATERIA"},{"$f":"IFERROR(VLOOKUP(A74,CADASTRO!C:R,16,0),\"\")","v":""},null,null,null,null,{"$f":"SUMIF(ENTRADAS!A:E,A74,ENTRADAS!E:E)","v":0},"",null,{"$f":"SUMIF(SAÍDAS!A:E,PRODUTOS!A74,SAÍDAS!E:E)","v":0},"",null,0,"",null,0,"",null,0,""]
[101,{"$f":"IF(A75=\"\",\"\",IFERROR(VLOOKUP(A75,CADASTRO!C:F,2,FALSE),\"\"))","v":"MINI TRANÇA PEITO DEFUMADO"},{"$f":"IFERROR(VLOOKUP(A75,CADASTRO!C:F,3,FALSE),\"\")","v":0},{"$f":"IFERROR(VLOOKUP(A75,CADASTRO!C:F,4,0),\"\")","v":"FOLHATERIA"},{"$f":"IFERROR(VLOOKUP(A75,CADASTRO!C:R,16,0),\"\")","v":""},null,null,null,null,{"$f":"SUMIF(ENTRADAS!A:E,A75,ENTRADAS!E:E)","v":0},"",null,{"$f":"SUMIF(SAÍDAS!A:E,PRODUTOS!A75,SAÍDAS!E:E)","v":0},"",null,0,"",null,0,"",null,0,""]
[102,{"$f":"IF(A76=\"\",\"\",IFERROR(VLOOKUP(A76,CADASTRO!C:F,2,FALSE),\"\"))","v":"MINI TRANÇA PERNIL"},{"$f":"IFERROR(VLOOKUP(A76,CADASTRO!C:F,3,FALSE),\"\")","v":0},{"$f":"IFERROR(VLOOKUP(A76,CADASTRO!C:F,4,0),\"\")","v":"FOLHATERIA"},{"$f":"IFERROR(VLOOKUP(A76,CADASTRO!C:R,16,0),\"\")","v":""},null,null,null,null,{"$f":"SUMIF(ENTRADAS!A:E,A76,ENTRADAS!E:E)","v":0},"",null,{"$f":"SUMIF(SAÍDAS!A:E,PRODUTOS!A76,SAÍDAS!E:E)","v":0},"",null,0,"",null,0,"",null,0,""]
[103,{"$f":"IF(A77=\"\",\"\",IFERROR(VLOOKUP(A77,CADASTRO!C:F,2,FALSE),\"\"))","v":"MINI TRANÇA PERU/JAMBU"},{"$f":"IFERROR(VLOOKUP(A77,CADASTRO!C:F,3,FALSE),\"\")","v":0},{"$f":"IFERROR(VLOOKUP(A77,CADASTRO!C:F,4,0),\"\")","v":"FOLHATERIA"},{"$f":"IFERROR(VLOOKUP(A77,CADASTRO!C:R,16,0),\"\")","v":""},null,null,null,null,{"$f":"SUMIF(ENTRADAS!A:E,A77,ENTRADAS!E:E)","v":0},"",null,{"$f":"SUMIF(SAÍDAS!A:E,PRODUTOS!A77,SAÍDAS!E:E)","v":0},"",null,0,"",null,0,"",null,0,""]
[104,{"$f":"IF(A78=\"\",\"\",IFERROR(VLOOKUP(A78,CADASTRO!C:F,2,FALSE),\"\"))","v":"MINI TRANÇA SALAME"},{"$f":"IFERROR(VLOOKUP(A78,CADASTRO!C:F,3,FALSE),\"\")","v":0},{"$f":"IFERROR(VLOOKUP(A78,CADASTRO!C:F,4,0),\"\")","v":"FOLHATERIA"},{"$f":"IFERROR(VLOOKUP(A78,CADASTRO!C:R,16,0),\"\")","v":""},null,33,null,null,{"$f":"SUMIF(ENTRADAS!A:E,A78,ENTRADAS!E:E)","v":0},"",null,{"$f":"SUMIF(SAÍDAS!A:E,PRODUTOS!A78,SAÍDAS!E:E)","v":12},"",null,21,"",null,21,"",null,0,""]
[106,{"$f":"IF(A79=\"\",\"\",IFERROR(VLOOKUP(A79,CADASTRO!C:F,2,FALSE),\"\"))","v":"NEGÃO G50"},{"$f":"IFERROR(VLOOKUP(A79,CADASTRO!C:F,3,FALSE),\"\")","v":0},{"$f":"IFERROR(VLOOKUP(A79,CADASTRO!C:F,4,0),\"\")","v":"CONFEITARIA DOCE"},{"$f":"IFERROR(VLOOKUP(A79,CADASTRO!C:R,16,0),\"\")","v":""},null,null,null,null,{"$f":"SUMIF(ENTRADAS!A:E,A79,ENTRADAS!E:E)","v":0},"",null,{"$f":"SUMIF(SAÍDAS!A:E,PRODUTOS!A79,SAÍDAS!E:E)","v":0},"",null,0,"",null,0,"",null,0,""]
[107,{"$f":"IF(A80=\"\",\"\",IFERROR(VLOOKUP(A80,CADASTRO!C:F,2,FALSE),\"\"))","v":"ORELHINHA CANELA"},{"$f":"IFERROR(VLOOKUP(A80,CADASTRO!C:F,3,FALSE),\"\")","v":0},{"$f":"IFERROR(VLOOKUP(A80,CADASTRO!C:F,4,0),\"\")","v":"FOLHATERIA"},{"$f":"IFERROR(VLOOKUP(A80,CADASTRO!C:R,16,0),\"\")","v":""},null,11,null,null,{"$f":"SUMIF(ENTRADAS!A:E,A80,ENTRADAS!E:E)","v":7.48},"",null,{"$f":"SUMIF(SAÍDAS!A:E,PRODUTOS!A80,SAÍDAS!E:E)","v":7.29},"",null,11.190000000000001,"",null,11.190000000000001,"",null,0,""]
[108,{"$f":"IF(A81=\"\",\"\",IFERROR(VLOOKUP(A81,CADASTRO!C:F,2,FALSE),\"\"))","v":"ORELINHA TRADICIONAL"},{"$f":"IFERROR(VLOOKUP(A81,CADASTRO!C:F,3,FALSE),\"\")","v":0},{"$f":"IFERROR(VLOOKUP(A81,CADASTRO!C:F,4,0),\"\")","v":"FOLHATERIA"},{"$f":"IFERROR(VLOOKUP(A81,CADASTRO!C:R,16,0),\"\")","v":""},null,3.3780000000000001,null,null,{"$f":"SUMIF(ENTRADAS!A:E,A81,ENTRADAS!E:E)","v":23.38},"",null,{"$f":"SUMIF(SAÍDAS!A:E,PRODUTOS!A81,SAÍDAS!E:E)","v":18.38},"",null,8.3780000000000001,"",null,8.3780000000000001,"",null,0,""]
[109,{"$f":"IF(A82=\"\",\"\",IFERROR(VLOOKUP(A82,CADASTRO!C:F,2,FALSE),\"\"))","v":"PAIN AU CHOCOLAT"},{"$f":"IFERROR(VLOOKUP(A82,CADASTRO!C:F,3,FALSE),\"\")","v":0},{"$f":"IFERROR(VLOOKUP(A82,CADASTRO!C:F,4,0),\"\")","v":"FOLHATERIA"},{"$f":"IFERROR(VLOOKUP(A82,CADASTRO!C:R,16,0),\"\")","v":""},null,null,null,null,{"$f":"SUMIF(ENTRADAS!A:E,A82,ENTRADAS!E:E)","v":0},"",null,{"$f":"SUMIF(SAÍDAS!A:E,PRODUTOS!A82,SAÍDAS!E:E)","v":0},"",null,0,"",null,0,"",null,0,""]
[110,{"$f":"IF(A83=\"\",\"\",IFERROR(VLOOKUP(A83,CADASTRO!C:F,2,FALSE),\"\"))","v":"PALITO CANELA"},{"$f":"IFERROR(VLOOKUP(A83,CADASTRO!C:F,3,FALSE),\"\")","v":0},{"$f":"IFERROR(VLOOKUP(A83,CADASTRO!C:F,4,0),\"\")","v":"FOLHATERIA"},{"$f":"IFERROR(VLOOKUP(A83,CADASTRO!C:R,16,0),\"\")","v":""},null,null,null,null,{"$f":"SUMIF(ENTRADAS!A:E,A83,ENTRADAS!E:E)","v":15.48},"",null,{"$f":"SUMIF(SAÍDAS!A:E,PRODUTOS!A83,SAÍDAS!E:E)","v":11.34},"",null,4.1400000000000006,"",null,4.1400000000000006,"",null,0,""]
[111,{"$f":"IF(A84=\"\",\"\",IFERROR(VLOOKUP(A84,CADASTRO!C:F,2,FALSE),\"\"))","v":"PALITO QUEIJO"},{"$f":"IFERROR(VLOOKUP(A84,CADASTRO!C:F,3,FALSE),\"\")","v":0},{"$f":"IFERROR(VLOOKUP(A84,CADASTRO!C:F,4,0),\"\")","v":"FOLHATERIA"},{"$f":"IFERROR(VLOOKUP(A84,CADASTRO!C:R,16,0),\"\")","v":""},null,3.55,null,null,{"$f":"SUMIF(ENTRADAS!A:E,A84,ENTRADAS!E:E)","v":10.7},"",null,{"$f":"SUMIF(SAÍDAS!A:E,PRODUTOS!A84,SAÍDAS!E:E)","v":22.75},"",null,-8.5,"",null,-8.5,"",null,0,""]
[112,{"$f":"IF(A85=\"\",\"\",IFERROR(VLOOKUP(A85,CADASTRO!C:F,2,FALSE),\"\"))","v":"PALMIER"},{"$f":"IFERROR(VLOOKUP(A85,CADASTRO!C:F,3,FALSE),\"\")","v":0},{"$f":"IFERROR(VLOOKUP(A85,CADASTRO!C:F,4,0),\"\")","v":"FOLHATERIA"},{"$f":"IFERROR(VLOOKUP(A85,CADASTRO!C:R,16,0),\"\")","v":""},null,null,null,null,{"$f":"SUMIF(ENTRADAS!A:E,A85,ENTRADAS!E:E)","v":140},"",null,{"$f":"SUMIF(SAÍDAS!A:E,PRODUTOS!A85,SAÍDAS!E:E)","v":10},"",null,130,"",null,130,"",null,0,""]
[113,{"$f":"IF(A86=\"\",\"\",IFERROR(VLOOKUP(A86,CADASTRO!C:F,2,FALSE),\"\"))","v":"PÃO AUSTRALIANO BAGUETE"},{"$f":"IFERROR(VLOOKUP(A86,CADASTRO!C:F,3,FALSE),\"\")","v":0},{"$f":"IFERROR(VLOOKUP(A86,CADASTRO!C:F,4,0),\"\")","v":"PADARIA TRADICIONAL"},{"$f":"IFERROR(VLOOKUP(A86,CADASTRO!C:R,16,0),\"\")","v":""},null,null,null,null,{"$f":"SUMIF(ENTRADAS!A:E,A86,ENTRADAS!E:E)","v":0},"",null,{"$f":"SUMIF(SAÍDAS!A:E,PRODUTOS!A86,SAÍDAS!E:E)","v":0},"",null,0,"",null,0,"",null,0,""]
[114,{"$f":"IF(A87=\"\",\"\",IFERROR(VLOOKUP(A87,CADASTRO!C:F,2,FALSE),\"\"))","v":"PÃO AUSTRALIANO HAMBÚRGUER"},{"$f":"IFERROR(VLOOKUP(A87,CADASTRO!C:F,3,FALSE),\"\")","v":0},{"$f":"IFERROR(VLOOKUP(A87,CADASTRO!C:F,4,0),\"\")","v":"PADARIA TRADICIONAL"},{"$f":"IFERROR(VLOOKUP(A87,CADASTRO!C:R,16,0),\"\")","v":""},null,null,null,null,{"$f":"SUMIF(ENTRADAS!A:E,A87,ENTRADAS!E:E)","v":0},"",null,{"$f":"SUMIF(SAÍDAS!A:E,PRODUTOS!A87,SAÍDAS!E:E)","v":0},"",null,0,"",null,0,"",null,0,""]
[115,{"$f":"IF(A88=\"\",\"\",IFERROR(VLOOKUP(A88,CADASTRO!C:F,2,FALSE),\"\"))","v":"PÃO AUSTRALIANO RÚSTICO"},{"$f":"IFERROR(VLOOKUP(A88,CADASTRO!C:F,3,FALSE),\"\")","v":0},{"$f":"IFERROR(VLOOKUP(A88,CADASTRO!C:F,4,0),\"\")","v":"PADARIA RÚSTICA"},{"$f":"IFERROR(VLOOKUP(A88,CADASTRO!C:R,16,0),\"\")","v":""},null,null,null,null,{"$f":"SUMIF(ENTRADAS!A:E,A88,ENTRADAS!E:E)","v":0},"",null,{"$f":"SUMIF(SAÍDAS!A:E,PRODUTOS!A88,SAÍDAS!E:E)","v":0},"",null,0,"",null,0,"",null,0,""]
[116,{"$f":"IF(A89=\"\",\"\",IFERROR(VLOOKUP(A89,CADASTRO!C:F,2,FALSE),\"\"))","v":"PÃO BAGUETE 10 HORAS"},{"$f":"IFERROR(VLOOKUP(A89,CADASTRO!C:F,3,FALSE),\"\")","v":0},{"$f":"IFERROR(VLOOKUP(A89,CADASTRO!C:F,4,0),\"\")","v":"PADARIA TRADICIONAL"},{"$f":"IFERROR(VLOOKUP(A89,CADASTRO!C:R,16,0),\"\")","v":""},null,15,null,null,{"$f":"SUMIF(ENTRADAS!A:E,A89,ENTRADAS!E:E)","v":15},"",null,{"$f":"SUMIF(SAÍDAS!A:E,PRODUTOS!A89,SAÍDAS!E:E)","v":30},"",null,0,"",null,0,"",null,0,""]
[117,{"$f":"IF(A90=\"\",\"\",IFERROR(VLOOKUP(A90,CADASTRO!C:F,2,FALSE),\"\"))","v":"PÃO BAGUETE DE TRADIÇÃO"},{"$f":"IFERROR(VLOOKUP(A90,CADASTRO!C:F,3,FALSE),\"\")","v":0},{"$f":"IFERROR(VLOOKUP(A90,CADASTRO!C:F,4,0),\"\")","v":"PADARIA RÚSTICA"},{"$f":"IFERROR(VLOOKUP(A90,CADASTRO!C:R,16,0),\"\")","v":""},null,null,null,null,{"$f":"SUMIF(ENTRADAS!A:E,A90,ENTRADAS!E:E)","v":0},"",null,{"$f":"SUMIF(SAÍDAS!A:E,PRODUTOS!A90,SAÍDAS!E:E)","v":0},"",null,0,"",null,0,"",null,0,""]
[118,{"$f":"IF(A91=\"\",\"\",IFERROR(VLOOKUP(A91,CADASTRO!C:F,2,FALSE),\"\"))","v":"PÃO BAGUETE FRANCESA"},{"$f":"IFERROR(VLOOKUP(A91,CADASTRO!C:F,3,FALSE),\"\")","v":0},{"$f":"IFERROR(VLOOKUP(A91,CADASTRO!C:F,4,0),\"\")","v":"PADARIA RÚSTICA"},{"$f":"IFERROR(VLOOKUP(A91,CADASTRO!C:R,16,0),\"\")","v":""},null,null,null,null,{"$f":"SUMIF(ENTRADAS!A:E,A91,ENTRADAS!E:E)","v":0},"",null,{"$f":"SUMIF(SAÍDAS!A:E,PRODUTOS!A91,SAÍDAS!E:E)","v":0},"",null,0,"",null,0,"",null,0,""]
[119,{"$f":"IF(A92=\"\",\"\",IFERROR(VLOOKUP(A92,CADASTRO!C:F,2,FALSE),\"\"))","v":"PÃO BAGUETE LYON"},{"$f":"IFERROR(VLOOKUP(A92,CADASTRO!C:F,3,FALSE),\"\")","v":0},{"$f":"IFERROR(VLOOKUP(A92,CADASTRO!C:F,4,0),\"\")","v":"PADARIA RÚSTICA"},{"$f":"IFERROR(VLOOKUP(A92,CADASTRO!C:R,16,0),\"\")","v":""},null,67,null,null,{"$f":"SUMIF(ENTRADAS!A:E,A92,ENTRADAS!E:E)","v":59},"",null,{"$f":"SUMIF(SAÍDAS!A:E,PRODUTOS!A92,SAÍDAS!E:E)","v":115},"",null,11,"",null,11,"",null,0,""]
[120,{"$f":"IF(A93=\"\",\"\",IFERROR(VLOOKUP(A93,CADASTRO!C:F,2,FALSE),\"\"))","v":"PÃO BAGUETE PORTUGUESA"},{"$f":"IFERROR(VLOOKUP(A93,CADASTRO!C:F,3,FALSE),\"\")","v":0},{"$f":"IFERROR(VLOOKUP(A93,CADASTRO!C:F,4,0),\"\")","v":"PADARIA TRADICIONAL"},{"$f":"IFERROR(VLOOKUP(A93,CADASTRO!C:R,16,0),\"\")","v":""},null,null,null,null,{"$f":"SUMIF(ENTRADAS!A:E,A93,ENTRADAS!E:E)","v":0},"",null,{"$f":"SUMIF(SAÍDAS!A:E,PRODUTOS!A93,SAÍDAS!E:E)","v":0},"",null,0,"",null,0,"",null,0,""]
[121,{"$f":"IF(A94=\"\",\"\",IFERROR(VLOOKUP(A94,CADASTRO!C:F,2,FALSE),\"\"))","v":"PÃO BAIÃO"},{"$f":"IFERROR(VLOOKUP(A94,CADASTRO!C:F,3,FALSE),\"\")","v":0},{"$f":"IFERROR(VLOOKUP(A94,CADASTRO!C:F,4,0),\"\")","v":"PADARIA TRADICIONAL"},{"$f":"IFERROR(VLOOKUP(A94,CADASTRO!C:R,16,0),\"\")","v":""},null,60,null,null,{"$f":"SUMIF(ENTRADAS!A:E,A94,ENTRADAS!E:E)","v":211},"",null,{"$f":"SUMIF(SAÍDAS!A:E,PRODUTOS!A94,SAÍDAS!E:E)","v":179},"",null,92,"",null,92,"",null,0,""]
[122,{"$f":"IF(A95=\"\",\"\",IFERROR(VLOOKUP(A95,CADASTRO!C:F,2,FALSE),\"\"))","v":"PÃO BENGALA 10 HORAS"},{"$f":"IFERROR(VLOOKUP(A95,CADASTRO!C:F,3,FALSE),\"\")","v":0},{"$f":"IFERROR(VLOOKUP(A95,CADASTRO!C:F,4,0),\"\")","v":"PADARIA TRADICIONAL"},{"$f":"IFERROR(VLOOKUP(A95,CADASTRO!C:R,16,0),\"\")","v":""},null,40,null,null,{"$f":"SUMIF(ENTRADAS!A:E,A95,ENTRADAS!E:E)","v":16},"",null,{"$f":"SUMIF(SAÍDAS!A:E,PRODUTOS!A95,SAÍDAS!E:E)","v":53},"",null,3,"",null,3,"",null,0,""]
[123,{"$f":"IF(A96=\"\",\"\",IFERROR(VLOOKUP(A96,CADASTRO!C:F,2,FALSE),\"\"))","v":"PÃO BRIOCHE DE FORMA  1000"},{"$f":"IFERROR(VLOOKUP(A96,CADASTRO!C:F,3,FALSE),\"\")","v":0},{"$f":"IFERROR(VLOOKUP(A96,CADASTRO!C:F,4,0),\"\")","v":"PADARIA TRADICIONAL"},{"$f":"IFERROR(VLOOKUP(A96,CADASTRO!C:R,16,0),\"\")","v":""},null,3,null,null,{"$f":"SUMIF(ENTRADAS!A:E,A96,ENTRADAS!E:E)","v":46},"",null,{"$f":"SUMIF(SAÍDAS!A:E,PRODUTOS!A96,SAÍDAS!E:E)","v":20},"",null,29,"",null,29,"",null,0,""]
[124,{"$f":"IF(A97=\"\",\"\",IFERROR(VLOOKUP(A97,CADASTRO!C:F,2,FALSE),\"\"))","v":"PÃO BRIOCHE HAMBÚRGUER"},{"$f":"IFERROR(VLOOKUP(A97,CADASTRO!C:F,3,FALSE),\"\")","v":0},{"$f":"IFERROR(VLOOKUP(A97,CADASTRO!C:F,4,0),\"\")","v":"PADARIA TRADICIONAL"},{"$f":"IFERROR(VLOOKUP(A97,CADASTRO!C:R,16,0),\"\")","v":""},null,null,null,null,{"$f":"SUMIF(ENTRADAS!A:E,A97,ENTRADAS!E:E)","v":69},"",null,{"$f":"SUMIF(SAÍDAS!A:E,PRODUTOS!A97,SAÍDAS!E:E)","v":59},"",null,10,"",null,10,"",null,0,""]
[125,{"$f":"IF(A98=\"\",\"\",IFERROR(VLOOKUP(A98,CADASTRO!C:F,2,FALSE),\"\"))","v":"PÃO C/ CEBOLA E ERVAS DE PROVENCE"},{"$f":"IFERROR(VLOOKUP(A98,CADASTRO!C:F,3,FALSE),\"\")","v":0},{"$f":"IFERROR(VLOOKUP(A98,CADASTRO!C:F,4,0),\"\")","v":"PADARIA RÚSTICA"},{"$f":"IFERROR(VLOOKUP(A98,CADASTRO!C:R,16,0),\"\")","v":""},null,null,null,null,{"$f":"SUMIF(ENTRADAS!A:E,A98,ENTRADAS!E:E)","v":0},"",null,{"$f":"SUMIF(SAÍDAS!A:E,PRODUTOS!A98,SAÍDAS!E:E)","v":0},"",null,0,"",null,0,"",null,0,""]
[126,{"$f":"IF(A99=\"\",\"\",IFERROR(VLOOKUP(A99,CADASTRO!C:F,2,FALSE),\"\"))","v":"PÃO CAMPONÊS"},{"$f":"IFERROR(VLOOKUP(A99,CADASTRO!C:F,3,FALSE),\"\")","v":0},{"$f":"IFERROR(VLOOKUP(A99,CADASTRO!C:F,4,0),\"\")","v":"PADARIA RÚSTICA"},{"$f":"IFERROR(VLOOKUP(A99,CADASTRO!C:R,16,0),\"\")","v":""},null,96,null,null,{"$f":"SUMIF(ENTRADAS!A:E,A99,ENTRADAS!E:E)","v":45},"",null,{"$f":"SUMIF(SAÍDAS!A:E,PRODUTOS!A99,SAÍDAS!E:E)","v":60},"",null,81,"",null,81,"",null,0,""]
[127,{"$f":"IF(A100=\"\",\"\",IFERROR(VLOOKUP(A100,CADASTRO!C:F,2,FALSE),\"\"))","v":"PÃO CIABATTA C/ AZEITONAS"},{"$f":"IFERROR(VLOOKUP(A100,CADASTRO!C:F,3,FALSE),\"\")","v":0},{"$f":"IFERROR(VLOOKUP(A100,CADASTRO!C:F,4,0),\"\")","v":"PADARIA RÚSTICA"},{"$f":"IFERROR(VLOOKUP(A100,CADASTRO!C:R,16,0),\"\")","v":""},null,null,null,null,{"$f":"SUMIF(ENTRADAS!A:E,A100,ENTRADAS!E:E)","v":0},"",null,{"$f":"SUMIF(SAÍDAS!A:E,PRODUTOS!A100,SAÍDAS!E:E)","v":0},"",null,0,"",null,0,"",null,0,""]
[128,{"$f":"IF(A101=\"\",\"\",IFERROR(VLOOKUP(A101,CADASTRO!C:F,2,FALSE),\"\"))","v":"PÃO CIABATTA C/ CALABRESA"},{"$f":"IFERROR(VLOOKUP(A101,CADASTRO!C:F,3,FALSE),\"\")","v":0},{"$f":"IFERROR(VLOOKUP(A101,CADASTRO!C:F,4,0),\"\")","v":"PADARIA RÚSTICA"},{"$f":"IFERROR(VLOOKUP(A101,CADASTRO!C:R,16,0),\"\")","v":""},null,null,null,null,{"$f":"SUMIF(ENTRADAS!A:E,A101,ENTRADAS!E:E)","v":0},"",null,{"$f":"SUMIF(SAÍDAS!A:E,PRODUTOS!A101,SAÍDAS!E:E)","v":0},"",null,0,"",null,0,"",null,0,""]
[129,{"$f":"IF(A102=\"\",\"\",IFERROR(VLOOKUP(A102,CADASTRO!C:F,2,FALSE),\"\"))","v":"PÃO CIABATTA C/ CEBOLA"},{"$f":"IFERROR(VLOOKUP(A102,CADASTRO!C:F,3,FALSE),\"\")","v":0},{"$f":"IFERROR(VLOOKUP(A102,CADASTRO!C:F,4,0),\"\")","v":"PADARIA RÚSTICA"},{"$f":"IFERROR(VLOOKUP(A102,CADASTRO!C:R,16,0),\"\")","v":""},null,null,null,null,{"$f":"SUMIF(ENTRADAS!A:E,A102,ENTRADAS!E:E)","v":0},"",null,{"$f":"SUMIF(SAÍDAS!A:E,PRODUTOS!A102,SAÍDAS!E:E)","v":0},"",null,0,"",null,0,"",null,0,""]
[130,{"$f":"IF(A103=\"\",\"\",IFERROR(VLOOKUP(A103,CADASTRO!C:F,2,FALSE),\"\"))","v":"PÃO CIABATTA DE TRADIÇÃO"},{"$f":"IFERROR(VLOOKUP(A103,CADASTRO!C:F,3,FALSE),\"\")","v":0},{"$f":"IFERROR(VLOOKUP(A103,CADASTRO!C:F,4,0),\"\")","v":"PADARIA RÚSTICA"},{"$f":"IFERROR(VLOOKUP(A103,CADASTRO!C:R,16,0),\"\")","v":""},null,null,null,null,{"$f":"SUMIF(ENTRADAS!A:E,A103,ENTRADAS!E:E)","v":0},"",null,{"$f":"SUMIF(SAÍDAS!A:E,PRODUTOS!A103,SAÍDAS!E:E)","v":0},"",null,0,"",null,0,"",null,0,""]
[131,{"$f":"IF(A104=\"\",\"\",IFERROR(VLOOKUP(A104,CADASTRO!C:F,2,FALSE),\"\"))","v":"PÃO CUCA DE BANANA"},{"$f":"IFERROR(VLOOKUP(A104,CADASTRO!C:F,3,FALSE),\"\")","v":0},{"$f":"IFERROR(VLOOKUP(A104,CADASTRO!C:F,4,0),\"\")","v":"PADARIA TRADICIONAL"},{"$f":"IFERROR(VLOOKUP(A104,CADASTRO!C:R,16,0),\"\")","v":""},null,null,null,null,{"$f":"SUMIF(ENTRADAS!A:E,A104,ENTRADAS!E:E)","v":25},"",null,{"$f":"SUMIF(SAÍDAS!A:E,PRODUTOS!A104,SAÍDAS!E:E)","v":12},"",null,13,"",null,13,"",null,0,""]
[132,{"$f":"IF(A105=\"\",\"\",IFERROR(VLOOKUP(A105,CADASTRO!C:F,2,FALSE),\"\"))","v":"PÃO CUCA GOIABADA"},{"$f":"IFERROR(VLOOKUP(A105,CADASTRO!C:F,3,FALSE),\"\")","v":0},{"$f":"IFERROR(VLOOKUP(A105,CADASTRO!C:F,4,0),\"\")","v":"PADARIA TRADICIONAL"},{"$f":"IFERROR(VLOOKUP(A105,CADASTRO!C:R,16,0),\"\")","v":""},null,48,null,null,{"$f":"SUMIF(ENTRADAS!A:E,A105,ENTRADAS!E:E)","v":32},"",null,{"$f":"SUMIF(SAÍDAS!A:E,PRODUTOS!A105,SAÍDAS!E:E)","v":28},"",null,52,"",null,52,"",null,0,""]
[133,{"$f":"IF(A106=\"\",\"\",IFERROR(VLOOKUP(A106,CADASTRO!C:F,2,FALSE),\"\"))","v":"PÃO CUCA PACOCA"},{"$f":"IFERROR(VLOOKUP(A106,CADASTRO!C:F,3,FALSE),\"\")","v":0},{"$f":"IFERROR(VLOOKUP(A106,CADASTRO!C:F,4,0),\"\")","v":"PADARIA TRADICIONAL"},{"$f":"IFERROR(VLOOKUP(A106,CADASTRO!C:R,16,0),\"\")","v":""},null,null,null,null,{"$f":"SUMIF(ENTRADAS!A:E,A106,ENTRADAS!E:E)","v":0},"",null,{"$f":"SUMIF(SAÍDAS!A:E,PRODUTOS!A106,SAÍDAS!E:E)","v":0},"",null,0,"",null,0,"",null,0,""]
[134,{"$f":"IF(A107=\"\",\"\",IFERROR(VLOOKUP(A107,CADASTRO!C:F,2,FALSE),\"\"))","v":"PÃO DAMIEN MONTECER"},{"$f":"IFERROR(VLOOKUP(A107,CADASTRO!C:F,3,FALSE),\"\")","v":0},{"$f":"IFERROR(VLOOKUP(A107,CADASTRO!C:F,4,0),\"\")","v":"PADARIA RÚSTICA"},{"$f":"IFERROR(VLOOKUP(A107,CADASTRO!C:R,16,0),\"\")","v":""},null,null,null,null,{"$f":"SUMIF(ENTRADAS!A:E,A107,ENTRADAS!E:E)","v":0},"",null,{"$f":"SUMIF(SAÍDAS!A:E,PRODUTOS!A107,SAÍDAS!E:E)","v":0},"",null,0,"",null,0,"",null,0,""]
[135,{"$f":"IF(A108=\"\",\"\",IFERROR(VLOOKUP(A108,CADASTRO!C:F,2,FALSE),\"\"))","v":"PÃO DE BATATA FILÃO"},{"$f":"IFERROR(VLOOKUP(A108,CADASTRO!C:F,3,FALSE),\"\")","v":0},{"$f":"IFERROR(VLOOKUP(A108,CADASTRO!C:F,4,0),\"\")","v":"PADARIA TRADICIONAL"},{"$f":"IFERROR(VLOOKUP(A108,CADASTRO!C:R,16,0),\"\")","v":""},null,null,null,null,{"$f":"SUMIF(ENTRADAS!A:E,A108,ENTRADAS!E:E)","v":400},"",null,{"$f":"SUMIF(SAÍDAS!A:E,PRODUTOS!A108,SAÍDAS!E:E)","v":296},"",null,104,"",null,104,"",null,0,""]
[136,{"$f":"IF(A109=\"\",\"\",IFERROR(VLOOKUP(A109,CADASTRO!C:F,2,FALSE),\"\"))","v":"PÃO DE CACAU"},{"$f":"IFERROR(VLOOKUP(A109,CADASTRO!C:F,3,FALSE),\"\")","v":0},{"$f":"IFERROR(VLOOKUP(A109,CADASTRO!C:F,4,0),\"\")","v":"PADARIA RÚSTICA"},{"$f":"IFERROR(VLOOKUP(A109,CADASTRO!C:R,16,0),\"\")","v":""},null,null,null,null,{"$f":"SUMIF(ENTRADAS!A:E,A109,ENTRADAS!E:E)","v":0},"",null,{"$f":"SUMIF(SAÍDAS!A:E,PRODUTOS!A109,SAÍDAS!E:E)","v":0},"",null,0,"",null,0,"",null,0,""]
[137,{"$f":"IF(A110=\"\",\"\",IFERROR(VLOOKUP(A110,CADASTRO!C:F,2,FALSE),\"\"))","v":"PÃO DE CERVEJA C/ GRÃOS TORRADOS"},{"$f":"IFERROR(VLOOKUP(A110,CADASTRO!C:F,3,FALSE),\"\")","v":0},{"$f":"IFERROR(VLOOKUP(A110,CADASTRO!C:F,4,0),\"\")","v":"PADARIA RÚSTICA"},{"$f":"IFERROR(VLOOKUP(A110,CADASTRO!C:R,16,0),\"\")","v":""},null,null,null,null,{"$f":"SUMIF(ENTRADAS!A:E,A110,ENTRADAS!E:E)","v":0},"",null,{"$f":"SUMIF(SAÍDAS!A:E,PRODUTOS!A110,SAÍDAS!E:E)","v":0},"",null,0,"",null,0,"",null,0,""]
[138,{"$f":"IF(A111=\"\",\"\",IFERROR(VLOOKUP(A111,CADASTRO!C:F,2,FALSE),\"\"))","v":"PÃO DE FORMA 100% INTEGRAL"},{"$f":"IFERROR(VLOOKUP(A111,CADASTRO!C:F,3,FALSE),\"\")","v":0},{"$f":"IFERROR(VLOOKUP(A111,CADASTRO!C:F,4,0),\"\")","v":"PADARIA RÚSTICA"},{"$f":"IFERROR(VLOOKUP(A111,CADASTRO!C:R,16,0),\"\")","v":""},null,null,null,null,{"$f":"SUMIF(ENTRADAS!A:E,A111,ENTRADAS!E:E)","v":0},"",null,{"$f":"SUMIF(SAÍDAS!A:E,PRODUTOS!A111,SAÍDAS!E:E)","v":0},"",null,0,"",null,0,"",null,0,""]
[139,{"$f":"IF(A112=\"\",\"\",IFERROR(VLOOKUP(A112,CADASTRO!C:F,2,FALSE),\"\"))","v":"PÃO DE LÓ (BRANCA)"},{"$f":"IFERROR(VLOOKUP(A112,CADASTRO!C:F,3,FALSE),\"\")","v":0},{"$f":"IFERROR(VLOOKUP(A112,CADASTRO!C:F,4,0),\"\")","v":"CONFEITARIA DOCE"},{"$f":"IFERROR(VLOOKUP(A112,CADASTRO!C:R,16,0),\"\")","v":""},null,null,null,null,{"$f":"SUMIF(ENTRADAS!A:E,A112,ENTRADAS!E:E)","v":0},"",null,{"$f":"SUMIF(SAÍDAS!A:E,PRODUTOS!A112,SAÍDAS!E:E)","v":0},"",null,0,"",null,0,"",null,0,""]
[140,{"$f":"IF(A113=\"\",\"\",IFERROR(VLOOKUP(A113,CADASTRO!C:F,2,FALSE),\"\"))","v":"PÃO DE LÓ (CHOCOLATE)"},{"$f":"IFERROR(VLOOKUP(A113,CADASTRO!C:F,3,FALSE),\"\")","v":0},{"$f":"IFERROR(VLOOKUP(A113,CADASTRO!C:F,4,0),\"\")","v":"CONFEITARIA DOCE"},{"$f":"IFERROR(VLOOKUP(A113,CADASTRO!C:R,16,0),\"\")","v":""},null,null,null,null,{"$f":"SUMIF(ENTRADAS!A:E,A113,ENTRADAS!E:E)","v":0},"",null,{"$f":"SUMIF(SAÍDAS!A:E,PRODUTOS!A113,SAÍDAS!E:E)","v":0},"",null,0,"",null,0,"",null,0,""]
[141,{"$f":"IF(A114=\"\",\"\",IFERROR(VLOOKUP(A114,CADASTRO!C:F,2,FALSE),\"\"))","v":"PÃO DE MANIÇOBA"},{"$f":"IFERROR(VLOOKUP(A114,CADASTRO!C:F,3,FALSE),\"\")","v":0},{"$f":"IFERROR(VLOOKUP(A114,CADASTRO!C:F,4,0),\"\")","v":"PADARIA RÚSTICA"},{"$f":"IFERROR(VLOOKUP(A114,CADASTRO!C:R,16,0),\"\")","v":""},null,null,null,null,{"$f":"SUMIF(ENTRADAS!A:E,A114,ENTRADAS!E:E)","v":0},"",null,{"$f":"SUMIF(SAÍDAS!A:E,PRODUTOS!A114,SAÍDAS!E:E)","v":0},"",null,0,"",null,0,"",null,0,""]
[142,{"$f":"IF(A115=\"\",\"\",IFERROR(VLOOKUP(A115,CADASTRO!C:F,2,FALSE),\"\"))","v":"PÃO DE PATO"},{"$f":"IFERROR(VLOOKUP(A115,CADASTRO!C:F,3,FALSE),\"\")","v":0},{"$f":"IFERROR(VLOOKUP(A115,CADASTRO!C:F,4,0),\"\")","v":"PADARIA RÚSTICA"},{"$f":"IFERROR(VLOOKUP(A115,CADASTRO!C:R,16,0),\"\")","v":""},null,null,null,null,{"$f":"SUMIF(ENTRADAS!A:E,A115,ENTRADAS!E:E)","v":0},"",null,{"$f":"SUMIF(SAÍDAS!A:E,PRODUTOS!A115,SAÍDAS!E:E)","v":0},"",null,0,"",null,0,"",null,0,""]
[143,{"$f":"IF(A116=\"\",\"\",IFERROR(VLOOKUP(A116,CADASTRO!C:F,2,FALSE),\"\"))","v":"PÃO DE PUPUNHA"},{"$f":"IFERROR(VLOOKUP(A116,CADASTRO!C:F,3,FALSE),\"\")","v":0},{"$f":"IFERROR(VLOOKUP(A116,CADASTRO!C:F,4,0),\"\")","v":"PADARIA RÚSTICA"},{"$f":"IFERROR(VLOOKUP(A116,CADASTRO!C:R,16,0),\"\")","v":""},null,null,null,null,{"$f":"SUMIF(ENTRADAS!A:E,A116,ENTRADAS!E:E)","v":0},"",null,{"$f":"SUMIF(SAÍDAS!A:E,PRODUTOS!A116,SAÍDAS!E:E)","v":0},"",null,0,"",null,0,"",null,0,""]
[144,{"$f":"IF(A117=\"\",\"\",IFERROR(VLOOKUP(A117,CADASTRO!C:F,2,FALSE),\"\"))","v":"PÃO DE ROSAS"},{"$f":"IFERROR(VLOOKUP(A117,CADASTRO!C:F,3,FALSE),\"\")","v":0},{"$f":"IFERROR(VLOOKUP(A117,CADASTRO!C:F,4,0),\"\")","v":"FOLHATERIA"},{"$f":"IFERROR(VLOOKUP(A117,CADASTRO!C:R,16,0),\"\")","v":""},null,null,null,null,{"$f":"SUMIF(ENTRADAS!A:E,A117,ENTRADAS!E:E)","v":21},"",null,{"$f":"SUMIF(SAÍDAS!A:E,PRODUTOS!A117,SAÍDAS!E:E)","v":21},"",null,0,"",null,0,"",null,0,""]
[145,{"$f":"IF(A118=\"\",\"\",IFERROR(VLOOKUP(A118,CADASTRO!C:F,2,FALSE),\"\"))","v":"PÃO DE VINHO / CALABRESA"},{"$f":"IFERROR(VLOOKUP(A118,CADASTRO!C:F,3,FALSE),\"\")","v":0},{"$f":"IFERROR(VLOOKUP(A118,CADASTRO!C:F,4,0),\"\")","v":"PADARIA RÚSTICA"},{"$f":"IFERROR(VLOOKUP(A118,CADASTRO!C:R,16,0),\"\")","v":""},null,null,null,null,{"$f":"SUMIF(ENTRADAS!A:E,A118,ENTRADAS!E:E)","v":0},"",null,{"$f":"SUMIF(SAÍDAS!A:E,PRODUTOS!A118,SAÍDAS!E:E)","v":0},"",null,0,"",null,0,"",null,0,""]
[146,{"$f":"IF(A119=\"\",\"\",IFERROR(VLOOKUP(A119,CADASTRO!C:F,2,FALSE),\"\"))","v":"PÃO DOCE LIEVITO"},{"$f":"IFERROR(VLOOKUP(A119,CADASTRO!C:F,3,FALSE),\"\")","v":0},{"$f":"IFERROR(VLOOKUP(A119,CADASTRO!C:F,4,0),\"\")","v":"PADARIA TRADICIONAL"},{"$f":"IFERROR(VLOOKUP(A119,CADASTRO!C:R,16,0),\"\")","v":""},null,37,null,null,{"$f":"SUMIF(ENTRADAS!A:E,A119,ENTRADAS!E:E)","v":0},"",null,{"$f":"SUMIF(SAÍDAS!A:E,PRODUTOS!A119,SAÍDAS!E:E)","v":16},"",null,21,"",null,21,"",null,0,""]
[147,{"$f":"IF(A120=\"\",\"\",IFERROR(VLOOKUP(A120,CADASTRO!C:F,2,FALSE),\"\"))","v":"PÃO FOCACCIA C/ AZEITONAS"},{"$f":"IFERROR(VLOOKUP(A120,CADASTRO!C:F,3,FALSE),\"\")","v":0},{"$f":"IFERROR(VLOOKUP(A120,CADASTRO!C:F,4,0),\"\")","v":"PADARIA RÚSTICA"},{"$f":"IFERROR(VLOOKUP(A120,CADASTRO!C:R,16,0),\"\")","v":""},null,null,null,null,{"$f":"SUMIF(ENTRADAS!A:E,A120,ENTRADAS!E:E)","v":0},"",null,{"$f":"SUMIF(SAÍDAS!A:E,PRODUTOS!A120,SAÍDAS!E:E)","v":0},"",null,0,"",null,0,"",null,0,""]
[148,{"$f":"IF(A121=\"\",\"\",IFERROR(VLOOKUP(A121,CADASTRO!C:F,2,FALSE),\"\"))","v":"PÃO FOCACCIA C/ BACON"},{"$f":"IFERROR(VLOOKUP(A121,CADASTRO!C:F,3,FALSE),\"\")","v":0},{"$f":"IFERROR(VLOOKUP(A121,CADASTRO!C:F,4,0),\"\")","v":"PADARIA RÚSTICA"},{"$f":"IFERROR(VLOOKUP(A121,CADASTRO!C:R,16,0),\"\")","v":""},null,null,null,null,{"$f":"SUMIF(ENTRADAS!A:E,A121,ENTRADAS!E:E)","v":0},"",null,{"$f":"SUMIF(SAÍDAS!A:E,PRODUTOS!A121,SAÍDAS!E:E)","v":0},"",null,0,"",null,0,"",null,0,""]
[149,{"$f":"IF(A122=\"\",\"\",IFERROR(VLOOKUP(A122,CADASTRO!C:F,2,FALSE),\"\"))","v":"PÃO FOCACCIA C/ CEBOLA"},{"$f":"IFERROR(VLOOKUP(A122,CADASTRO!C:F,3,FALSE),\"\")","v":0},{"$f":"IFERROR(VLOOKUP(A122,CADASTRO!C:F,4,0),\"\")","v":"PADARIA RÚSTICA"},{"$f":"IFERROR(VLOOKUP(A122,CADASTRO!C:R,16,0),\"\")","v":""},null,null,null,null,{"$f":"SUMIF(ENTRADAS!A:E,A122,ENTRADAS!E:E)","v":0},"",null,{"$f":"SUMIF(SAÍDAS!A:E,PRODUTOS!A122,SAÍDAS!E:E)","v":0},"",null,0,"",null,0,"",null,0,""]
[150,{"$f":"IF(A123=\"\",\"\",IFERROR(VLOOKUP(A123,CADASTRO!C:F,2,FALSE),\"\"))","v":"PÃO FOCACCIA GÊNOVA"},{"$f":"IFERROR(VLOOKUP(A123,CADASTRO!C:F,3,FALSE),\"\")","v":0},{"$f":"IFERROR(VLOOKUP(A123,CADASTRO!C:F,4,0),\"\")","v":"PADARIA RÚSTICA"},{"$f":"IFERROR(VLOOKUP(A123,CADASTRO!C:R,16,0),\"\")","v":""},null,null,null,null,{"$f":"SUMIF(ENTRADAS!A:E,A123,ENTRADAS!E:E)","v":0},"",null,{"$f":"SUMIF(SAÍDAS!A:E,PRODUTOS!A123,SAÍDAS!E:E)","v":0},"",null,0,"",null,0,"",null,0,""]
[151,{"$f":"IF(A124=\"\",\"\",IFERROR(VLOOKUP(A124,CADASTRO!C:F,2,FALSE),\"\"))","v":"PÃO FOCACCIA POMODORI"},{"$f":"IFERROR(VLOOKUP(A124,CADASTRO!C:F,3,FALSE),\"\")","v":0},{"$f":"IFERROR(VLOOKUP(A124,CADASTRO!C:F,4,0),\"\")","v":"PADARIA RÚSTICA"},{"$f":"IFERROR(VLOOKUP(A124,CADASTRO!C:R,16,0),\"\")","v":""},null,null,null,null,{"$f":"SUMIF(ENTRADAS!A:E,A124,ENTRADAS!E:E)","v":0},"",null,{"$f":"SUMIF(SAÍDAS!A:E,PRODUTOS!A124,SAÍDAS!E:E)","v":0},"",null,0,"",null,0,"",null,0,""]
[152,{"$f":"IF(A125=\"\",\"\",IFERROR(VLOOKUP(A125,CADASTRO!C:F,2,FALSE),\"\"))","v":"PÃO BAGUETE 18H"},{"$f":"IFERROR(VLOOKUP(A125,CADASTRO!C:F,3,FALSE),\"\")","v":0},{"$f":"IFERROR(VLOOKUP(A125,CADASTRO!C:F,4,0),\"\")","v":"PADARIA TRADICIONAL"},{"$f":"IFERROR(VLOOKUP(A125,CADASTRO!C:R,16,0),\"\")","v":""},null,null,null,null,{"$f":"SUMIF(ENTRADAS!A:E,A125,ENTRADAS!E:E)","v":0},"",null,{"$f":"SUMIF(SAÍDAS!A:E,PRODUTOS!A125,SAÍDAS!E:E)","v":0},"",null,0,"",null,0,"",null,0,""]
[153,{"$f":"IF(A126=\"\",\"\",IFERROR(VLOOKUP(A126,CADASTRO!C:F,2,FALSE),\"\"))","v":"PÃO FORMA BATATA A25"},{"$f":"IFERROR(VLOOKUP(A126,CADASTRO!C:F,3,FALSE),\"\")","v":0},{"$f":"IFERROR(VLOOKUP(A126,CADASTRO!C:F,4,0),\"\")","v":"PADARIA TRADICIONAL"},{"$f":"IFERROR(VLOOKUP(A126,CADASTRO!C:R,16,0),\"\")","v":""},null,52,null,null,{"$f":"SUMIF(ENTRADAS!A:E,A126,ENTRADAS!E:E)","v":68},"",null,{"$f":"SUMIF(SAÍDAS!A:E,PRODUTOS!A126,SAÍDAS!E:E)","v":94},"",null,26,"",null,26,"",null,0,""]
[154,{"$f":"IF(A127=\"\",\"\",IFERROR(VLOOKUP(A127,CADASTRO!C:F,2,FALSE),\"\"))","v":"PÃO FORMA BRIOCHE A25"},{"$f":"IFERROR(VLOOKUP(A127,CADASTRO!C:F,3,FALSE),\"\")","v":0},{"$f":"IFERROR(VLOOKUP(A127,CADASTRO!C:F,4,0),\"\")","v":"PADARIA TRADICIONAL"},{"$f":"IFERROR(VLOOKUP(A127,CADASTRO!C:R,16,0),\"\")","v":""},null,33,null,null,{"$f":"SUMIF(ENTRADAS!A:E,A127,ENTRADAS!E:E)","v":226},"",null,{"$f":"SUMIF(SAÍDAS!A:E,PRODUTOS!A127,SAÍDAS!E:E)","v":182},"",null,77,"",null,77,"",null,0,""]
[155,{"$f":"IF(A128=\"\",\"\",IFERROR(VLOOKUP(A128,CADASTRO!C:F,2,FALSE),\"\"))","v":"PÃO FORMA INTEGRAL 1000"},{"$f":"IFERROR(VLOOKUP(A128,CADASTRO!C:F,3,FALSE),\"\")","v":0},{"$f":"IFERROR(VLOOKUP(A128,CADASTRO!C:F,4,0),\"\")","v":"PADARIA TRADICIONAL"},{"$f":"IFERROR(VLOOKUP(A128,CADASTRO!C:R,16,0),\"\")","v":""},null,10,null,null,{"$f":"SUMIF(ENTRADAS!A:E,A128,ENTRADAS!E:E)","v":62},"",null,{"$f":"SUMIF(SAÍDAS!A:E,PRODUTOS!A128,SAÍDAS!E:E)","v":47},"",null,25,"",null,25,"",null,0,""]
[156,{"$f":"IF(A129=\"\",\"\",IFERROR(VLOOKUP(A129,CADASTRO!C:F,2,FALSE),\"\"))","v":"PÃO FORMA INTEGRAL 700"},{"$f":"IFERROR(VLOOKUP(A129,CADASTRO!C:F,3,FALSE),\"\")","v":0},{"$f":"IFERROR(VLOOKUP(A129,CADASTRO!C:F,4,0),\"\")","v":"PADARIA TRADICIONAL"},{"$f":"IFERROR(VLOOKUP(A129,CADASTRO!C:R,16,0),\"\")","v":""},null,14,null,null,{"$f":"SUMIF(ENTRADAS!A:E,A129,ENTRADAS!E:E)","v":30},"",null,{"$f":"SUMIF(SAÍDAS!A:E,PRODUTOS!A129,SAÍDAS!E:E)","v":28},"",null,16,"",null,16,"",null,0,""]
[157,{"$f":"IF(A130=\"\",\"\",IFERROR(VLOOKUP(A130,CADASTRO!C:F,2,FALSE),\"\"))","v":"PÃO FORMA LEITE A25"},{"$f":"IFERROR(VLOOKUP(A130,CADASTRO!C:F,3,FALSE),\"\")","v":0},{"$f":"IFERROR(VLOOKUP(A130,CADASTRO!C:F,4,0),\"\")","v":"PADARIA TRADICIONAL"},{"$f":"IFERROR(VLOOKUP(A130,CADASTRO!C:R,16,0),\"\")","v":""},null,28,null,null,{"$f":"SUMIF(ENTRADAS!A:E,A130,ENTRADAS!E:E)","v":128},"",null,{"$f":"SUMIF(SAÍDAS!A:E,PRODUTOS!A130,SAÍDAS!E:E)","v":107},"",null,49,"",null,49,"",null,0,""]
[158,{"$f":"IF(A131=\"\",\"\",IFERROR(VLOOKUP(A131,CADASTRO!C:F,2,FALSE),\"\"))","v":"PÃO FORMA MILHO A25"},{"$f":"IFERROR(VLOOKUP(A131,CADASTRO!C:F,3,FALSE),\"\")","v":0},{"$f":"IFERROR(VLOOKUP(A131,CADASTRO!C:F,4,0),\"\")","v":"PADARIA TRADICIONAL"},{"$f":"IFERROR(VLOOKUP(A131,CADASTRO!C:R,16,0),\"\")","v":""},null,null,null,null,{"$f":"SUMIF(ENTRADAS!A:E,A131,ENTRADAS!E:E)","v":86},"",null,{"$f":"SUMIF(SAÍDAS!A:E,PRODUTOS!A131,SAÍDAS!E:E)","v":86},"",null,{"$f":"G131+J131-M131","v":0},"",null,0,"",null,0,""]
[159,{"$f":"IF(A132=\"\",\"\",IFERROR(VLOOKUP(A132,CADASTRO!C:F,2,FALSE),\"\"))","v":"PÃO FORMA TRADICIONAL 1000"},{"$f":"IFERROR(VLOOKUP(A132,CADASTRO!C:F,3,FALSE),\"\")","v":0},{"$f":"IFERROR(VLOOKUP(A132,CADASTRO!C:F,4,0),\"\")","v":"PADARIA TRADICIONAL"},{"$f":"IFERROR(VLOOKUP(A132,CADASTRO!C:R,16,0),\"\")","v":""},null,3,null,null,{"$f":"SUMIF(ENTRADAS!A:E,A132,ENTRADAS!E:E)","v":65},{"$f":"IFERROR(J132*$E132,\"\")","v":""},null,{"$f":"SUMIF(SAÍDAS!A:E,PRODUTOS!A132,SAÍDAS!E:E)","v":47},{"$f":"IFERROR(M132*$E132,\"\")","v":""},null,21,{"$f":"IFERROR(P132*$E132,\"\")","v":""},null,{"$f":"P132","v":21},{"$f":"IFERROR(S132*$E132,\"\")","v":""},null,{"$f":"S132-P132","v":0},{"$f":"IFERROR(V132*$E132,\"\")","v":""}]
[160,{"$f":"IF(A133=\"\",\"\",IFERROR(VLOOKUP(A133,CADASTRO!C:F,2,FALSE),\"\"))","v":"PÃO FORMA TRADICIONAL 700"},{"$f":"IFERROR(VLOOKUP(A133,CADASTRO!C:F,3,FALSE),\"\")","v":0},{"$f":"IFERROR(VLOOKUP(A133,CADASTRO!C:F,4,0),\"\")","v":"PADARIA TRADICIONAL"},{"$f":"IFERROR(VLOOKUP(A133,CADASTRO!C:R,16,0),\"\")","v":""},null,13,null,null,{"$f":"SUMIF(ENTRADAS!A:E,A133,ENTRADAS!E:E)","v":20},"",null,{"$f":"SUMIF(SAÍDAS!A:E,PRODUTOS!A133,SAÍDAS!E:E)","v":26},"",null,7,"",null,7,"",null,0,""]
[161,{"$f":"IF(A134=\"\",\"\",IFERROR(VLOOKUP(A134,CADASTRO!C:F,2,FALSE),\"\"))","v":"PÃO FRANCÊS 10H"},{"$f":"IFERROR(VLOOKUP(A134,CADASTRO!C:F,3,FALSE),\"\")","v":0},{"$f":"IFERROR(VLOOKUP(A134,CADASTRO!C:F,4,0),\"\")","v":"PADARIA TRADICIONAL"},{"$f":"IFERROR(VLOOKUP(A134,CADASTRO!C:R,16,0),\"\")","v":""},null,30,null,null,{"$f":"SUMIF(ENTRADAS!A:E,A134,ENTRADAS!E:E)","v":165},"",null,{"$f":"SUMIF(SAÍDAS!A:E,PRODUTOS!A134,SAÍDAS!E:E)","v":225},"",null,-30,"",null,-30,"",null,0,""]
[162,{"$f":"IF(A135=\"\",\"\",IFERROR(VLOOKUP(A135,CADASTRO!C:F,2,FALSE),\"\"))","v":"PÃO FRANCÊS 18H"},{"$f":"IFERROR(VLOOKUP(A135,CADASTRO!C:F,3,FALSE),\"\")","v":0},{"$f":"IFERROR(VLOOKUP(A135,CADASTRO!C:F,4,0),\"\")","v":"PADARIA TRADICIONAL"},{"$f":"IFERROR(VLOOKUP(A135,CADASTRO!C:R,16,0),\"\")","v":""},null,null,null,null,{"$f":"SUMIF(ENTRADAS!A:E,A135,ENTRADAS!E:E)","v":0},"",null,{"$f":"SUMIF(SAÍDAS!A:E,PRODUTOS!A135,SAÍDAS!E:E)","v":35},"",null,-35,"",null,-35,"",null,0,""]
[163,{"$f":"IF(A136=\"\",\"\",IFERROR(VLOOKUP(A136,CADASTRO!C:F,2,FALSE),\"\"))","v":"PÃO FRANCÊS 5H"},{"$f":"IFERROR(VLOOKUP(A136,CADASTRO!C:F,3,FALSE),\"\")","v":0},{"$f":"IFERROR(VLOOKUP(A136,CADASTRO!C:F,4,0),\"\")","v":"PADARIA TRADICIONAL"},{"$f":"IFERROR(VLOOKUP(A136,CADASTRO!C:R,16,0),\"\")","v":""},null,115,null,null,{"$f":"SUMIF(ENTRADAS!A:E,A136,ENTRADAS!E:E)","v":75},"",null,{"$f":"SUMIF(SAÍDAS!A:E,PRODUTOS!A136,SAÍDAS!E:E)","v":200},"",null,-10,"",null,-10,"",null,0,""]
[164,{"$f":"IF(A137=\"\",\"\",IFERROR(VLOOKUP(A137,CADASTRO!C:F,2,FALSE),\"\"))","v":"PÃO ITALIANO FILÃO"},{"$f":"IFERROR(VLOOKUP(A137,CADASTRO!C:F,3,FALSE),\"\")","v":0},{"$f":"IFERROR(VLOOKUP(A137,CADASTRO!C:F,4,0),\"\")","v":"PADARIA RÚSTICA"},{"$f":"IFERROR(VLOOKUP(A137,CADASTRO!C:R,16,0),\"\")","v":""},null,null,null,null,{"$f":"SUMIF(ENTRADAS!A:E,A137,ENTRADAS!E:E)","v":0},"",null,{"$f":"SUMIF(SAÍDAS!A:E,PRODUTOS!A137,SAÍDAS!E:E)","v":0},"",null,0,"",null,0,"",null,0,""]
[165,{"$f":"IF(A138=\"\",\"\",IFERROR(VLOOKUP(A138,CADASTRO!C:F,2,FALSE),\"\"))","v":"PÃO ITALIANO PAVÊ"},{"$f":"IFERROR(VLOOKUP(A138,CADASTRO!C:F,3,FALSE),\"\")","v":0},{"$f":"IFERROR(VLOOKUP(A138,CADASTRO!C:F,4,0),\"\")","v":"PADARIA RÚSTICA"},{"$f":"IFERROR(VLOOKUP(A138,CADASTRO!C:R,16,0),\"\")","v":""},null,null,null,null,{"$f":"SUMIF(ENTRADAS!A:E,A138,ENTRADAS!E:E)","v":0},"",null,{"$f":"SUMIF(SAÍDAS!A:E,PRODUTOS!A138,SAÍDAS!E:E)","v":0},"",null,0,"",null,0,"",null,0,""]
[166,{"$f":"IF(A139=\"\",\"\",IFERROR(VLOOKUP(A139,CADASTRO!C:F,2,FALSE),\"\"))","v":"PÃO PORTUGUÊS"},{"$f":"IFERROR(VLOOKUP(A139,CADASTRO!C:F,3,FALSE),\"\")","v":0},{"$f":"IFERROR(VLOOKUP(A139,CADASTRO!C:F,4,0),\"\")","v":"PADARIA RÚSTICA"},{"$f":"IFERROR(VLOOKUP(A139,CADASTRO!C:R,16,0),\"\")","v":""},null,null,null,null,{"$f":"SUMIF(ENTRADAS!A:E,A139,ENTRADAS!E:E)","v":0},"",null,{"$f":"SUMIF(SAÍDAS!A:E,PRODUTOS!A139,SAÍDAS!E:E)","v":0},"",null,0,"",null,0,"",null,0,""]
[167,{"$f":"IF(A140=\"\",\"\",IFERROR(VLOOKUP(A140,CADASTRO!C:F,2,FALSE),\"\"))","v":"PÃO QUEIJO CALABRESA"},{"$f":"IFERROR(VLOOKUP(A140,CADASTRO!C:F,3,FALSE),\"\")","v":0},{"$f":"IFERROR(VLOOKUP(A140,CADASTRO!C:F,4,0),\"\")","v":"PADARIA TRADICIONAL"},{"$f":"IFERROR(VLOOKUP(A140,CADASTRO!C:R,16,0),\"\")","v":""},null,null,null,null,{"$f":"SUMIF(ENTRADAS!A:E,A140,ENTRADAS!E:E)","v":21},"",null,2.5,"",null,18.5,"",null,18.5,"",null,0,""]
[168,{"$f":"IF(A141=\"\",\"\",IFERROR(VLOOKUP(A141,CADASTRO!C:F,2,FALSE),\"\"))","v":"PÃO QUEIJO CUIA"},{"$f":"IFERROR(VLOOKUP(A141,CADASTRO!C:F,3,FALSE),\"\")","v":0},{"$f":"IFERROR(VLOOKUP(A141,CADASTRO!C:F,4,0),\"\")","v":"PADARIA TRADICIONAL"},{"$f":"IFERROR(VLOOKUP(A141,CADASTRO!C:R,16,0),\"\")","v":""},null,null,null,null,{"$f":"SUMIF(ENTRADAS!A:E,A141,ENTRADAS!E:E)","v":0},"",null,{"$f":"SUMIF(SAÍDAS!A:E,PRODUTOS!A141,SAÍDAS!E:E)","v":0},"",null,0,"",null,0,"",null,0,""]
[169,{"$f":"IF(A142=\"\",\"\",IFERROR(VLOOKUP(A142,CADASTRO!C:F,2,FALSE),\"\"))","v":"PÃO SEMI ITALIANO"},{"$f":"IFERROR(VLOOKUP(A142,CADASTRO!C:F,3,FALSE),\"\")","v":0},{"$f":"IFERROR(VLOOKUP(A142,CADASTRO!C:F,4,0),\"\")","v":"PADARIA TRADICIONAL"},{"$f":"IFERROR(VLOOKUP(A142,CADASTRO!C:R,16,0),\"\")","v":""},null,74,null,null,{"$f":"SUMIF(ENTRADAS!A:E,A142,ENTRADAS!E:E)","v":142},"",null,{"$f":"SUMIF(SAÍDAS!A:E,PRODUTOS!A142,SAÍDAS!E:E)","v":161},"",null,55,"",null,55,"",null,0,""]
[170,{"$f":"IF(A143=\"\",\"\",IFERROR(VLOOKUP(A143,CADASTRO!C:F,2,FALSE),\"\"))","v":"PÃO VIENNOIS"},{"$f":"IFERROR(VLOOKUP(A143,CADASTRO!C:F,3,FALSE),\"\")","v":0},{"$f":"IFERROR(VLOOKUP(A143,CADASTRO!C:F,4,0),\"\")","v":"PADARIA TRADICIONAL"},{"$f":"IFERROR(VLOOKUP(A143,CADASTRO!C:R,16,0),\"\")","v":""},null,129,null,null,{"$f":"SUMIF(ENTRADAS!A:E,A143,ENTRADAS!E:E)","v":191},"",null,{"$f":"SUMIF(SAÍDAS!A:E,PRODUTOS!A143,SAÍDAS!E:E)","v":169},"",null,151,"",null,151,"",null,0,""]
[171,{"$f":"IF(A144=\"\",\"\",IFERROR(VLOOKUP(A144,CADASTRO!C:F,2,FALSE),\"\"))","v":"PÃO BAGUETE 5H"},{"$f":"IFERROR(VLOOKUP(A144,CADASTRO!C:F,3,FALSE),\"\")","v":0},{"$f":"IFERROR(VLOOKUP(A144,CADASTRO!C:F,4,0),\"\")","v":"PADARIA TRADICIONAL"},{"$f":"IFERROR(VLOOKUP(A144,CADASTRO!C:R,16,0),\"\")","v":""},null,null,null,null,{"$f":"SUMIF(ENTRADAS!A:E,A144,ENTRADAS!E:E)","v":0},"",null,{"$f":"SUMIF(SAÍDAS!A:E,PRODUTOS!A144,SAÍDAS!E:E)","v":0},"",null,0,"",null,0,"",null,0,""]
[172,{"$f":"IF(A145=\"\",\"\",IFERROR(VLOOKUP(A145,CADASTRO!C:F,2,FALSE),\"\"))","v":"PASTEL DE BELÉM (MASSA)"},{"$f":"IFERROR(VLOOKUP(A145,CADASTRO!C:F,3,FALSE),\"\")","v":0},{"$f":"IFERROR(VLOOKUP(A145,CADASTRO!C:F,4,0),\"\")","v":"FOLHATERIA"},{"$f":"IFERROR(VLOOKUP(A145,CADASTRO!C:R,16,0),\"\")","v":""},null,null,null,null,{"$f":"SUMIF(ENTRADAS!A:E,A145,ENTRADAS!E:E)","v":24},"",null,{"$f":"SUMIF(SAÍDAS!A:E,PRODUTOS!A145,SAÍDAS!E:E)","v":8},"",null,16,"",null,16,"",null,0,""]
[173,{"$f":"IF(A146=\"\",\"\",IFERROR(VLOOKUP(A146,CADASTRO!C:F,2,FALSE),\"\"))","v":"PASTEL FOLHADO BACALHAU "},{"$f":"IFERROR(VLOOKUP(A146,CADASTRO!C:F,3,FALSE),\"\")","v":0},{"$f":"IFERROR(VLOOKUP(A146,CADASTRO!C:F,4,0),\"\")","v":"FOLHATERIA"},{"$f":"IFERROR(VLOOKUP(A146,CADASTRO!C:R,16,0),\"\")","v":""},null,27,null,null,{"$f":"SUMIF(ENTRADAS!A:E,A146,ENTRADAS!E:E)","v":72},"",null,{"$f":"SUMIF(SAÍDAS!A:E,PRODUTOS!A146,SAÍDAS!E:E)","v":42},"",null,57,"",null,57,"",null,0,""]
[174,{"$f":"IF(A147=\"\",\"\",IFERROR(VLOOKUP(A147,CADASTRO!C:F,2,FALSE),\"\"))","v":"PASTEL FOLHADO FRANGO "},{"$f":"IFERROR(VLOOKUP(A147,CADASTRO!C:F,3,FALSE),\"\")","v":0},{"$f":"IFERROR(VLOOKUP(A147,CADASTRO!C:F,4,0),\"\")","v":"FOLHATERIA"},{"$f":"IFERROR(VLOOKUP(A147,CADASTRO!C:R,16,0),\"\")","v":""},null,42,null,null,{"$f":"SUMIF(ENTRADAS!A:E,A147,ENTRADAS!E:E)","v":72},"",null,{"$f":"SUMIF(SAÍDAS!A:E,PRODUTOS!A147,SAÍDAS!E:E)","v":45},"",null,69,"",null,69,"",null,0,""]
[175,{"$f":"IF(A148=\"\",\"\",IFERROR(VLOOKUP(A148,CADASTRO!C:F,2,FALSE),\"\"))","v":"PASTEL FOLHADO MISTO "},{"$f":"IFERROR(VLOOKUP(A148,CADASTRO!C:F,3,FALSE),\"\")","v":0},{"$f":"IFERROR(VLOOKUP(A148,CADASTRO!C:F,4,0),\"\")","v":"FOLHATERIA"},{"$f":"IFERROR(VLOOKUP(A148,CADASTRO!C:R,16,0),\"\")","v":""},null,null,null,null,{"$f":"SUMIF(ENTRADAS!A:E,A148,ENTRADAS!E:E)","v":108},"",null,{"$f":"SUMIF(SAÍDAS!A:E,PRODUTOS!A148,SAÍDAS!E:E)","v":108},"",null,0,"",null,0,"",null,0,""]
[176,{"$f":"IF(A149=\"\",\"\",IFERROR(VLOOKUP(A149,CADASTRO!C:F,2,FALSE),\"\"))","v":"PASTEL FOLHADO QUEIJO "},{"$f":"IFERROR(VLOOKUP(A149,CADASTRO!C:F,3,FALSE),\"\")","v":0},{"$f":"IFERROR(VLOOKUP(A149,CADASTRO!C:F,4,0),\"\")","v":"FOLHATERIA"},{"$f":"IFERROR(VLOOKUP(A149,CADASTRO!C:R,16,0),\"\")","v":""},null,null,null,null,{"$f":"SUMIF(ENTRADAS!A:E,A149,ENTRADAS!E:E)","v":180},"",null,{"$f":"SUMIF(SAÍDAS!A:E,PRODUTOS!A149,SAÍDAS!E:E)","v":108},"",null,72,"",null,72,"",null,0,""]
[180,{"$f":"IF(A150=\"\",\"\",IFERROR(VLOOKUP(A150,CADASTRO!C:F,2,FALSE),\"\"))","v":"PIZZA FOLHADA MIX FRIOS "},{"$f":"IFERROR(VLOOKUP(A150,CADASTRO!C:F,3,FALSE),\"\")","v":0},{"$f":"IFERROR(VLOOKUP(A150,CADASTRO!C:F,4,0),\"\")","v":"FOLHATERIA"},{"$f":"IFERROR(VLOOKUP(A150,CADASTRO!C:R,16,0),\"\")","v":""},null,null,null,null,{"$f":"SUMIF(ENTRADAS!A:E,A150,ENTRADAS!E:E)","v":85},"",null,{"$f":"SUMIF(SAÍDAS!A:E,PRODUTOS!A150,SAÍDAS!E:E)","v":65},"",null,20,"",null,20,"",null,0,""]
[181,{"$f":"IF(A151=\"\",\"\",IFERROR(VLOOKUP(A151,CADASTRO!C:F,2,FALSE),\"\"))","v":"PIZZA INTEGRAL (MASSA)"},{"$f":"IFERROR(VLOOKUP(A151,CADASTRO!C:F,3,FALSE),\"\")","v":0},{"$f":"IFERROR(VLOOKUP(A151,CADASTRO!C:F,4,0),\"\")","v":"PADARIA TRADICIONAL"},{"$f":"IFERROR(VLOOKUP(A151,CADASTRO!C:R,16,0),\"\")","v":""},null,11,null,null,{"$f":"SUMIF(ENTRADAS!A:E,A151,ENTRADAS!E:E)","v":32},"",null,{"$f":"SUMIF(SAÍDAS!A:E,PRODUTOS!A151,SAÍDAS!E:E)","v":11},"",null,32,"",null,32,"",null,0,""]
[182,{"$f":"IF(A152=\"\",\"\",IFERROR(VLOOKUP(A152,CADASTRO!C:F,2,FALSE),\"\"))","v":"PIZZA ROMANA BACON"},{"$f":"IFERROR(VLOOKUP(A152,CADASTRO!C:F,3,FALSE),\"\")","v":0},{"$f":"IFERROR(VLOOKUP(A152,CADASTRO!C:F,4,0),\"\")","v":"PADARIA RÚSTICA"},{"$f":"IFERROR(VLOOKUP(A152,CADASTRO!C:R,16,0),\"\")","v":""},null,null,null,null,{"$f":"SUMIF(ENTRADAS!A:E,A152,ENTRADAS!E:E)","v":0},"",null,{"$f":"SUMIF(SAÍDAS!A:E,PRODUTOS!A152,SAÍDAS!E:E)","v":0},"",null,0,"",null,0,"",null,0,""]
[183,{"$f":"IF(A153=\"\",\"\",IFERROR(VLOOKUP(A153,CADASTRO!C:F,2,FALSE),\"\"))","v":"PIZZA ROMANA CALABRESA"},{"$f":"IFERROR(VLOOKUP(A153,CADASTRO!C:F,3,FALSE),\"\")","v":0},{"$f":"IFERROR(VLOOKUP(A153,CADASTRO!C:F,4,0),\"\")","v":"PADARIA RÚSTICA"},{"$f":"IFERROR(VLOOKUP(A153,CADASTRO!C:R,16,0),\"\")","v":""},null,null,null,null,{"$f":"SUMIF(ENTRADAS!A:E,A153,ENTRADAS!E:E)","v":0},"",null,{"$f":"SUMIF(SAÍDAS!A:E,PRODUTOS!A153,SAÍDAS!E:E)","v":0},"",null,0,"",null,0,"",null,0,""]
[184,{"$f":"IF(A154=\"\",\"\",IFERROR(VLOOKUP(A154,CADASTRO!C:F,2,FALSE),\"\"))","v":"PIZZA ROMANA MARGUERITA"},{"$f":"IFERROR(VLOOKUP(A154,CADASTRO!C:F,3,FALSE),\"\")","v":0},{"$f":"IFERROR(VLOOKUP(A154,CADASTRO!C:F,4,0),\"\")","v":"PADARIA RÚSTICA"},{"$f":"IFERROR(VLOOKUP(A154,CADASTRO!C:R,16,0),\"\")","v":""},null,null,null,null,{"$f":"SUMIF(ENTRADAS!A:E,A154,ENTRADAS!E:E)","v":0},"",null,{"$f":"SUMIF(SAÍDAS!A:E,PRODUTOS!A154,SAÍDAS!E:E)","v":0},"",null,0,"",null,0,"",null,0,""]
[185,{"$f":"IF(A155=\"\",\"\",IFERROR(VLOOKUP(A155,CADASTRO!C:F,2,FALSE),\"\"))","v":"PIZZA ROMANA MEXICANA"},{"$f":"IFERROR(VLOOKUP(A155,CADASTRO!C:F,3,FALSE),\"\")","v":0},{"$f":"IFERROR(VLOOKUP(A155,CADASTRO!C:F,4,0),\"\")","v":"PADARIA RÚSTICA"},{"$f":"IFERROR(VLOOKUP(A155,CADASTRO!C:R,16,0),\"\")","v":""},null,null,null,null,{"$f":"SUMIF(ENTRADAS!A:E,A155,ENTRADAS!E:E)","v":0},"",null,{"$f":"SUMIF(SAÍDAS!A:E,PRODUTOS!A155,SAÍDAS!E:E)","v":0},"",null,0,"",null,0,"",null,0,""]
[186,{"$f":"IF(A156=\"\",\"\",IFERROR(VLOOKUP(A156,CADASTRO!C:F,2,FALSE),\"\"))","v":"PLACA BRANCA"},{"$f":"IFERROR(VLOOKUP(A156,CADASTRO!C:F,3,FALSE),\"\")","v":0},{"$f":"IFERROR(VLOOKUP(A156,CADASTRO!C:F,4,0),\"\")","v":"CONFEITARIA DOCE"},{"$f":"IFERROR(VLOOKUP(A156,CADASTRO!C:R,16,0),\"\")","v":""},null,null,null,null,{"$f":"SUMIF(ENTRADAS!A:E,A156,ENTRADAS!E:E)","v":0},"",null,{"$f":"SUMIF(SAÍDAS!A:E,PRODUTOS!A156,SAÍDAS!E:E)","v":0},"",null,0,"",null,0,"",null,0,""]
[187,{"$f":"IF(A157=\"\",\"\",IFERROR(VLOOKUP(A157,CADASTRO!C:F,2,FALSE),\"\"))","v":"PLACA CHOCOLATE"},{"$f":"IFERROR(VLOOKUP(A157,CADASTRO!C:F,3,FALSE),\"\")","v":0},{"$f":"IFERROR(VLOOKUP(A157,CADASTRO!C:F,4,0),\"\")","v":"CONFEITARIA DOCE"},{"$f":"IFERROR(VLOOKUP(A157,CADASTRO!C:R,16,0),\"\")","v":""},null,null,null,null,{"$f":"SUMIF(ENTRADAS!A:E,A157,ENTRADAS!E:E)","v":0},"",null,{"$f":"SUMIF(SAÍDAS!A:E,PRODUTOS!A157,SAÍDAS!E:E)","v":0},"",null,0,"",null,0,"",null,0,""]
[188,{"$f":"IF(A158=\"\",\"\",IFERROR(VLOOKUP(A158,CADASTRO!C:F,2,FALSE),\"\"))","v":"PLACA QUADRADINHO"},{"$f":"IFERROR(VLOOKUP(A158,CADASTRO!C:F,3,FALSE),\"\")","v":0},{"$f":"IFERROR(VLOOKUP(A158,CADASTRO!C:F,4,0),\"\")","v":"CONFEITARIA DOCE"},{"$f":"IFERROR(VLOOKUP(A158,CADASTRO!C:R,16,0),\"\")","v":""},null,null,null,null,{"$f":"SUMIF(ENTRADAS!A:E,A158,ENTRADAS!E:E)","v":0},"",null,{"$f":"SUMIF(SAÍDAS!A:E,PRODUTOS!A158,SAÍDAS!E:E)","v":0},"",null,0,"",null,0,"",null,0,""]
[189,{"$f":"IF(A159=\"\",\"\",IFERROR(VLOOKUP(A159,CADASTRO!C:F,2,FALSE),\"\"))","v":"PLACA UVINHA"},{"$f":"IFERROR(VLOOKUP(A159,CADASTRO!C:F,3,FALSE),\"\")","v":0},{"$f":"IFERROR(VLOOKUP(A159,CADASTRO!C:F,4,0),\"\")","v":"CONFEITARIA DOCE"},{"$f":"IFERROR(VLOOKUP(A159,CADASTRO!C:R,16,0),\"\")","v":""},null,null,null,null,{"$f":"SUMIF(ENTRADAS!A:E,A159,ENTRADAS!E:E)","v":0},"",null,{"$f":"SUMIF(SAÍDAS!A:E,PRODUTOS!A159,SAÍDAS!E:E)","v":0},"",null,0,"",null,0,"",null,0,""]
[222,{"$f":"IF(A160=\"\",\"\",IFERROR(VLOOKUP(A160,CADASTRO!C:F,2,FALSE),\"\"))","v":"QUICHE 4 QUEIJOS"},{"$f":"IFERROR(VLOOKUP(A160,CADASTRO!C:F,3,FALSE),\"\")","v":0},{"$f":"IFERROR(VLOOKUP(A160,CADASTRO!C:F,4,0),\"\")","v":"QUITUTERIA"},{"$f":"IFERROR(VLOOKUP(A160,CADASTRO!C:R,16,0),\"\")","v":""},null,74,null,null,{"$f":"SUMIF(ENTRADAS!A:E,A160,ENTRADAS!E:E)","v":0},"",null,{"$f":"SUMIF(SAÍDAS!A:E,PRODUTOS!A160,SAÍDAS!E:E)","v":31},"",null,43,"",null,43,"",null,0,""]
[223,{"$f":"IF(A161=\"\",\"\",IFERROR(VLOOKUP(A161,CADASTRO!C:F,2,FALSE),\"\"))","v":"QUICHE ALHO PORO"},{"$f":"IFERROR(VLOOKUP(A161,CADASTRO!C:F,3,FALSE),\"\")","v":0},{"$f":"IFERROR(VLOOKUP(A161,CADASTRO!C:F,4,0),\"\")","v":"QUITUTERIA"},{"$f":"IFERROR(VLOOKUP(A161,CADASTRO!C:R,16,0),\"\")","v":""},null,26,null,null,{"$f":"SUMIF(ENTRADAS!A:E,A161,ENTRADAS!E:E)","v":0},"",null,{"$f":"SUMIF(SAÍDAS!A:E,PRODUTOS!A161,SAÍDAS!E:E)","v":25},"",null,1,"",null,1,"",null,0,""]
[224,{"$f":"IF(A162=\"\",\"\",IFERROR(VLOOKUP(A162,CADASTRO!C:F,2,FALSE),\"\"))","v":"QUICHE BACALHAU"},{"$f":"IFERROR(VLOOKUP(A162,CADASTRO!C:F,3,FALSE),\"\")","v":0},{"$f":"IFERROR(VLOOKUP(A162,CADASTRO!C:F,4,0),\"\")","v":"QUITUTERIA"},{"$f":"IFERROR(VLOOKUP(A162,CADASTRO!C:R,16,0),\"\")","v":""},null,null,null,null,{"$f":"SUMIF(ENTRADAS!A:E,A162,ENTRADAS!E:E)","v":58},"",null,{"$f":"SUMIF(SAÍDAS!A:E,PRODUTOS!A162,SAÍDAS!E:E)","v":42},"",null,16,"",null,16,"",null,0,""]
[225,{"$f":"IF(A163=\"\",\"\",IFERROR(VLOOKUP(A163,CADASTRO!C:F,2,FALSE),\"\"))","v":"QUICHE FRANGO"},{"$f":"IFERROR(VLOOKUP(A163,CADASTRO!C:F,3,FALSE),\"\")","v":0},{"$f":"IFERROR(VLOOKUP(A163,CADASTRO!C:F,4,0),\"\")","v":"QUITUTERIA"},{"$f":"IFERROR(VLOOKUP(A163,CADASTRO!C:R,16,0),\"\")","v":""},null,9,null,null,{"$f":"SUMIF(ENTRADAS!A:E,A163,ENTRADAS!E:E)","v":64},"",null,{"$f":"SUMIF(SAÍDAS!A:E,PRODUTOS!A163,SAÍDAS!E:E)","v":31},"",null,42,"",null,42,"",null,0,""]
[226,{"$f":"IF(A164=\"\",\"\",IFERROR(VLOOKUP(A164,CADASTRO!C:F,2,FALSE),\"\"))","v":"QUICHE LORRAINE"},{"$f":"IFERROR(VLOOKUP(A164,CADASTRO!C:F,3,FALSE),\"\")","v":0},{"$f":"IFERROR(VLOOKUP(A164,CADASTRO!C:F,4,0),\"\")","v":"QUITUTERIA"},{"$f":"IFERROR(VLOOKUP(A164,CADASTRO!C:R,16,0),\"\")","v":""},null,null,null,null,{"$f":"SUMIF(ENTRADAS!A:E,A164,ENTRADAS!E:E)","v":0},"",null,{"$f":"SUMIF(SAÍDAS!A:E,PRODUTOS!A164,SAÍDAS!E:E)","v":0},"",null,0,"",null,0,"",null,0,""]
[227,{"$f":"IF(A165=\"\",\"\",IFERROR(VLOOKUP(A165,CADASTRO!C:F,2,FALSE),\"\"))","v":"QUICHE MARAJOARA"},{"$f":"IFERROR(VLOOKUP(A165,CADASTRO!C:F,3,FALSE),\"\")","v":0},{"$f":"IFERROR(VLOOKUP(A165,CADASTRO!C:F,4,0),\"\")","v":"QUITUTERIA"},{"$f":"IFERROR(VLOOKUP(A165,CADASTRO!C:R,16,0),\"\")","v":""},null,null,null,null,{"$f":"SUMIF(ENTRADAS!A:E,A165,ENTRADAS!E:E)","v":68},"",null,{"$f":"SUMIF(SAÍDAS!A:E,PRODUTOS!A165,SAÍDAS!E:E)","v":22.1},"",null,45.9,"",null,45.9,"",null,0,""]
[228,{"$f":"IF(A166=\"\",\"\",IFERROR(VLOOKUP(A166,CADASTRO!C:F,2,FALSE),\"\"))","v":"QUICHE MARGUERITA"},{"$f":"IFERROR(VLOOKUP(A166,CADASTRO!C:F,3,FALSE),\"\")","v":0},{"$f":"IFERROR(VLOOKUP(A166,CADASTRO!C:F,4,0),\"\")","v":"QUITUTERIA"},{"$f":"IFERROR(VLOOKUP(A166,CADASTRO!C:R,16,0),\"\")","v":""},null,36,null,null,{"$f":"SUMIF(ENTRADAS!A:E,A166,ENTRADAS!E:E)","v":0},"",null,{"$f":"SUMIF(SAÍDAS!A:E,PRODUTOS!A166,SAÍDAS!E:E)","v":36},"",null,0,"",null,0,"",null,0,""]
[229,{"$f":"IF(A167=\"\",\"\",IFERROR(VLOOKUP(A167,CADASTRO!C:F,2,FALSE),\"\"))","v":"QUICHE QUEIJO CUIA"},{"$f":"IFERROR(VLOOKUP(A167,CADASTRO!C:F,3,FALSE),\"\")","v":0},{"$f":"IFERROR(VLOOKUP(A167,CADASTRO!C:F,4,0),\"\")","v":"QUITUTERIA"},{"$f":"IFERROR(VLOOKUP(A167,CADASTRO!C:R,16,0),\"\")","v":""},null,55,null,null,{"$f":"SUMIF(ENTRADAS!A:E,A167,ENTRADAS!E:E)","v":10},"",null,{"$f":"SUMIF(SAÍDAS!A:E,PRODUTOS!A167,SAÍDAS!E:E)","v":38},"",null,27,"",null,27,"",null,0,""]
[230,{"$f":"IF(A168=\"\",\"\",IFERROR(VLOOKUP(A168,CADASTRO!C:F,2,FALSE),\"\"))","v":"QUICHE QUEIJO CUIA/JAMBU"},{"$f":"IFERROR(VLOOKUP(A168,CADASTRO!C:F,3,FALSE),\"\")","v":0},{"$f":"IFERROR(VLOOKUP(A168,CADASTRO!C:F,4,0),\"\")","v":"QUITUTERIA"},{"$f":"IFERROR(VLOOKUP(A168,CADASTRO!C:R,16,0),\"\")","v":""},null,24,null,null,{"$f":"SUMIF(ENTRADAS!A:E,A168,ENTRADAS!E:E)","v":0},"",null,{"$f":"SUMIF(SAÍDAS!A:E,PRODUTOS!A168,SAÍDAS!E:E)","v":24},"",null,0,"",null,0,"",null,0,""]
[231,{"$f":"IF(A169=\"\",\"\",IFERROR(VLOOKUP(A169,CADASTRO!C:F,2,FALSE),\"\"))","v":"QUICHE TOMATE SECO"},{"$f":"IFERROR(VLOOKUP(A169,CADASTRO!C:F,3,FALSE),\"\")","v":0},{"$f":"IFERROR(VLOOKUP(A169,CADASTRO!C:F,4,0),\"\")","v":"QUITUTERIA"},{"$f":"IFERROR(VLOOKUP(A169,CADASTRO!C:R,16,0),\"\")","v":""},null,29,null,null,{"$f":"SUMIF(ENTRADAS!A:E,A169,ENTRADAS!E:E)","v":0},"",null,{"$f":"SUMIF(SAÍDAS!A:E,PRODUTOS!A169,SAÍDAS!E:E)","v":29},"",null,0,"",null,0,"",null,0,""]
[233,{"$f":"IF(A170=\"\",\"\",IFERROR(VLOOKUP(A170,CADASTRO!C:F,2,FALSE),\"\"))","v":"RECHEIO BRANCO"},{"$f":"IFERROR(VLOOKUP(A170,CADASTRO!C:F,3,FALSE),\"\")","v":0},{"$f":"IFERROR(VLOOKUP(A170,CADASTRO!C:F,4,0),\"\")","v":"CONFEITARIA DOCE"},{"$f":"IFERROR(VLOOKUP(A170,CADASTRO!C:R,16,0),\"\")","v":""},null,null,null,null,{"$f":"SUMIF(ENTRADAS!A:E,A170,ENTRADAS!E:E)","v":0},"",null,{"$f":"SUMIF(SAÍDAS!A:E,PRODUTOS!A170,SAÍDAS!E:E)","v":0},"",null,0,"",null,0,"",null,0,""]
[234,{"$f":"IF(A171=\"\",\"\",IFERROR(VLOOKUP(A171,CADASTRO!C:F,2,FALSE),\"\"))","v":"RECHEIO DE CHOCOLATE"},{"$f":"IFERROR(VLOOKUP(A171,CADASTRO!C:F,3,FALSE),\"\")","v":0},{"$f":"IFERROR(VLOOKUP(A171,CADASTRO!C:F,4,0),\"\")","v":"CONFEITARIA DOCE"},{"$f":"IFERROR(VLOOKUP(A171,CADASTRO!C:R,16,0),\"\")","v":""},null,null,null,null,{"$f":"SUMIF(ENTRADAS!A:E,A171,ENTRADAS!E:E)","v":0},"",null,{"$f":"SUMIF(SAÍDAS!A:E,PRODUTOS!A171,SAÍDAS!E:E)","v":0},"",null,0,"",null,0,"",null,0,""]
[242,{"$f":"IF(A172=\"\",\"\",IFERROR(VLOOKUP(A172,CADASTRO!C:F,2,FALSE),\"\"))","v":"RECHEIO NEGÃO"},{"$f":"IFERROR(VLOOKUP(A172,CADASTRO!C:F,3,FALSE),\"\")","v":0},{"$f":"IFERROR(VLOOKUP(A172,CADASTRO!C:F,4,0),\"\")","v":"CONFEITARIA DOCE"},{"$f":"IFERROR(VLOOKUP(A172,CADASTRO!C:R,16,0),\"\")","v":""},null,null,null,null,{"$f":"SUMIF(ENTRADAS!A:E,A172,ENTRADAS!E:E)","v":0},"",null,{"$f":"SUMIF(SAÍDAS!A:E,PRODUTOS!A172,SAÍDAS!E:E)","v":0},"",null,0,"",null,0,"",null,0,""]
[243,{"$f":"IF(A173=\"\",\"\",IFERROR(VLOOKUP(A173,CADASTRO!C:F,2,FALSE),\"\"))","v":"ROSCA DE CHUVA"},{"$f":"IFERROR(VLOOKUP(A173,CADASTRO!C:F,3,FALSE),\"\")","v":0},{"$f":"IFERROR(VLOOKUP(A173,CADASTRO!C:F,4,0),\"\")","v":"PADARIA TRADICIONAL"},{"$f":"IFERROR(VLOOKUP(A173,CADASTRO!C:R,16,0),\"\")","v":""},null,null,null,null,{"$f":"SUMIF(ENTRADAS!A:E,A173,ENTRADAS!E:E)","v":0},"",null,{"$f":"SUMIF(SAÍDAS!A:E,PRODUTOS!A173,SAÍDAS!E:E)","v":0},"",null,0,"",null,0,"",null,0,""]
[244,{"$f":"IF(A174=\"\",\"\",IFERROR(VLOOKUP(A174,CADASTRO!C:F,2,FALSE),\"\"))","v":"ROSQUINHA DE LEITE (PCT C/ 32UND)"},{"$f":"IFERROR(VLOOKUP(A174,CADASTRO!C:F,3,FALSE),\"\")","v":0},{"$f":"IFERROR(VLOOKUP(A174,CADASTRO!C:F,4,0),\"\")","v":"PADARIA TRADICIONAL"},{"$f":"IFERROR(VLOOKUP(A174,CADASTRO!C:R,16,0),\"\")","v":""},null,4,null,null,{"$f":"SUMIF(ENTRADAS!A:E,A174,ENTRADAS!E:E)","v":898},"",null,{"$f":"SUMIF(SAÍDAS!A:E,PRODUTOS!A174,SAÍDAS!E:E)","v":15},"",null,887,"",null,887,"",null,0,""]
[245,{"$f":"IF(A175=\"\",\"\",IFERROR(VLOOKUP(A175,CADASTRO!C:F,2,FALSE),\"\"))","v":"SALGADO ITALIANO FRANGO"},{"$f":"IFERROR(VLOOKUP(A175,CADASTRO!C:F,3,FALSE),\"\")","v":0},{"$f":"IFERROR(VLOOKUP(A175,CADASTRO!C:F,4,0),\"\")","v":"PADARIA TRADICIONAL"},{"$f":"IFERROR(VLOOKUP(A175,CADASTRO!C:R,16,0),\"\")","v":""},null,35,null,null,{"$f":"SUMIF(ENTRADAS!A:E,A175,ENTRADAS!E:E)","v":0},"",null,{"$f":"SUMIF(SAÍDAS!A:E,PRODUTOS!A175,SAÍDAS!E:E)","v":29},"",null,6,"",null,6,"",null,0,""]
[246,{"$f":"IF(A176=\"\",\"\",IFERROR(VLOOKUP(A176,CADASTRO!C:F,2,FALSE),\"\"))","v":"SALGADO ITALIANO MIX FRIOS"},{"$f":"IFERROR(VLOOKUP(A176,CADASTRO!C:F,3,FALSE),\"\")","v":0},{"$f":"IFERROR(VLOOKUP(A176,CADASTRO!C:F,4,0),\"\")","v":"PADARIA TRADICIONAL"},{"$f":"IFERROR(VLOOKUP(A176,CADASTRO!C:R,16,0),\"\")","v":""},null,14,null,null,{"$f":"SUMIF(ENTRADAS!A:E,A176,ENTRADAS!E:E)","v":80},"",null,{"$f":"SUMIF(SAÍDAS!A:E,PRODUTOS!A176,SAÍDAS!E:E)","v":30},"",null,64,"",null,64,"",null,0,""]
[247,{"$f":"IF(A177=\"\",\"\",IFERROR(VLOOKUP(A177,CADASTRO!C:F,2,FALSE),\"\"))","v":"SONHO"},{"$f":"IFERROR(VLOOKUP(A177,CADASTRO!C:F,3,FALSE),\"\")","v":0},{"$f":"IFERROR(VLOOKUP(A177,CADASTRO!C:F,4,0),\"\")","v":"PADARIA TRADICIONAL"},{"$f":"IFERROR(VLOOKUP(A177,CADASTRO!C:R,16,0),\"\")","v":""},null,42,null,null,{"$f":"SUMIF(ENTRADAS!A:E,A177,ENTRADAS!E:E)","v":0},"",null,{"$f":"SUMIF(SAÍDAS!A:E,PRODUTOS!A177,SAÍDAS!E:E)","v":27},"",null,15,"",null,15,"",null,0,""]
[248,{"$f":"IF(A178=\"\",\"\",IFERROR(VLOOKUP(A178,CADASTRO!C:F,2,FALSE),\"\"))","v":"TARTELETES"},{"$f":"IFERROR(VLOOKUP(A178,CADASTRO!C:F,3,FALSE),\"\")","v":0},{"$f":"IFERROR(VLOOKUP(A178,CADASTRO!C:F,4,0),\"\")","v":"CONFEITARIA DOCE"},{"$f":"IFERROR(VLOOKUP(A178,CADASTRO!C:R,16,0),\"\")","v":""},null,null,null,null,{"$f":"SUMIF(ENTRADAS!A:E,A178,ENTRADAS!E:E)","v":0},"",null,{"$f":"SUMIF(SAÍDAS!A:E,PRODUTOS!A178,SAÍDAS!E:E)","v":0},"",null,0,"",null,0,"",null,0,""]
[249,{"$f":"IF(A179=\"\",\"\",IFERROR(VLOOKUP(A179,CADASTRO!C:F,2,FALSE),\"\"))","v":"TORTA ALEMÃ"},{"$f":"IFERROR(VLOOKUP(A179,CADASTRO!C:F,3,FALSE),\"\")","v":0},{"$f":"IFERROR(VLOOKUP(A179,CADASTRO!C:F,4,0),\"\")","v":"CONFEITARIA DOCE"},{"$f":"IFERROR(VLOOKUP(A179,CADASTRO!C:R,16,0),\"\")","v":""},null,null,null,null,{"$f":"SUMIF(ENTRADAS!A:E,A179,ENTRADAS!E:E)","v":0},"",null,{"$f":"SUMIF(SAÍDAS!A:E,PRODUTOS!A179,SAÍDAS!E:E)","v":0},"",null,0,"",null,0,"",null,0,""]
[250,{"$f":"IF(A180=\"\",\"\",IFERROR(VLOOKUP(A180,CADASTRO!C:F,2,FALSE),\"\"))","v":"TORTA BACURI"},{"$f":"IFERROR(VLOOKUP(A180,CADASTRO!C:F,3,FALSE),\"\")","v":0},{"$f":"IFERROR(VLOOKUP(A180,CADASTRO!C:F,4,0),\"\")","v":"CONFEITARIA DOCE"},{"$f":"IFERROR(VLOOKUP(A180,CADASTRO!C:R,16,0),\"\")","v":""},null,null,null,null,{"$f":"SUMIF(ENTRADAS!A:E,A180,ENTRADAS!E:E)","v":0},"",null,{"$f":"SUMIF(SAÍDAS!A:E,PRODUTOS!A180,SAÍDAS!E:E)","v":0},"",null,0,"",null,0,"",null,0,""]
[251,{"$f":"IF(A181=\"\",\"\",IFERROR(VLOOKUP(A181,CADASTRO!C:F,2,FALSE),\"\"))","v":"TORTA BULGARA"},{"$f":"IFERROR(VLOOKUP(A181,CADASTRO!C:F,3,FALSE),\"\")","v":0},{"$f":"IFERROR(VLOOKUP(A181,CADASTRO!C:F,4,0),\"\")","v":"CONFEITARIA DOCE"},{"$f":"IFERROR(VLOOKUP(A181,CADASTRO!C:R,16,0),\"\")","v":""},null,null,null,null,{"$f":"SUMIF(ENTRADAS!A:E,A181,ENTRADAS!E:E)","v":0},"",null,{"$f":"SUMIF(SAÍDAS!A:E,PRODUTOS!A181,SAÍDAS!E:E)","v":0},"",null,0,"",null,0,"",null,0,""]
[252,{"$f":"IF(A182=\"\",\"\",IFERROR(VLOOKUP(A182,CADASTRO!C:F,2,FALSE),\"\"))","v":"TORTA CHEESE CAKE ROMEU JULIETA"},{"$f":"IFERROR(VLOOKUP(A182,CADASTRO!C:F,3,FALSE),\"\")","v":0},{"$f":"IFERROR(VLOOKUP(A182,CADASTRO!C:F,4,0),\"\")","v":"CONFEITARIA DOCE"},{"$f":"IFERROR(VLOOKUP(A182,CADASTRO!C:R,16,0),\"\")","v":""},null,null,null,null,{"$f":"SUMIF(ENTRADAS!A:E,A182,ENTRADAS!E:E)","v":0},"",null,{"$f":"SUMIF(SAÍDAS!A:E,PRODUTOS!A182,SAÍDAS!E:E)","v":0},"",null,0,"",null,0,"",null,0,""]
[253,{"$f":"IF(A183=\"\",\"\",IFERROR(VLOOKUP(A183,CADASTRO!C:F,2,FALSE),\"\"))","v":"TORTA CHEESECAKE FRUTAS VERMELHAS"},{"$f":"IFERROR(VLOOKUP(A183,CADASTRO!C:F,3,FALSE),\"\")","v":0},{"$f":"IFERROR(VLOOKUP(A183,CADASTRO!C:F,4,0),\"\")","v":"CONFEITARIA DOCE"},{"$f":"IFERROR(VLOOKUP(A183,CADASTRO!C:R,16,0),\"\")","v":""},null,null,null,null,{"$f":"SUMIF(ENTRADAS!A:E,A183,ENTRADAS!E:E)","v":0},"",null,{"$f":"SUMIF(SAÍDAS!A:E,PRODUTOS!A183,SAÍDAS!E:E)","v":0},"",null,0,"",null,0,"",null,0,""]
[254,{"$f":"IF(A184=\"\",\"\",IFERROR(VLOOKUP(A184,CADASTRO!C:F,2,FALSE),\"\"))","v":"TORTA CUPUAÇU"},{"$f":"IFERROR(VLOOKUP(A184,CADASTRO!C:F,3,FALSE),\"\")","v":0},{"$f":"IFERROR(VLOOKUP(A184,CADASTRO!C:F,4,0),\"\")","v":"CONFEITARIA DOCE"},{"$f":"IFERROR(VLOOKUP(A184,CADASTRO!C:R,16,0),\"\")","v":""},null,null,null,null,{"$f":"SUMIF(ENTRADAS!A:E,A184,ENTRADAS!E:E)","v":0},"",null,{"$f":"SUMIF(SAÍDAS!A:E,PRODUTOS!A184,SAÍDAS!E:E)","v":0},"",null,0,"",null,0,"",null,0,""]
[255,{"$f":"IF(A185=\"\",\"\",IFERROR(VLOOKUP(A185,CADASTRO!C:F,2,FALSE),\"\"))","v":"TORTA LIMÃO"},{"$f":"IFERROR(VLOOKUP(A185,CADASTRO!C:F,3,FALSE),\"\")","v":0},{"$f":"IFERROR(VLOOKUP(A185,CADASTRO!C:F,4,0),\"\")","v":"CONFEITARIA DOCE"},{"$f":"IFERROR(VLOOKUP(A185,CADASTRO!C:R,16,0),\"\")","v":""},null,null,null,null,{"$f":"SUMIF(ENTRADAS!A:E,A185,ENTRADAS!E:E)","v":0},"",null,{"$f":"SUMIF(SAÍDAS!A:E,PRODUTOS!A185,SAÍDAS!E:E)","v":0},"",null,0,"",null,0,"",null,0,""]
[256,{"$f":"IF(A186=\"\",\"\",IFERROR(VLOOKUP(A186,CADASTRO!C:F,2,FALSE),\"\"))","v":"TORTA MORANGO"},{"$f":"IFERROR(VLOOKUP(A186,CADASTRO!C:F,3,FALSE),\"\")","v":0},{"$f":"IFERROR(VLOOKUP(A186,CADASTRO!C:F,4,0),\"\")","v":"CONFEITARIA DOCE"},{"$f":"IFERROR(VLOOKUP(A186,CADASTRO!C:R,16,0),\"\")","v":""},null,null,null,null,{"$f":"SUMIF(ENTRADAS!A:E,A186,ENTRADAS!E:E)","v":0},"",null,{"$f":"SUMIF(SAÍDAS!A:E,PRODUTOS!A186,SAÍDAS!E:E)","v":0},"",null,0,"",null,0,"",null,0,""]
[257,{"$f":"IF(A187=\"\",\"\",IFERROR(VLOOKUP(A187,CADASTRO!C:F,2,FALSE),\"\"))","v":"TORTA NEGA MALUCA"},{"$f":"IFERROR(VLOOKUP(A187,CADASTRO!C:F,3,FALSE),\"\")","v":0},{"$f":"IFERROR(VLOOKUP(A187,CADASTRO!C:F,4,0),\"\")","v":"CONFEITARIA DOCE"},{"$f":"IFERROR(VLOOKUP(A187,CADASTRO!C:R,16,0),\"\")","v":""},null,null,null,null,{"$f":"SUMIF(ENTRADAS!A:E,A187,ENTRADAS!E:E)","v":0},"",null,{"$f":"SUMIF(SAÍDAS!A:E,PRODUTOS!A187,SAÍDAS!E:E)","v":0},"",null,0,"",null,0,"",null,0,""]
[258,{"$f":"IF(A188=\"\",\"\",IFERROR(VLOOKUP(A188,CADASTRO!C:F,2,FALSE),\"\"))","v":"TORTA RED VELVET"},{"$f":"IFERROR(VLOOKUP(A188,CADASTRO!C:F,3,FALSE),\"\")","v":0},{"$f":"IFERROR(VLOOKUP(A188,CADASTRO!C:F,4,0),\"\")","v":"CONFEITARIA DOCE"},{"$f":"IFERROR(VLOOKUP(A188,CADASTRO!C:R,16,0),\"\")","v":""},null,null,null,null,{"$f":"SUMIF(ENTRADAS!A:E,A188,ENTRADAS!E:E)","v":0},"",null,{"$f":"SUMIF(SAÍDAS!A:E,PRODUTOS!A188,SAÍDAS!E:E)","v":0},"",null,0,"",null,0,"",null,0,""]
[259,{"$f":"IF(A189=\"\",\"\",IFERROR(VLOOKUP(A189,CADASTRO!C:F,2,FALSE),\"\"))","v":"TORTA SUPREMO"},{"$f":"IFERROR(VLOOKUP(A189,CADASTRO!C:F,3,FALSE),\"\")","v":0},{"$f":"IFERROR(VLOOKUP(A189,CADASTRO!C:F,4,0),\"\")","v":"CONFEITARIA DOCE"},{"$f":"IFERROR(VLOOKUP(A189,CADASTRO!C:R,16,0),\"\")","v":""},null,null,null,null,{"$f":"SUMIF(ENTRADAS!A:E,A189,ENTRADAS!E:E)","v":0},"",null,{"$f":"SUMIF(SAÍDAS!A:E,PRODUTOS!A189,SAÍDAS!E:E)","v":0},"",null,0,"",null,0,"",null,0,""]
[260,{"$f":"IF(A190=\"\",\"\",IFERROR(VLOOKUP(A190,CADASTRO!C:F,2,FALSE),\"\"))","v":"TRANÇA DELICIA CALABRESA"},{"$f":"IFERROR(VLOOKUP(A190,CADASTRO!C:F,3,FALSE),\"\")","v":0},{"$f":"IFERROR(VLOOKUP(A190,CADASTRO!C:F,4,0),\"\")","v":"FOLHATERIA"},{"$f":"IFERROR(VLOOKUP(A190,CADASTRO!C:R,16,0),\"\")","v":""},null,null,null,null,{"$f":"SUMIF(ENTRADAS!A:E,A190,ENTRADAS!E:E)","v":0},"",null,{"$f":"SUMIF(SAÍDAS!A:E,PRODUTOS!A190,SAÍDAS!E:E)","v":0},"",null,0,"",null,0,"",null,0,""]
[261,{"$f":"IF(A191=\"\",\"\",IFERROR(VLOOKUP(A191,CADASTRO!C:F,2,FALSE),\"\"))","v":"TRANÇA DELICIA CARNE"},{"$f":"IFERROR(VLOOKUP(A191,CADASTRO!C:F,3,FALSE),\"\")","v":0},{"$f":"IFERROR(VLOOKUP(A191,CADASTRO!C:F,4,0),\"\")","v":"FOLHATERIA"},{"$f":"IFERROR(VLOOKUP(A191,CADASTRO!C:R,16,0),\"\")","v":""},null,null,null,null,{"$f":"SUMIF(ENTRADAS!A:E,A191,ENTRADAS!E:E)","v":0},"",null,{"$f":"SUMIF(SAÍDAS!A:E,PRODUTOS!A191,SAÍDAS!E:E)","v":0},"",null,0,"",null,0,"",null,0,""]
[262,{"$f":"IF(A192=\"\",\"\",IFERROR(VLOOKUP(A192,CADASTRO!C:F,2,FALSE),\"\"))","v":"TRANÇA DELICIA PEITO DEFUMADO"},{"$f":"IFERROR(VLOOKUP(A192,CADASTRO!C:F,3,FALSE),\"\")","v":0},{"$f":"IFERROR(VLOOKUP(A192,CADASTRO!C:F,4,0),\"\")","v":"FOLHATERIA"},{"$f":"IFERROR(VLOOKUP(A192,CADASTRO!C:R,16,0),\"\")","v":""},null,null,null,null,{"$f":"SUMIF(ENTRADAS!A:E,A192,ENTRADAS!E:E)","v":0},"",null,{"$f":"SUMIF(SAÍDAS!A:E,PRODUTOS!A192,SAÍDAS!E:E)","v":0},"",null,0,"",null,0,"",null,0,""]
[263,{"$f":"IF(A193=\"\",\"\",IFERROR(VLOOKUP(A193,CADASTRO!C:F,2,FALSE),\"\"))","v":"TRANÇA FOLHADA BACALHAU"},{"$f":"IFERROR(VLOOKUP(A193,CADASTRO!C:F,3,FALSE),\"\")","v":0},{"$f":"IFERROR(VLOOKUP(A193,CADASTRO!C:F,4,0),\"\")","v":"FOLHATERIA"},{"$f":"IFERROR(VLOOKUP(A193,CADASTRO!C:R,16,0),\"\")","v":""},null,15,null,null,{"$f":"SUMIF(ENTRADAS!A:E,A193,ENTRADAS!E:E)","v":12},"",null,{"$f":"SUMIF(SAÍDAS!A:E,PRODUTOS!A193,SAÍDAS!E:E)","v":17},"",null,10,"",null,10,"",null,0,""]
[264,{"$f":"IF(A194=\"\",\"\",IFERROR(VLOOKUP(A194,CADASTRO!C:F,2,FALSE),\"\"))","v":"TRANÇA FOLHADA CALABRESA"},{"$f":"IFERROR(VLOOKUP(A194,CADASTRO!C:F,3,FALSE),\"\")","v":0},{"$f":"IFERROR(VLOOKUP(A194,CADASTRO!C:F,4,0),\"\")","v":"FOLHATERIA"},{"$f":"IFERROR(VLOOKUP(A194,CADASTRO!C:R,16,0),\"\")","v":""},null,8,null,null,{"$f":"SUMIF(ENTRADAS!A:E,A194,ENTRADAS!E:E)","v":30},"",null,{"$f":"SUMIF(SAÍDAS!A:E,PRODUTOS!A194,SAÍDAS!E:E)","v":26},"",null,12,"",null,12,"",null,0,""]
[265,{"$f":"IF(A195=\"\",\"\",IFERROR(VLOOKUP(A195,CADASTRO!C:F,2,FALSE),\"\"))","v":"TRANÇA FOLHADA FILÉ"},{"$f":"IFERROR(VLOOKUP(A195,CADASTRO!C:F,3,FALSE),\"\")","v":0},{"$f":"IFERROR(VLOOKUP(A195,CADASTRO!C:F,4,0),\"\")","v":"FOLHATERIA"},{"$f":"IFERROR(VLOOKUP(A195,CADASTRO!C:R,16,0),\"\")","v":""},null,null,null,null,{"$f":"SUMIF(ENTRADAS!A:E,A195,ENTRADAS!E:E)","v":0},"",null,{"$f":"SUMIF(SAÍDAS!A:E,PRODUTOS!A195,SAÍDAS!E:E)","v":0},"",null,{"$f":"G195+J195-M195","v":0},"",null,0,"",null,0,""]
[266,{"$f":"IF(A196=\"\",\"\",IFERROR(VLOOKUP(A196,CADASTRO!C:F,2,FALSE),\"\"))","v":"TRANÇA FOLHADA FRANGO/JAMBU"},{"$f":"IFERROR(VLOOKUP(A196,CADASTRO!C:F,3,FALSE),\"\")","v":0},{"$f":"IFERROR(VLOOKUP(A196,CADASTRO!C:F,4,0),\"\")","v":"FOLHATERIA"},{"$f":"IFERROR(VLOOKUP(A196,CADASTRO!C:R,16,0),\"\")","v":""},null,12,null,null,{"$f":"SUMIF(ENTRADAS!A:E,A196,ENTRADAS!E:E)","v":12},{"$f":"IFERROR(J196*$E196,\"\")","v":""},null,{"$f":"SUMIF(SAÍDAS!A:E,PRODUTOS!A196,SAÍDAS!E:E)","v":15},{"$f":"IFERROR(M196*$E196,\"\")","v":""},null,9,{"$f":"IFERROR(P196*$E196,\"\")","v":""},null,{"$f":"P196","v":9},{"$f":"IFERROR(S196*$E196,\"\")","v":""},null,{"$f":"S196-P196","v":0},{"$f":"IFERROR(V196*$E196,\"\")","v":""}]
[267,{"$f":"IF(A197=\"\",\"\",IFERROR(VLOOKUP(A197,CADASTRO!C:F,2,FALSE),\"\"))","v":"TRANÇA FOLHADA MISTA"},{"$f":"IFERROR(VLOOKUP(A197,CADASTRO!C:F,3,FALSE),\"\")","v":0},{"$f":"IFERROR(VLOOKUP(A197,CADASTRO!C:F,4,0),\"\")","v":"FOLHATERIA"},{"$f":"IFERROR(VLOOKUP(A197,CADASTRO!C:R,16,0),\"\")","v":""},null,null,null,null,{"$f":"SUMIF(ENTRADAS!A:E,A197,ENTRADAS!E:E)","v":36},"",null,{"$f":"SUMIF(SAÍDAS!A:E,PRODUTOS!A197,SAÍDAS!E:E)","v":30},"",null,6,"",null,6,"",null,0,""]
[268,{"$f":"IF(A198=\"\",\"\",IFERROR(VLOOKUP(A198,CADASTRO!C:F,2,FALSE),\"\"))","v":"TRANÇA FOLHADA MORTADELA DEFUMADA"},{"$f":"IFERROR(VLOOKUP(A198,CADASTRO!C:F,3,FALSE),\"\")","v":0},{"$f":"IFERROR(VLOOKUP(A198,CADASTRO!C:F,4,0),\"\")","v":"FOLHATERIA"},{"$f":"IFERROR(VLOOKUP(A198,CADASTRO!C:R,16,0),\"\")","v":""},null,6,null,null,{"$f":"SUMIF(ENTRADAS!A:E,A198,ENTRADAS!E:E)","v":22},"",null,{"$f":"SUMIF(SAÍDAS!A:E,PRODUTOS!A198,SAÍDAS!E:E)","v":14},"",null,14,"",null,14,"",null,0,""]
[269,{"$f":"IF(A199=\"\",\"\",IFERROR(VLOOKUP(A199,CADASTRO!C:F,2,FALSE),\"\"))","v":"TRANÇA FOLHADA PEITO DEFUMADO"},{"$f":"IFERROR(VLOOKUP(A199,CADASTRO!C:F,3,FALSE),\"\")","v":0},{"$f":"IFERROR(VLOOKUP(A199,CADASTRO!C:F,4,0),\"\")","v":"FOLHATERIA"},{"$f":"IFERROR(VLOOKUP(A199,CADASTRO!C:R,16,0),\"\")","v":""},null,null,null,null,{"$f":"SUMIF(ENTRADAS!A:E,A199,ENTRADAS!E:E)","v":24},"",null,{"$f":"SUMIF(SAÍDAS!A:E,PRODUTOS!A199,SAÍDAS!E:E)","v":12},"",null,12,"",null,12,"",null,0,""]
[270,{"$f":"IF(A200=\"\",\"\",IFERROR(VLOOKUP(A200,CADASTRO!C:F,2,FALSE),\"\"))","v":"TRANÇA FOLHADA PERNIL"},{"$f":"IFERROR(VLOOKUP(A200,CADASTRO!C:F,3,FALSE),\"\")","v":0},{"$f":"IFERROR(VLOOKUP(A200,CADASTRO!C:F,4,0),\"\")","v":"FOLHATERIA"},{"$f":"IFERROR(VLOOKUP(A200,CADASTRO!C:R,16,0),\"\")","v":""},null,null,null,null,{"$f":"SUMIF(ENTRADAS!A:E,A200,ENTRADAS!E:E)","v":24},"",null,{"$f":"SUMIF(SAÍDAS!A:E,PRODUTOS!A200,SAÍDAS!E:E)","v":11},"",null,13,"",null,13,"",null,0,""]
[271,{"$f":"IF(A201=\"\",\"\",IFERROR(VLOOKUP(A201,CADASTRO!C:F,2,FALSE),\"\"))","v":"TRANÇA FOLHADA PERU/JAMBU"},{"$f":"IFERROR(VLOOKUP(A201,CADASTRO!C:F,3,FALSE),\"\")","v":0},{"$f":"IFERROR(VLOOKUP(A201,CADASTRO!C:F,4,0),\"\")","v":"FOLHATERIA"},{"$f":"IFERROR(VLOOKUP(A201,CADASTRO!C:R,16,0),\"\")","v":""},null,13,null,null,{"$f":"SUMIF(ENTRADAS!A:E,A201,ENTRADAS!E:E)","v":0},"",null,{"$f":"SUMIF(SAÍDAS!A:E,PRODUTOS!A201,SAÍDAS!E:E)","v":9},"",null,4,"",null,4,"",null,0,""]
[272,{"$f":"IF(A202=\"\",\"\",IFERROR(VLOOKUP(A202,CADASTRO!C:F,2,FALSE),\"\"))","v":"TRANÇA FOLHADA SALAME"},{"$f":"IFERROR(VLOOKUP(A202,CADASTRO!C:F,3,FALSE),\"\")","v":0},{"$f":"IFERROR(VLOOKUP(A202,CADASTRO!C:F,4,0),\"\")","v":"FOLHATERIA"},{"$f":"IFERROR(VLOOKUP(A202,CADASTRO!C:R,16,0),\"\")","v":""},null,10,null,null,{"$f":"SUMIF(ENTRADAS!A:E,A202,ENTRADAS!E:E)","v":0},"",null,{"$f":"SUMIF(SAÍDAS!A:E,PRODUTOS!A202,SAÍDAS!E:E)","v":10},"",null,0,"",null,0,"",null,0,""]
[273,{"$f":"IF(A203=\"\",\"\",IFERROR(VLOOKUP(A203,CADASTRO!C:F,2,FALSE),\"\"))","v":"PÃO BENGALA 5 HORAS"},{"$f":"IFERROR(VLOOKUP(A203,CADASTRO!C:F,3,FALSE),\"\")","v":0},{"$f":"IFERROR(VLOOKUP(A203,CADASTRO!C:F,4,0),\"\")","v":"PADARIA TRADICIONAL"},{"$f":"IFERROR(VLOOKUP(A203,CADASTRO!C:R,16,0),\"\")","v":""},null,65,null,null,{"$f":"SUMIF(ENTRADAS!A:E,A203,ENTRADAS!E:E)","v":20},"",null,{"$f":"SUMIF(SAÍDAS!A:E,PRODUTOS!A203,SAÍDAS!E:E)","v":40},"",null,45,"",null,45,"",null,0,""]
[274,{"$f":"IF(A204=\"\",\"\",IFERROR(VLOOKUP(A204,CADASTRO!C:F,2,FALSE),\"\"))","v":"TRANÇA FOLHADA MIX DE FRIOS"},{"$f":"IFERROR(VLOOKUP(A204,CADASTRO!C:F,3,FALSE),\"\")","v":0},{"$f":"IFERROR(VLOOKUP(A204,CADASTRO!C:F,4,0),\"\")","v":"FOLHATERIA"},{"$f":"IFERROR(VLOOKUP(A204,CADASTRO!C:R,16,0),\"\")","v":""},null,null,null,null,{"$f":"SUMIF(ENTRADAS!A:E,A204,ENTRADAS!E:E)","v":0},"",null,{"$f":"SUMIF(SAÍDAS!A:E,PRODUTOS!A204,SAÍDAS!E:E)","v":0},"",null,0,"",null,0,"",null,0,""]
[275,{"$f":"IF(A205=\"\",\"\",IFERROR(VLOOKUP(A205,CADASTRO!C:F,2,FALSE),\"\"))","v":"TRANÇA FOLHADA CHAPA MISTA"},{"$f":"IFERROR(VLOOKUP(A205,CADASTRO!C:F,3,FALSE),\"\")","v":0},{"$f":"IFERROR(VLOOKUP(A205,CADASTRO!C:F,4,0),\"\")","v":"FOLHATERIA"},{"$f":"IFERROR(VLOOKUP(A205,CADASTRO!C:R,16,0),\"\")","v":""},null,null,null,null,{"$f":"SUMIF(ENTRADAS!A:E,A205,ENTRADAS!E:E)","v":0},"",null,{"$f":"SUMIF(SAÍDAS!A:E,PRODUTOS!A205,SAÍDAS!E:E)","v":0},"",null,{"$f":"G205+J205-M205","v":0},"",null,0,"",null,0,""]
[276,{"$f":"IF(A206=\"\",\"\",IFERROR(VLOOKUP(A206,CADASTRO!C:F,2,FALSE),\"\"))","v":"TRANÇA FOLHADA FRANGO"},{"$f":"IFERROR(VLOOKUP(A206,CADASTRO!C:F,3,FALSE),\"\")","v":0},{"$f":"IFERROR(VLOOKUP(A206,CADASTRO!C:F,4,0),\"\")","v":"FOLHATERIA"},{"$f":"IFERROR(VLOOKUP(A206,CADASTRO!C:R,16,0),\"\")","v":""},null,null,null,null,{"$f":"SUMIF(ENTRADAS!A:E,A206,ENTRADAS!E:E)","v":0},"",null,{"$f":"SUMIF(SAÍDAS!A:E,PRODUTOS!A206,SAÍDAS!E:E)","v":0},"",null,0,"",null,0,"",null,0,""]
[277,{"$f":"IF(A207=\"\",\"\",IFERROR(VLOOKUP(A207,CADASTRO!C:F,2,FALSE),\"\"))","v":"TRANÇA FOLHADA FRANGO/BACON"},{"$f":"IFERROR(VLOOKUP(A207,CADASTRO!C:F,3,FALSE),\"\")","v":0},{"$f":"IFERROR(VLOOKUP(A207,CADASTRO!C:F,4,0),\"\")","v":"FOLHATERIA"},{"$f":"IFERROR(VLOOKUP(A207,CADASTRO!C:R,16,0),\"\")","v":""},null,null,null,null,{"$f":"SUMIF(ENTRADAS!A:E,A207,ENTRADAS!E:E)","v":0},"",null,{"$f":"SUMIF(SAÍDAS!A:E,PRODUTOS!A207,SAÍDAS!E:E)","v":0},"",null,0,"",null,0,"",null,0,""]
[null,{"$f":"IF(A208=\"\",\"\",IFERROR(VLOOKUP(A208,CADASTRO!C:F,2,FALSE),\"\"))","v":""},{"$f":"IFERROR(VLOOKUP(A208,CADASTRO!C:F,3,FALSE),\"\")","v":""},{"$f":"IFERROR(VLOOKUP(A208,CADASTRO!C:F,4,0),\"\")","v":""},{"$f":"IFERROR(VLOOKUP(A208,CADASTRO!C:R,16,0),\"\")","v":""},null,null,{"$f":"IFERROR(G208*$E208,\"\")","v":""},null,{"$f":"SUMIF(ENTRADAS!A:E,A208,ENTRADAS!E:E)","v":0},"",null,{"$f":"SUMIF(SAÍDAS!A:E,PRODUTOS!A208,SAÍDAS!E:E)","v":0},"",null,0,"",null,0,"",null,0,""]
[null,{"$f":"IF(A209=\"\",\"\",IFERROR(VLOOKUP(A209,CADASTRO!C:F,2,FALSE),\"\"))","v":""},{"$f":"IFERROR(VLOOKUP(A209,CADASTRO!C:F,3,FALSE),\"\")","v":""},{"$f":"IFERROR(VLOOKUP(A209,CADASTRO!C:F,4,0),\"\")","v":""},{"$f":"IFERROR(VLOOKUP(A209,CADASTRO!C:R,16,0),\"\")","v":""},null,null,"",null,{"$f":"SUMIF(ENTRADAS!A:E,A209,ENTRADAS!E:E)","v":0},"",null,{"$f":"SUMIF(SAÍDAS!A:E,PRODUTOS!A209,SAÍDAS!E:E)","v":0},"",null,0,"",null,0,"",null,0,""]
[null,{"$f":"IF(A210=\"\",\"\",IFERROR(VLOOKUP(A210,CADASTRO!C:F,2,FALSE),\"\"))","v":""},{"$f":"IFERROR(VLOOKUP(A210,CADASTRO!C:F,3,FALSE),\"\")","v":""},{"$f":"IFERROR(VLOOKUP(A210,CADASTRO!C:F,4,0),\"\")","v":""},{"$f":"IFERROR(VLOOKUP(A210,CADASTRO!C:R,16,0),\"\")","v":""},null,null,"",null,{"$f":"SUMIF(ENTRADAS!A:E,A210,ENTRADAS!E:E)","v":0},"",null,{"$f":"SUMIF(SAÍDAS!A:E,PRODUTOS!A210,SAÍDAS!E:E)","v":0},"",null,0,"",null,0,"",null,0,""]
[null,{"$f":"IF(A211=\"\",\"\",IFERROR(VLOOKUP(A211,CADASTRO!C:F,2,FALSE),\"\"))","v":""},{"$f":"IFERROR(VLOOKUP(A211,CADASTRO!C:F,3,FALSE),\"\")","v":""},{"$f":"IFERROR(VLOOKUP(A211,CADASTRO!C:F,4,0),\"\")","v":""},{"$f":"IFERROR(VLOOKUP(A211,CADASTRO!C:R,16,0),\"\")","v":""},null,null,"",null,{"$f":"SUMIF(ENTRADAS!A:E,A211,ENTRADAS!E:E)","v":0},"",null,{"$f":"SUMIF(SAÍDAS!A:E,PRODUTOS!A211,SAÍDAS!E:E)","v":0},"",null,0,"",null,0,"",null,0,""]
[null,{"$f":"IF(A212=\"\",\"\",IFERROR(VLOOKUP(A212,CADASTRO!C:F,2,FALSE),\"\"))","v":""},{"$f":"IFERROR(VLOOKUP(A212,CADASTRO!C:F,3,FALSE),\"\")","v":""},{"$f":"IFERROR(VLOOKUP(A212,CADASTRO!C:F,4,0),\"\")","v":""},{"$f":"IFERROR(VLOOKUP(A212,CADASTRO!C:R,16,0),\"\")","v":""},null,null,"",null,{"$f":"SUMIF(ENTRADAS!A:E,A212,ENTRADAS!E:E)","v":0},"",null,{"$f":"SUMIF(SAÍDAS!A:E,PRODUTOS!A212,SAÍDAS!E:E)","v":0},"",null,0,"",null,0,"",null,0,""]
[null,{"$f":"IF(A213=\"\",\"\",IFERROR(VLOOKUP(A213,CADASTRO!C:F,2,FALSE),\"\"))","v":""},{"$f":"IFERROR(VLOOKUP(A213,CADASTRO!C:F,3,FALSE),\"\")","v":""},{"$f":"IFERROR(VLOOKUP(A213,CADASTRO!C:F,4,0),\"\")","v":""},{"$f":"IFERROR(VLOOKUP(A213,CADASTRO!C:R,16,0),\"\")","v":""},null,null,"",null,{"$f":"SUMIF(ENTRADAS!A:E,A213,ENTRADAS!E:E)","v":0},"",null,{"$f":"SUMIF(SAÍDAS!A:E,PRODUTOS!A213,SAÍDAS!E:E)","v":0},"",null,0,"",null,0,"",null,0,""]
[null,{"$f":"IF(A214=\"\",\"\",IFERROR(VLOOKUP(A214,CADASTRO!C:F,2,FALSE),\"\"))","v":""},{"$f":"IFERROR(VLOOKUP(A214,CADASTRO!C:F,3,FALSE),\"\")","v":""},{"$f":"IFERROR(VLOOKUP(A214,CADASTRO!C:F,4,0),\"\")","v":""},{"$f":"IFERROR(VLOOKUP(A214,CADASTRO!C:R,16,0),\"\")","v":""},null,null,"",null,{"$f":"SUMIF(ENTRADAS!A:E,A214,ENTRADAS!E:E)","v":0},"",null,{"$f":"SUMIF(SAÍDAS!A:E,PRODUTOS!A214,SAÍDAS!E:E)","v":0},"",null,0,"",null,0,"",null,0,""]
[null,{"$f":"IF(A215=\"\",\"\",IFERROR(VLOOKUP(A215,CADASTRO!C:F,2,FALSE),\"\"))","v":""},{"$f":"IFERROR(VLOOKUP(A215,CADASTRO!C:F,3,FALSE),\"\")","v":""},{"$f":"IFERROR(VLOOKUP(A215,CADASTRO!C:F,4,0),\"\")","v":""},{"$f":"IFERROR(VLOOKUP(A215,CADASTRO!C:R,16,0),\"\")","v":""},null,null,"",null,{"$f":"SUMIF(ENTRADAS!A:E,A215,ENTRADAS!E:E)","v":0},"",null,{"$f":"SUMIF(SAÍDAS!A:E,PRODUTOS!A215,SAÍDAS!E:E)","v":0},"",null,0,"",null,0,"",null,0,""]
[null,{"$f":"IF(A216=\"\",\"\",IFERROR(VLOOKUP(A216,CADASTRO!C:F,2,FALSE),\"\"))","v":""},{"$f":"IFERROR(VLOOKUP(A216,CADASTRO!C:F,3,FALSE),\"\")","v":""},{"$f":"IFERROR(VLOOKUP(A216,CADASTRO!C:F,4,0),\"\")","v":""},{"$f":"IFERROR(VLOOKUP(A216,CADASTRO!C:R,16,0),\"\")","v":""},null,null,"",null,{"$f":"SUMIF(ENTRADAS!A:E,A216,ENTRADAS!E:E)","v":0},"",null,{"$f":"SUMIF(SAÍDAS!A:E,PRODUTOS!A216,SAÍDAS!E:E)","v":0},"",null,{"$f":"G216+J216-M216","v":0},"",null,0,"",null,0,""]
[null,{"$f":"IF(A217=\"\",\"\",IFERROR(VLOOKUP(A217,CADASTRO!C:F,2,FALSE),\"\"))","v":""},{"$f":"IFERROR(VLOOKUP(A217,CADASTRO!C:F,3,FALSE),\"\")","v":""},{"$f":"IFERROR(VLOOKUP(A217,CADASTRO!C:F,4,0),\"\")","v":""},{"$f":"IFERROR(VLOOKUP(A217,CADASTRO!C:R,16,0),\"\")","v":""},null,null,"",null,{"$f":"SUMIF(ENTRADAS!A:E,A217,ENTRADAS!E:E)","v":0},"",null,{"$f":"SUMIF(SAÍDAS!A:E,PRODUTOS!A217,SAÍDAS!E:E)","v":0},"",null,0,"",null,0,"",null,0,""]
[null,{"$f":"IF(A218=\"\",\"\",IFERROR(VLOOKUP(A218,CADASTRO!C:F,2,FALSE),\"\"))","v":""},{"$f":"IFERROR(VLOOKUP(A218,CADASTRO!C:F,3,FALSE),\"\")","v":""},{"$f":"IFERROR(VLOOKUP(A218,CADASTRO!C:F,4,0),\"\")","v":""},{"$f":"IFERROR(VLOOKUP(A218,CADASTRO!C:R,16,0),\"\")","v":""},null,null,"",null,{"$f":"SUMIF(ENTRADAS!A:E,A218,ENTRADAS!E:E)","v":0},"",null,{"$f":"SUMIF(SAÍDAS!A:E,PRODUTOS!A218,SAÍDAS!E:E)","v":0},"",null,0,"",null,0,"",null,0,""]
[null,{"$f":"IF(A219=\"\",\"\",IFERROR(VLOOKUP(A219,CADASTRO!C:F,2,FALSE),\"\"))","v":""},{"$f":"IFERROR(VLOOKUP(A219,CADASTRO!C:F,3,FALSE),\"\")","v":""},{"$f":"IFERROR(VLOOKUP(A219,CADASTRO!C:F,4,0),\"\")","v":""},{"$f":"IFERROR(VLOOKUP(A219,CADASTRO!C:R,16,0),\"\")","v":""},null,null,"",null,{"$f":"SUMIF(ENTRADAS!A:E,A219,ENTRADAS!E:E)","v":0},"",null,{"$f":"SUMIF(SAÍDAS!A:E,PRODUTOS!A219,SAÍDAS!E:E)","v":0},"",null,0,"",null,0,"",null,0,""]
[null,{"$f":"IF(A220=\"\",\"\",IFERROR(VLOOKUP(A220,CADASTRO!C:F,2,FALSE),\"\"))","v":""},{"$f":"IFERROR(VLOOKUP(A220,CADASTRO!C:F,3,FALSE),\"\")","v":""},{"$f":"IFERROR(VLOOKUP(A220,CADASTRO!C:F,4,0),\"\")","v":""},{"$f":"IFERROR(VLOOKUP(A220,CADASTRO!C:R,16,0),\"\")","v":""},null,null,"",null,{"$f":"SUMIF(ENTRADAS!A:E,A220,ENTRADAS!E:E)","v":0},"",null,{"$f":"SUMIF(SAÍDAS!A:E,PRODUTOS!A220,SAÍDAS!E:E)","v":0},"",null,0,"",null,0,"",null,0,""]
[null,{"$f":"IF(A221=\"\",\"\",IFERROR(VLOOKUP(A221,CADASTRO!C:F,2,FALSE),\"\"))","v":""},{"$f":"IFERROR(VLOOKUP(A221,CADASTRO!C:F,3,FALSE),\"\")","v":""},{"$f":"IFERROR(VLOOKUP(A221,CADASTRO!C:F,4,0),\"\")","v":""},{"$f":"IFERROR(VLOOKUP(A221,CADASTRO!C:R,16,0),\"\")","v":""},null,null,"",null,{"$f":"SUMIF(ENTRADAS!A:E,A221,ENTRADAS!E:E)","v":0},"",null,{"$f":"SUMIF(SAÍDAS!A:E,PRODUTOS!A221,SAÍDAS!E:E)","v":0},"",null,0,"",null,0,"",null,0,""]
[null,{"$f":"IF(A222=\"\",\"\",IFERROR(VLOOKUP(A222,CADASTRO!C:F,2,FALSE),\"\"))","v":""},{"$f":"IFERROR(VLOOKUP(A222,CADASTRO!C:F,3,FALSE),\"\")","v":""},{"$f":"IFERROR(VLOOKUP(A222,CADASTRO!C:F,4,0),\"\")","v":""},{"$f":"IFERROR(VLOOKUP(A222,CADASTRO!C:R,16,0),\"\")","v":""},null,null,"",null,{"$f":"SUMIF(ENTRADAS!A:E,A222,ENTRADAS!E:E)","v":0},"",null,{"$f":"SUMIF(SAÍDAS!A:E,PRODUTOS!A222,SAÍDAS!E:E)","v":0},"",null,0,"",null,0,"",null,0,""]
[null,{"$f":"IF(A223=\"\",\"\",IFERROR(VLOOKUP(A223,CADASTRO!C:F,2,FALSE),\"\"))","v":""},{"$f":"IFERROR(VLOOKUP(A223,CADASTRO!C:F,3,FALSE),\"\")","v":""},{"$f":"IFERROR(VLOOKUP(A223,CADASTRO!C:F,4,0),\"\")","v":""},{"$f":"IFERROR(VLOOKUP(A223,CADASTRO!C:R,16,0),\"\")","v":""},null,null,"",null,{"$f":"SUMIF(ENTRADAS!A:E,A223,ENTRADAS!E:E)","v":0},"",null,{"$f":"SUMIF(SAÍDAS!A:E,PRODUTOS!A223,SAÍDAS!E:E)","v":0},"",null,0,"",null,0,"",null,0,""]
[null,{"$f":"IF(A224=\"\",\"\",IFERROR(VLOOKUP(A224,CADASTRO!C:F,2,FALSE),\"\"))","v":""},{"$f":"IFERROR(VLOOKUP(A224,CADASTRO!C:F,3,FALSE),\"\")","v":""},{"$f":"IFERROR(VLOOKUP(A224,CADASTRO!C:F,4,0),\"\")","v":""},{"$f":"IFERROR(VLOOKUP(A224,CADASTRO!C:R,16,0),\"\")","v":""},null,null,"",null,{"$f":"SUMIF(ENTRADAS!A:E,A224,ENTRADAS!E:E)","v":0},"",null,{"$f":"SUMIF(SAÍDAS!A:E,PRODUTOS!A224,SAÍDAS!E:E)","v":0},"",null,0,"",null,0,"",null,0,""]
[null,{"$f":"IF(A225=\"\",\"\",IFERROR(VLOOKUP(A225,CADASTRO!C:F,2,FALSE),\"\"))","v":""},{"$f":"IFERROR(VLOOKUP(A225,CADASTRO!C:F,3,FALSE),\"\")","v":""},{"$f":"IFERROR(VLOOKUP(A225,CADASTRO!C:F,4,0),\"\")","v":""},{"$f":"IFERROR(VLOOKUP(A225,CADASTRO!C:R,16,0),\"\")","v":""},null,null,"",null,{"$f":"SUMIF(ENTRADAS!A:E,A225,ENTRADAS!E:E)","v":0},"",null,{"$f":"SUMIF(SAÍDAS!A:E,PRODUTOS!A225,SAÍDAS!E:E)","v":0},"",null,0,"",null,0,"",null,0,""]
[null,{"$f":"IF(A226=\"\",\"\",IFERROR(VLOOKUP(A226,CADASTRO!C:F,2,FALSE),\"\"))","v":""},{"$f":"IFERROR(VLOOKUP(A226,CADASTRO!C:F,3,FALSE),\"\")","v":""},{"$f":"IFERROR(VLOOKUP(A226,CADASTRO!C:F,4,0),\"\")","v":""},{"$f":"IFERROR(VLOOKUP(A226,CADASTRO!C:R,16,0),\"\")","v":""},null,null,"",null,{"$f":"SUMIF(ENTRADAS!A:E,A226,ENTRADAS!E:E)","v":0},"",null,{"$f":"SUMIF(SAÍDAS!A:E,PRODUTOS!A226,SAÍDAS!E:E)","v":0},"",null,0,"",null,0,"",null,0,""]
[null,{"$f":"IF(A227=\"\",\"\",IFERROR(VLOOKUP(A227,CADASTRO!C:F,2,FALSE),\"\"))","v":""},{"$f":"IFERROR(VLOOKUP(A227,CADASTRO!C:F,3,FALSE),\"\")","v":""},{"$f":"IFERROR(VLOOKUP(A227,CADASTRO!C:F,4,0),\"\")","v":""},{"$f":"IFERROR(VLOOKUP(A227,CADASTRO!C:R,16,0),\"\")","v":""},null,null,"",null,{"$f":"SUMIF(ENTRADAS!A:E,A227,ENTRADAS!E:E)","v":0},"",null,{"$f":"SUMIF(SAÍDAS!A:E,PRODUTOS!A227,SAÍDAS!E:E)","v":0},"",null,0,"",null,0,"",null,0,""]
[null,{"$f":"IF(A228=\"\",\"\",IFERROR(VLOOKUP(A228,CADASTRO!C:F,2,FALSE),\"\"))","v":""},{"$f":"IFERROR(VLOOKUP(A228,CADASTRO!C:F,3,FALSE),\"\")","v":""},{"$f":"IFERROR(VLOOKUP(A228,CADASTRO!C:F,4,0),\"\")","v":""},{"$f":"IFERROR(VLOOKUP(A228,CADASTRO!C:R,16,0),\"\")","v":""},null,null,"",null,{"$f":"SUMIF(ENTRADAS!A:E,A228,ENTRADAS!E:E)","v":0},"",null,{"$f":"SUMIF(SAÍDAS!A:E,PRODUTOS!A228,SAÍDAS!E:E)","v":0},"",null,0,"",null,0,"",null,0,""]
[null,{"$f":"IF(A229=\"\",\"\",IFERROR(VLOOKUP(A229,CADASTRO!C:F,2,FALSE),\"\"))","v":""},{"$f":"IFERROR(VLOOKUP(A229,CADASTRO!C:F,3,FALSE),\"\")","v":""},{"$f":"IFERROR(VLOOKUP(A229,CADASTRO!C:F,4,0),\"\")","v":""},{"$f":"IFERROR(VLOOKUP(A229,CADASTRO!C:R,16,0),\"\")","v":""},null,null,"",null,{"$f":"SUMIF(ENTRADAS!A:E,A229,ENTRADAS!E:E)","v":0},"",null,{"$f":"SUMIF(SAÍDAS!A:E,PRODUTOS!A229,SAÍDAS!E:E)","v":0},"",null,0,"",null,0,"",null,0,""]
[null,{"$f":"IF(A230=\"\",\"\",IFERROR(VLOOKUP(A230,CADASTRO!C:F,2,FALSE),\"\"))","v":""},{"$f":"IFERROR(VLOOKUP(A230,CADASTRO!C:F,3,FALSE),\"\")","v":""},{"$f":"IFERROR(VLOOKUP(A230,CADASTRO!C:F,4,0),\"\")","v":""},{"$f":"IFERROR(VLOOKUP(A230,CADASTRO!C:R,16,0),\"\")","v":""},null,null,"",null,{"$f":"SUMIF(ENTRADAS!A:E,A230,ENTRADAS!E:E)","v":0},"",null,{"$f":"SUMIF(SAÍDAS!A:E,PRODUTOS!A230,SAÍDAS!E:E)","v":0},"",null,0,"",null,0,"",null,0,""]
[null,{"$f":"IF(A231=\"\",\"\",IFERROR(VLOOKUP(A231,CADASTRO!C:F,2,FALSE),\"\"))","v":""},{"$f":"IFERROR(VLOOKUP(A231,CADASTRO!C:F,3,FALSE),\"\")","v":""},{"$f":"IFERROR(VLOOKUP(A231,CADASTRO!C:F,4,0),\"\")","v":""},{"$f":"IFERROR(VLOOKUP(A231,CADASTRO!C:R,16,0),\"\")","v":""},null,null,"",null,{"$f":"SUMIF(ENTRADAS!A:E,A231,ENTRADAS!E:E)","v":0},"",null,{"$f":"SUMIF(SAÍDAS!A:E,PRODUTOS!A231,SAÍDAS!E:E)","v":0},"",null,0,"",null,0,"",null,0,""]
[null,{"$f":"IF(A232=\"\",\"\",IFERROR(VLOOKUP(A232,CADASTRO!C:F,2,FALSE),\"\"))","v":""},{"$f":"IFERROR(VLOOKUP(A232,CADASTRO!C:F,3,FALSE),\"\")","v":""},{"$f":"IFERROR(VLOOKUP(A232,CADASTRO!C:F,4,0),\"\")","v":""},{"$f":"IFERROR(VLOOKUP(A232,CADASTRO!C:R,16,0),\"\")","v":""},null,null,"",null,{"$f":"SUMIF(ENTRADAS!A:E,A232,ENTRADAS!E:E)","v":0},"",null,{"$f":"SUMIF(SAÍDAS!A:E,PRODUTOS!A232,SAÍDAS!E:E)","v":0},"",null,0,"",null,0,"",null,0,""]
[null,{"$f":"IF(A233=\"\",\"\",IFERROR(VLOOKUP(A233,CADASTRO!C:F,2,FALSE),\"\"))","v":""},{"$f":"IFERROR(VLOOKUP(A233,CADASTRO!C:F,3,FALSE),\"\")","v":""},{"$f":"IFERROR(VLOOKUP(A233,CADASTRO!C:F,4,0),\"\")","v":""},{"$f":"IFERROR(VLOOKUP(A233,CADASTRO!C:R,16,0),\"\")","v":""},null,null,"",null,{"$f":"SUMIF(ENTRADAS!A:E,A233,ENTRADAS!E:E)","v":0},"",null,{"$f":"SUMIF(SAÍDAS!A:E,PRODUTOS!A233,SAÍDAS!E:E)","v":0},"",null,0,"",null,0,"",null,0,""]
[null,{"$f":"IF(A234=\"\",\"\",IFERROR(VLOOKUP(A234,CADASTRO!C:F,2,FALSE),\"\"))","v":""},{"$f":"IFERROR(VLOOKUP(A234,CADASTRO!C:F,3,FALSE),\"\")","v":""},{"$f":"IFERROR(VLOOKUP(A234,CADASTRO!C:F,4,0),\"\")","v":""},{"$f":"IFERROR(VLOOKUP(A234,CADASTRO!C:R,16,0),\"\")","v":""},null,null,"",null,{"$f":"SUMIF(ENTRADAS!A:E,A234,ENTRADAS!E:E)","v":0},"",null,{"$f":"SUMIF(SAÍDAS!A:E,PRODUTOS!A234,SAÍDAS!E:E)","v":0},"",null,0,"",null,0,"",null,0,""]
[null,{"$f":"IF(A235=\"\",\"\",IFERROR(VLOOKUP(A235,CADASTRO!C:F,2,FALSE),\"\"))","v":""},{"$f":"IFERROR(VLOOKUP(A235,CADASTRO!C:F,3,FALSE),\"\")","v":""},{"$f":"IFERROR(VLOOKUP(A235,CADASTRO!C:F,4,0),\"\")","v":""},{"$f":"IFERROR(VLOOKUP(A235,CADASTRO!C:R,16,0),\"\")","v":""},null,null,"",null,{"$f":"SUMIF(ENTRADAS!A:E,A235,ENTRADAS!E:E)","v":0},"",null,{"$f":"SUMIF(SAÍDAS!A:E,PRODUTOS!A235,SAÍDAS!E:E)","v":0},"",null,0,"",null,0,"",null,0,""]
[null,{"$f":"IF(A236=\"\",\"\",IFERROR(VLOOKUP(A236,CADASTRO!C:F,2,FALSE),\"\"))","v":""},{"$f":"IFERROR(VLOOKUP(A236,CADASTRO!C:F,3,FALSE),\"\")","v":""},{"$f":"IFERROR(VLOOKUP(A236,CADASTRO!C:F,4,0),\"\")","v":""},{"$f":"IFERROR(VLOOKUP(A236,CADASTRO!C:R,16,0),\"\")","v":""},null,null,"",null,{"$f":"SUMIF(ENTRADAS!A:E,A236,ENTRADAS!E:E)","v":0},"",null,{"$f":"SUMIF(SAÍDAS!A:E,PRODUTOS!A236,SAÍDAS!E:E)","v":0},"",null,0,"",null,0,"",null,0,""]
[null,{"$f":"IF(A237=\"\",\"\",IFERROR(VLOOKUP(A237,CADASTRO!C:F,2,FALSE),\"\"))","v":""},{"$f":"IFERROR(VLOOKUP(A237,CADASTRO!C:F,3,FALSE),\"\")","v":""},{"$f":"IFERROR(VLOOKUP(A237,CADASTRO!C:F,4,0),\"\")","v":""},{"$f":"IFERROR(VLOOKUP(A237,CADASTRO!C:R,16,0),\"\")","v":""},null,null,"",null,{"$f":"SUMIF(ENTRADAS!A:E,A237,ENTRADAS!E:E)","v":0},"",null,{"$f":"SUMIF(SAÍDAS!A:E,PRODUTOS!A237,SAÍDAS!E:E)","v":0},"",null,0,"",null,0,"",null,0,""]
[null,{"$f":"IF(A238=\"\",\"\",IFERROR(VLOOKUP(A238,CADASTRO!C:F,2,FALSE),\"\"))","v":""},{"$f":"IFERROR(VLOOKUP(A238,CADASTRO!C:F,3,FALSE),\"\")","v":""},{"$f":"IFERROR(VLOOKUP(A238,CADASTRO!C:F,4,0),\"\")","v":""},{"$f":"IFERROR(VLOOKUP(A238,CADASTRO!C:R,16,0),\"\")","v":""},null,null,"",null,{"$f":"SUMIF(ENTRADAS!A:E,A238,ENTRADAS!E:E)","v":0},"",null,{"$f":"SUMIF(SAÍDAS!A:E,PRODUTOS!A238,SAÍDAS!E:E)","v":0},"",null,0,"",null,0,"",null,0,""]
[null,{"$f":"IF(A239=\"\",\"\",IFERROR(VLOOKUP(A239,CADASTRO!C:F,2,FALSE),\"\"))","v":""},{"$f":"IFERROR(VLOOKUP(A239,CADASTRO!C:F,3,FALSE),\"\")","v":""},{"$f":"IFERROR(VLOOKUP(A239,CADASTRO!C:F,4,0),\"\")","v":""},{"$f":"IFERROR(VLOOKUP(A239,CADASTRO!C:R,16,0),\"\")","v":""},null,null,"",null,{"$f":"SUMIF(ENTRADAS!A:E,A239,ENTRADAS!E:E)","v":0},"",null,{"$f":"SUMIF(SAÍDAS!A:E,PRODUTOS!A239,SAÍDAS!E:E)","v":0},"",null,0,"",null,0,"",null,0,""]
[null,{"$f":"IF(A240=\"\",\"\",IFERROR(VLOOKUP(A240,CADASTRO!C:F,2,FALSE),\"\"))","v":""},{"$f":"IFERROR(VLOOKUP(A240,CADASTRO!C:F,3,FALSE),\"\")","v":""},{"$f":"IFERROR(VLOOKUP(A240,CADASTRO!C:F,4,0),\"\")","v":""},{"$f":"IFERROR(VLOOKUP(A240,CADASTRO!C:R,16,0),\"\")","v":""},null,null,"",null,{"$f":"SUMIF(ENTRADAS!A:E,A240,ENTRADAS!E:E)","v":0},"",null,{"$f":"SUMIF(SAÍDAS!A:E,PRODUTOS!A240,SAÍDAS!E:E)","v":0},"",null,0,"",null,0,"",null,0,""]
[null,{"$f":"IF(A241=\"\",\"\",IFERROR(VLOOKUP(A241,CADASTRO!C:F,2,FALSE),\"\"))","v":""},{"$f":"IFERROR(VLOOKUP(A241,CADASTRO!C:F,3,FALSE),\"\")","v":""},{"$f":"IFERROR(VLOOKUP(A241,CADASTRO!C:F,4,0),\"\")","v":""},{"$f":"IFERROR(VLOOKUP(A241,CADASTRO!C:R,16,0),\"\")","v":""},null,null,"",null,{"$f":"SUMIF(ENTRADAS!A:E,A241,ENTRADAS!E:E)","v":0},"",null,{"$f":"SUMIF(SAÍDAS!A:E,PRODUTOS!A241,SAÍDAS!E:E)","v":0},"",null,0,"",null,0,"",null,0,""]
[null,{"$f":"IF(A242=\"\",\"\",IFERROR(VLOOKUP(A242,CADASTRO!C:F,2,FALSE),\"\"))","v":""},{"$f":"IFERROR(VLOOKUP(A242,CADASTRO!C:F,3,FALSE),\"\")","v":""},{"$f":"IFERROR(VLOOKUP(A242,CADASTRO!C:F,4,0),\"\")","v":""},{"$f":"IFERROR(VLOOKUP(A242,CADASTRO!C:R,16,0),\"\")","v":""},null,null,"",null,{"$f":"SUMIF(ENTRADAS!A:E,A242,ENTRADAS!E:E)","v":0},"",null,{"$f":"SUMIF(SAÍDAS!A:E,PRODUTOS!A242,SAÍDAS!E:E)","v":0},"",null,0,"",null,0,"",null,0,""]
[null,{"$f":"IF(A243=\"\",\"\",IFERROR(VLOOKUP(A243,CADASTRO!C:F,2,FALSE),\"\"))","v":""},{"$f":"IFERROR(VLOOKUP(A243,CADASTRO!C:F,3,FALSE),\"\")","v":""},{"$f":"IFERROR(VLOOKUP(A243,CADASTRO!C:F,4,0),\"\")","v":""},{"$f":"IFERROR(VLOOKUP(A243,CADASTRO!C:R,16,0),\"\")","v":""},null,null,"",null,{"$f":"SUMIF(ENTRADAS!A:E,A243,ENTRADAS!E:E)","v":0},"",null,{"$f":"SUMIF(SAÍDAS!A:E,PRODUTOS!A243,SAÍDAS!E:E)","v":0},"",null,0,"",null,0,"",null,0,""]
[null,{"$f":"IF(A244=\"\",\"\",IFERROR(VLOOKUP(A244,CADASTRO!C:F,2,FALSE),\"\"))","v":""},{"$f":"IFERROR(VLOOKUP(A244,CADASTRO!C:F,3,FALSE),\"\")","v":""},{"$f":"IFERROR(VLOOKUP(A244,CADASTRO!C:F,4,0),\"\")","v":""},{"$f":"IFERROR(VLOOKUP(A244,CADASTRO!C:R,16,0),\"\")","v":""},null,null,"",null,{"$f":"SUMIF(ENTRADAS!A:E,A244,ENTRADAS!E:E)","v":0},"",null,{"$f":"SUMIF(SAÍDAS!A:E,PRODUTOS!A244,SAÍDAS!E:E)","v":0},"",null,0,"",null,0,"",null,0,""]
[null,{"$f":"IF(A245=\"\",\"\",IFERROR(VLOOKUP(A245,CADASTRO!C:F,2,FALSE),\"\"))","v":""},{"$f":"IFERROR(VLOOKUP(A245,CADASTRO!C:F,3,FALSE),\"\")","v":""},{"$f":"IFERROR(VLOOKUP(A245,CADASTRO!C:F,4,0),\"\")","v":""},{"$f":"IFERROR(VLOOKUP(A245,CADASTRO!C:R,16,0),\"\")","v":""},null,null,"",null,{"$f":"SUMIF(ENTRADAS!A:E,A245,ENTRADAS!E:E)","v":0},"",null,{"$f":"SUMIF(SAÍDAS!A:E,PRODUTOS!A245,SAÍDAS!E:E)","v":0},"",null,0,"",null,0,"",null,0,""]
[null,{"$f":"IF(A246=\"\",\"\",IFERROR(VLOOKUP(A246,CADASTRO!C:F,2,FALSE),\"\"))","v":""},{"$f":"IFERROR(VLOOKUP(A246,CADASTRO!C:F,3,FALSE),\"\")","v":""},{"$f":"IFERROR(VLOOKUP(A246,CADASTRO!C:F,4,0),\"\")","v":""},{"$f":"IFERROR(VLOOKUP(A246,CADASTRO!C:R,16,0),\"\")","v":""},null,null,"",null,{"$f":"SUMIF(ENTRADAS!A:E,A246,ENTRADAS!E:E)","v":0},"",null,{"$f":"SUMIF(SAÍDAS!A:E,PRODUTOS!A246,SAÍDAS!E:E)","v":0},"",null,0,"",null,0,"",null,0,""]
[null,{"$f":"IF(A247=\"\",\"\",IFERROR(VLOOKUP(A247,CADASTRO!C:F,2,FALSE),\"\"))","v":""},{"$f":"IFERROR(VLOOKUP(A247,CADASTRO!C:F,3,FALSE),\"\")","v":""},{"$f":"IFERROR(VLOOKUP(A247,CADASTRO!C:F,4,0),\"\")","v":""},{"$f":"IFERROR(VLOOKUP(A247,CADASTRO!C:R,16,0),\"\")","v":""},null,null,"",null,{"$f":"SUMIF(ENTRADAS!A:E,A247,ENTRADAS!E:E)","v":0},"",null,{"$f":"SUMIF(SAÍDAS!A:E,PRODUTOS!A247,SAÍDAS!E:E)","v":0},"",null,0,"",null,0,"",null,0,""]
[null,{"$f":"IF(A248=\"\",\"\",IFERROR(VLOOKUP(A248,CADASTRO!C:F,2,FALSE),\"\"))","v":""},{"$f":"IFERROR(VLOOKUP(A248,CADASTRO!C:F,3,FALSE),\"\")","v":""},{"$f":"IFERROR(VLOOKUP(A248,CADASTRO!C:F,4,0),\"\")","v":""},{"$f":"IFERROR(VLOOKUP(A248,CADASTRO!C:R,16,0),\"\")","v":""},null,null,"",null,{"$f":"SUMIF(ENTRADAS!A:E,A248,ENTRADAS!E:E)","v":0},"",null,{"$f":"SUMIF(SAÍDAS!A:E,PRODUTOS!A248,SAÍDAS!E:E)","v":0},"",null,0,"",null,0,"",null,0,""]
[null,{"$f":"IF(A249=\"\",\"\",IFERROR(VLOOKUP(A249,CADASTRO!C:F,2,FALSE),\"\"))","v":""},{"$f":"IFERROR(VLOOKUP(A249,CADASTRO!C:F,3,FALSE),\"\")","v":""},{"$f":"IFERROR(VLOOKUP(A249,CADASTRO!C:F,4,0),\"\")","v":""},{"$f":"IFERROR(VLOOKUP(A249,CADASTRO!C:R,16,0),\"\")","v":""},null,null,"",null,{"$f":"SUMIF(ENTRADAS!A:E,A249,ENTRADAS!E:E)","v":0},"",null,{"$f":"SUMIF(SAÍDAS!A:E,PRODUTOS!A249,SAÍDAS!E:E)","v":0},"",null,0,"",null,0,"",null,0,""]
[null,{"$f":"IF(A250=\"\",\"\",IFERROR(VLOOKUP(A250,CADASTRO!C:F,2,FALSE),\"\"))","v":""},{"$f":"IFERROR(VLOOKUP(A250,CADASTRO!C:F,3,FALSE),\"\")","v":""},{"$f":"IFERROR(VLOOKUP(A250,CADASTRO!C:F,4,0),\"\")","v":""},{"$f":"IFERROR(VLOOKUP(A250,CADASTRO!C:R,16,0),\"\")","v":""},null,null,"",null,{"$f":"SUMIF(ENTRADAS!A:E,A250,ENTRADAS!E:E)","v":0},"",null,{"$f":"SUMIF(SAÍDAS!A:E,PRODUTOS!A250,SAÍDAS!E:E)","v":0},"",null,0,"",null,0,"",null,0,""]

{"sheet":"Formulário","index":2,"n_rows":0,"n_cols":0,"rows_kept":0,"cut":false,"hidden":false,"merged":[]}

{"sheet":"ENTRADAS","index":3,"n_rows":409,"n_cols":6,"rows_kept":409,"cut":false,"hidden":false,"merged":[[0,1,0,5]]}
[null,"                Entrada de Produção - Congelados"]
["CÓD","Descrição","Medida","SETOR","Qtde","Data"]
[2,{"$f":"IF(A3=\"\",\"\",IFERROR(VLOOKUP(A3,CADASTRO!C:D,2,FALSE),\"Produto Não Cadastrado\"))","v":"FORMA DE EMPADA"},{"$f":"VLOOKUP(A3,CADASTRO!C:F,3,0)","v":"UND"},{"$f":"VLOOKUP(A3,CADASTRO!C:F,4,0)","v":"PADARIA TRADICIONAL"},205,"2023-02-13"]
[29,{"$f":"IF(A4=\"\",\"\",IFERROR(VLOOKUP(A4,CADASTRO!C:D,2,FALSE),\"Produto Não Cadastrado\"))","v":"CATARINA DE FRANGO"},{"$f":"VLOOKUP(A4,CADASTRO!C:F,3,0)","v":0},{"$f":"VLOOKUP(A4,CADASTRO!C:F,4,0)","v":"FOLHATERIA"},12,"2023-02-13"]
[84,{"$f":"IF(A5=\"\",\"\",IFERROR(VLOOKUP(A5,CADASTRO!C:D,2,FALSE),\"Produto Não Cadastrado\"))","v":"MINI FOLHADO MISTO"},{"$f":"VLOOKUP(A5,CADASTRO!C:F,3,0)","v":0},{"$f":"VLOOKUP(A5,CADASTRO!C:F,4,0)","v":"FOLHATERIA"},4,"2023-02-13"]
[81,{"$f":"IF(A6=\"\",\"\",IFERROR(VLOOKUP(A6,CADASTRO!C:D,2,FALSE),\"Produto Não Cadastrado\"))","v":"MINI FOLHADO DE QUEIJO"},{"$f":"VLOOKUP(A6,CADASTRO!C:F,3,0)","v":0},{"$f":"VLOOKUP(A6,CADASTRO!C:F,4,0)","v":"FOLHATERIA"},3.8,"2023-02-13"]
[144,{"$f":"IF(A7=\"\",\"\",IFERROR(VLOOKUP(A7,CADASTRO!C:D,2,FALSE),\"Produto Não Cadastrado\"))","v":"PÃO DE ROSAS"},{"$f":"VLOOKUP(A7,CADASTRO!C:F,3,0)","v":0},{"$f":"VLOOKUP(A7,CADASTRO!C:F,4,0)","v":"FOLHATERIA"},21,"2023-02-13"]
[80,{"$f":"IF(A8=\"\",\"\",IFERROR(VLOOKUP(A8,CADASTRO!C:D,2,FALSE),\"Produto Não Cadastrado\"))","v":"MINI FOLHADO CUPUAÇU"},{"$f":"IFERROR(VLOOKUP(A8,CADASTRO!C:F,3,0),\"\")","v":0},{"$f":"VLOOKUP(A8,CADASTRO!C:F,4,0)","v":"FOLHATERIA"},7.5,"2023-02-13"]
[81,{"$f":"IF(A9=\"\",\"\",IFERROR(VLOOKUP(A9,CADASTRO!C:D,2,FALSE),\"Produto Não Cadastrado\"))","v":"MINI FOLHADO DE QUEIJO"},{"$f":"IFERROR(VLOOKUP(A9,CADASTRO!C:F,3,0),\"\")","v":0},{"$f":"VLOOKUP(A9,CADASTRO!C:F,4,0)","v":"FOLHATERIA"},7.63,"2023-02-13"]
[82,{"$f":"IF(A10=\"\",\"\",IFERROR(VLOOKUP(A10,CADASTRO!C:D,2,FALSE),\"Produto Não Cadastrado\"))","v":"MINI FOLHADO FRANGO"},{"$f":"IFERROR(VLOOKUP(A10,CADASTRO!C:F,3,0),\"\")","v":0},{"$f":"VLOOKUP(A10,CADASTRO!C:F,4,0)","v":"FOLHATERIA"},7.43,"2023-02-13"]
[89,{"$f":"IF(A11=\"\",\"\",IFERROR(VLOOKUP(A11,CADASTRO!C:D,2,FALSE),\"Produto Não Cadastrado\"))","v":"MINI PÃO BATATA HAMBÚRGUER"},{"$f":"IFERROR(VLOOKUP(A11,CADASTRO!C:F,3,0),\"\")","v":0},{"$f":"VLOOKUP(A11,CADASTRO!C:F,4,0)","v":"PADARIA TRADICIONAL"},306,"2023-02-13"]
[135,{"$f":"IF(A12=\"\",\"\",IFERROR(VLOOKUP(A12,CADASTRO!C:D,2,FALSE),\"Produto Não Cadastrado\"))","v":"PÃO DE BATATA FILÃO"},{"$f":"IFERROR(VLOOKUP(A12,CADASTRO!C:F,3,0),\"\")","v":0},{"$f":"VLOOKUP(A12,CADASTRO!C:F,4,0)","v":"PADARIA TRADICIONAL"},300,"2023-02-13"]
[92,{"$f":"IF(A13=\"\",\"\",IFERROR(VLOOKUP(A13,CADASTRO!C:D,2,FALSE),\"Produto Não Cadastrado\"))","v":"MINI PÃO DELÍCIA  (PCT C/ 24UND)"},{"$f":"IFERROR(VLOOKUP(A13,CADASTRO!C:F,3,0),\"\")","v":0},{"$f":"VLOOKUP(A13,CADASTRO!C:F,4,0)","v":"PADARIA TRADICIONAL"},18,"2023-02-13"]
[49,{"$f":"IF(A14=\"\",\"\",IFERROR(VLOOKUP(A14,CADASTRO!C:D,2,FALSE),\"Produto Não Cadastrado\"))","v":"DONNUTS"},{"$f":"IFERROR(VLOOKUP(A14,CADASTRO!C:F,3,0),\"\")","v":0},{"$f":"VLOOKUP(A14,CADASTRO!C:F,4,0)","v":"PADARIA TRADICIONAL"},94,"2023-02-13"]
[158,{"$f":"IF(A15=\"\",\"\",IFERROR(VLOOKUP(A15,CADASTRO!C:D,2,FALSE),\"Produto Não Cadastrado\"))","v":"PÃO FORMA MILHO A25"},{"$f":"IFERROR(VLOOKUP(A15,CADASTRO!C:F,3,0),\"\")","v":0},{"$f":"VLOOKUP(A15,CADASTRO!C:F,4,0)","v":"PADARIA TRADICIONAL"},86,"2023-02-13"]
[71,{"$f":"IF(A16=\"\",\"\",IFERROR(VLOOKUP(A16,CADASTRO!C:D,2,FALSE),\"Produto Não Cadastrado\"))","v":"MASSA MINI PIZZA"},{"$f":"IFERROR(VLOOKUP(A16,CADASTRO!C:F,3,0),\"\")","v":0},{"$f":"VLOOKUP(A16,CADASTRO!C:F,4,0)","v":"PADARIA TRADICIONAL"},5,"2023-02-13"]
[88,{"$f":"IF(A17=\"\",\"\",IFERROR(VLOOKUP(A17,CADASTRO!C:D,2,FALSE),\"Produto Não Cadastrado\"))","v":"MINI PÃO BATATA (ERVAS,PARMESÃO)"},{"$f":"IFERROR(VLOOKUP(A17,CADASTRO!C:F,3,0),\"\")","v":0},{"$f":"VLOOKUP(A17,CADASTRO!C:F,4,0)","v":"PADARIA TRADICIONAL"},1400,"2023-02-14"]
[89,{"$f":"IF(A18=\"\",\"\",IFERROR(VLOOKUP(A18,CADASTRO!C:D,2,FALSE),\"Produto Não Cadastrado\"))","v":"MINI PÃO BATATA HAMBÚRGUER"},{"$f":"IFERROR(VLOOKUP(A18,CADASTRO!C:F,3,0),\"\")","v":0},{"$f":"VLOOKUP(A18,CADASTRO!C:F,4,0)","v":"PADARIA TRADICIONAL"},558,"2023-02-14"]
[91,{"$f":"IF(A19=\"\",\"\",IFERROR(VLOOKUP(A19,CADASTRO!C:D,2,FALSE),\"Produto Não Cadastrado\"))","v":"MINI PÃO BRIOCHE (PCT C/ 24UND)"},{"$f":"IFERROR(VLOOKUP(A19,CADASTRO!C:F,3,0),\"\")","v":0},{"$f":"VLOOKUP(A19,CADASTRO!C:F,4,0)","v":"PADARIA TRADICIONAL"},8,"2023-02-14"]
[123,{"$f":"IF(A20=\"\",\"\",IFERROR(VLOOKUP(A20,CADASTRO!C:D,2,FALSE),\"Produto Não Cadastrado\"))","v":"PÃO BRIOCHE DE FORMA  1000"},{"$f":"IFERROR(VLOOKUP(A20,CADASTRO!C:F,3,0),\"\")","v":0},{"$f":"VLOOKUP(A20,CADASTRO!C:F,4,0)","v":"PADARIA TRADICIONAL"},14,"2023-02-14"]
[159,{"$f":"IF(A21=\"\",\"\",IFERROR(VLOOKUP(A21,CADASTRO!C:D,2,FALSE),\"Produto Não Cadastrado\"))","v":"PÃO FORMA TRADICIONAL 1000"},{"$f":"IFERROR(VLOOKUP(A21,CADASTRO!C:F,3,0),\"\")","v":0},{"$f":"VLOOKUP(A21,CADASTRO!C:F,4,0)","v":"PADARIA TRADICIONAL"},28,"2023-02-14"]
[167,{"$f":"IF(A22=\"\",\"\",IFERROR(VLOOKUP(A22,CADASTRO!C:D,2,FALSE),\"Produto Não Cadastrado\"))","v":"PÃO QUEIJO CALABRESA"},{"$f":"IFERROR(VLOOKUP(A22,CADASTRO!C:F,3,0),\"\")","v":0},{"$f":"VLOOKUP(A22,CADASTRO!C:F,4,0)","v":"PADARIA TRADICIONAL"},21,"2023-02-14"]
[160,{"$f":"IF(A23=\"\",\"\",IFERROR(VLOOKUP(A23,CADASTRO!C:D,2,FALSE),\"Produto Não Cadastrado\"))","v":"PÃO FORMA TRADICIONAL 700"},{"$f":"IFERROR(VLOOKUP(A23,CADASTRO!C:F,3,0),\"\")","v":0},{"$f":"VLOOKUP(A23,CADASTRO!C:F,4,0)","v":"PADARIA TRADICIONAL"},18,"2023-02-14"]
[41,{"$f":"IF(A24=\"\",\"\",IFERROR(VLOOKUP(A24,CADASTRO!C:D,2,FALSE),\"Produto Não Cadastrado\"))","v":"CROISSANT CONGELADO "},{"$f":"IFERROR(VLOOKUP(A24,CADASTRO!C:F,3,0),\"\")","v":0},{"$f":"VLOOKUP(A24,CADASTRO!C:F,4,0)","v":"PADARIA TRADICIONAL"},653,"2023-02-14"]
[61,{"$f":"IF(A25=\"\",\"\",IFERROR(VLOOKUP(A25,CADASTRO!C:D,2,FALSE),\"Produto Não Cadastrado\"))","v":"FOCACCIA TABULEIRO"},{"$f":"IFERROR(VLOOKUP(A25,CADASTRO!C:F,3,0),\"\")","v":0},{"$f":"VLOOKUP(A25,CADASTRO!C:F,4,0)","v":"PADARIA RÚSTICA"},1,"2023-02-14"]
[111,{"$f":"IF(A26=\"\",\"\",IFERROR(VLOOKUP(A26,CADASTRO!C:D,2,FALSE),\"Produto Não Cadastrado\"))","v":"PALITO QUEIJO"},{"$f":"IFERROR(VLOOKUP(A26,CADASTRO!C:F,3,0),\"\")","v":0},{"$f":"VLOOKUP(A26,CADASTRO!C:F,4,0)","v":"FOLHATERIA"},7.4,"2023-02-14"]
[110,{"$f":"IF(A27=\"\",\"\",IFERROR(VLOOKUP(A27,CADASTRO!C:D,2,FALSE),\"Produto Não Cadastrado\"))","v":"PALITO CANELA"},{"$f":"IFERROR(VLOOKUP(A27,CADASTRO!C:F,3,0),\"\")","v":0},{"$f":"VLOOKUP(A27,CADASTRO!C:F,4,0)","v":"FOLHATERIA"},7.7,"2023-02-14"]
[28,{"$f":"IF(A28=\"\",\"\",IFERROR(VLOOKUP(A28,CADASTRO!C:D,2,FALSE),\"Produto Não Cadastrado\"))","v":"CATARINA DE BACALHAU "},{"$f":"IFERROR(VLOOKUP(A28,CADASTRO!C:F,3,0),\"\")","v":0},{"$f":"VLOOKUP(A28,CADASTRO!C:F,4,0)","v":"FOLHATERIA"},12,"2023-02-14"]
[161,{"$f":"IF(A29=\"\",\"\",IFERROR(VLOOKUP(A29,CADASTRO!C:D,2,FALSE),\"Produto Não Cadastrado\"))","v":"PÃO FRANCÊS 10H"},{"$f":"IFERROR(VLOOKUP(A29,CADASTRO!C:F,3,0),\"\")","v":0},{"$f":"VLOOKUP(A29,CADASTRO!C:F,4,0)","v":"PADARIA TRADICIONAL"},50,"2023-02-14"]
[84,{"$f":"IF(A30=\"\",\"\",IFERROR(VLOOKUP(A30,CADASTRO!C:D,2,FALSE),\"Produto Não Cadastrado\"))","v":"MINI FOLHADO MISTO"},{"$f":"IFERROR(VLOOKUP(A30,CADASTRO!C:F,3,0),\"\")","v":0},{"$f":"VLOOKUP(A30,CADASTRO!C:F,4,0)","v":"FOLHATERIA"},10.82,"2023-02-14"]
[11,{"$f":"IF(A31=\"\",\"\",IFERROR(VLOOKUP(A31,CADASTRO!C:D,2,FALSE),\"Produto Não Cadastrado\"))","v":"BISCOITO ACEBOLADO"},{"$f":"IFERROR(VLOOKUP(A31,CADASTRO!C:F,3,0),\"\")","v":0},{"$f":"VLOOKUP(A31,CADASTRO!C:F,4,0)","v":"PADARIA TRADICIONAL"},9.5500000000000007,"2023-02-14"]
[19,{"$f":"IF(A32=\"\",\"\",IFERROR(VLOOKUP(A32,CADASTRO!C:D,2,FALSE),\"Produto Não Cadastrado\"))","v":"BISCOITO PAI D'ÉGUA"},{"$f":"IFERROR(VLOOKUP(A32,CADASTRO!C:F,3,0),\"\")","v":0},{"$f":"VLOOKUP(A32,CADASTRO!C:F,4,0)","v":"PADARIA TRADICIONAL"},11.35,"2023-02-14"]
[8,{"$f":"IF(A33=\"\",\"\",IFERROR(VLOOKUP(A33,CADASTRO!C:D,2,FALSE),\"Produto Não Cadastrado\"))","v":"BAGUETE INTEGRAL (PCT C/ 45 UND = 3 KG)"},{"$f":"IFERROR(VLOOKUP(A33,CADASTRO!C:F,3,0),\"\")","v":0},{"$f":"VLOOKUP(A33,CADASTRO!C:F,4,0)","v":"PADARIA TRADICIONAL"},12,"2023-02-15"]
[244,{"$f":"IF(A34=\"\",\"\",IFERROR(VLOOKUP(A34,CADASTRO!C:D,2,FALSE),\"Produto Não Cadastrado\"))","v":"ROSQUINHA DE LEITE (PCT C/ 32UND)"},{"$f":"IFERROR(VLOOKUP(A34,CADASTRO!C:F,3,0),\"\")","v":0},{"$f":"VLOOKUP(A34,CADASTRO!C:F,4,0)","v":"PADARIA TRADICIONAL"},9,"2023-02-15"]
[155,{"$f":"IF(A35=\"\",\"\",IFERROR(VLOOKUP(A35,CADASTRO!C:D,2,FALSE),\"Produto Não Cadastrado\"))","v":"PÃO FORMA INTEGRAL 1000"},{"$f":"IFERROR(VLOOKUP(A35,CADASTRO!C:F,3,0),\"\")","v":0},{"$f":"VLOOKUP(A35,CADASTRO!C:F,4,0)","v":"PADARIA TRADICIONAL"},29,"2023-02-15"]
[156,{"$f":"IF(A36=\"\",\"\",IFERROR(VLOOKUP(A36,CADASTRO!C:D,2,FALSE),\"Produto Não Cadastrado\"))","v":"PÃO FORMA INTEGRAL 700"},{"$f":"IFERROR(VLOOKUP(A36,CADASTRO!C:F,3,0),\"\")","v":0},{"$f":"VLOOKUP(A36,CADASTRO!C:F,4,0)","v":"PADARIA TRADICIONAL"},18,"2023-02-15"]
[181,{"$f":"IF(A37=\"\",\"\",IFERROR(VLOOKUP(A37,CADASTRO!C:D,2,FALSE),\"Produto Não Cadastrado\"))","v":"PIZZA INTEGRAL (MASSA)"},{"$f":"IFERROR(VLOOKUP(A37,CADASTRO!C:F,3,0),\"\")","v":0},{"$f":"VLOOKUP(A37,CADASTRO!C:F,4,0)","v":"PADARIA TRADICIONAL"},16,"2023-02-15"]
[66,{"$f":"IF(A38=\"\",\"\",IFERROR(VLOOKUP(A38,CADASTRO!C:D,2,FALSE),\"Produto Não Cadastrado\"))","v":"LASANHA FOLHADA MISTA"},{"$f":"IFERROR(VLOOKUP(A38,CADASTRO!C:F,3,0),\"\")","v":0},{"$f":"VLOOKUP(A38,CADASTRO!C:F,4,0)","v":"FOLHATERIA"},1,"2023-02-15"]
[267,{"$f":"IF(A39=\"\",\"\",IFERROR(VLOOKUP(A39,CADASTRO!C:D,2,FALSE),\"Produto Não Cadastrado\"))","v":"TRANÇA FOLHADA MISTA"},{"$f":"IFERROR(VLOOKUP(A39,CADASTRO!C:F,3,0),\"\")","v":0},{"$f":"VLOOKUP(A39,CADASTRO!C:F,4,0)","v":"FOLHATERIA"},18,"2023-02-15"]
[98,{"$f":"IF(A40=\"\",\"\",IFERROR(VLOOKUP(A40,CADASTRO!C:D,2,FALSE),\"Produto Não Cadastrado\"))","v":"MINI TRANÇA MISTA"},{"$f":"IFERROR(VLOOKUP(A40,CADASTRO!C:F,3,0),\"\")","v":0},{"$f":"VLOOKUP(A40,CADASTRO!C:F,4,0)","v":"FOLHATERIA"},16,"2023-02-15"]
[268,{"$f":"IF(A41=\"\",\"\",IFERROR(VLOOKUP(A41,CADASTRO!C:D,2,FALSE),\"Produto Não Cadastrado\"))","v":"TRANÇA FOLHADA MORTADELA DEFUMADA"},{"$f":"IFERROR(VLOOKUP(A41,CADASTRO!C:F,3,0),\"\")","v":0},{"$f":"VLOOKUP(A41,CADASTRO!C:F,4,0)","v":"FOLHATERIA"},22,"2023-02-15"]
[79,{"$f":"IF(A42=\"\",\"\",IFERROR(VLOOKUP(A42,CADASTRO!C:D,2,FALSE),\"Produto Não Cadastrado\"))","v":"MINI FOLHADO CALABRESA"},{"$f":"IFERROR(VLOOKUP(A42,CADASTRO!C:F,3,0),\"\")","v":0},{"$f":"VLOOKUP(A42,CADASTRO!C:F,4,0)","v":"FOLHATERIA"},4.0999999999999996,"2023-02-15"]
[61,{"$f":"IF(A43=\"\",\"\",IFERROR(VLOOKUP(A43,CADASTRO!C:D,2,FALSE),\"Produto Não Cadastrado\"))","v":"FOCACCIA TABULEIRO"},{"$f":"IFERROR(VLOOKUP(A43,CADASTRO!C:F,3,0),\"\")","v":0},{"$f":"VLOOKUP(A43,CADASTRO!C:F,4,0)","v":"PADARIA RÚSTICA"},5,"2023-02-15"]
[124,{"$f":"IF(A44=\"\",\"\",IFERROR(VLOOKUP(A44,CADASTRO!C:D,2,FALSE),\"Produto Não Cadastrado\"))","v":"PÃO BRIOCHE HAMBÚRGUER"},{"$f":"IFERROR(VLOOKUP(A44,CADASTRO!C:F,3,0),\"\")","v":0},{"$f":"VLOOKUP(A44,CADASTRO!C:F,4,0)","v":"PADARIA TRADICIONAL"},60,"2023-02-15"]
[44,{"$f":"IF(A45=\"\",\"\",IFERROR(VLOOKUP(A45,CADASTRO!C:D,2,FALSE),\"Produto Não Cadastrado\"))","v":"DANISH CAPRESE"},{"$f":"IFERROR(VLOOKUP(A45,CADASTRO!C:F,3,0),\"\")","v":0},{"$f":"VLOOKUP(A45,CADASTRO!C:F,4,0)","v":"FOLHATERIA"},52,"2023-02-16"]
[121,{"$f":"IF(A46=\"\",\"\",IFERROR(VLOOKUP(A46,CADASTRO!C:D,2,FALSE),\"Produto Não Cadastrado\"))","v":"PÃO BAIÃO"},{"$f":"IFERROR(VLOOKUP(A46,CADASTRO!C:F,3,0),\"\")","v":0},{"$f":"VLOOKUP(A46,CADASTRO!C:F,4,0)","v":"PADARIA TRADICIONAL"},211,"2023-02-16"]
[60,{"$f":"IF(A47=\"\",\"\",IFERROR(VLOOKUP(A47,CADASTRO!C:D,2,FALSE),\"Produto Não Cadastrado\"))","v":"FOCACCIA RUSTICA  CALABRESA (MASSA)"},{"$f":"IFERROR(VLOOKUP(A47,CADASTRO!C:F,3,0),\"\")","v":0},{"$f":"VLOOKUP(A47,CADASTRO!C:F,4,0)","v":"PADARIA RÚSTICA"},18,"2023-02-16"]
[41,{"$f":"IF(A48=\"\",\"\",IFERROR(VLOOKUP(A48,CADASTRO!C:D,2,FALSE),\"Produto Não Cadastrado\"))","v":"CROISSANT CONGELADO "},{"$f":"IFERROR(VLOOKUP(A48,CADASTRO!C:F,3,0),\"\")","v":0},{"$f":"VLOOKUP(A48,CADASTRO!C:F,4,0)","v":"PADARIA TRADICIONAL"},1256,"2023-02-16"]
[154,{"$f":"IF(A49=\"\",\"\",IFERROR(VLOOKUP(A49,CADASTRO!C:D,2,FALSE),\"Produto Não Cadastrado\"))","v":"PÃO FORMA BRIOCHE A25"},{"$f":"IFERROR(VLOOKUP(A49,CADASTRO!C:F,3,0),\"\")","v":0},{"$f":"VLOOKUP(A49,CADASTRO!C:F,4,0)","v":"PADARIA TRADICIONAL"},87,"2023-02-16"]
[157,{"$f":"IF(A50=\"\",\"\",IFERROR(VLOOKUP(A50,CADASTRO!C:D,2,FALSE),\"Produto Não Cadastrado\"))","v":"PÃO FORMA LEITE A25"},{"$f":"IFERROR(VLOOKUP(A50,CADASTRO!C:F,3,0),\"\")","v":0},{"$f":"VLOOKUP(A50,CADASTRO!C:F,4,0)","v":"PADARIA TRADICIONAL"},39,"2023-02-16"]
[172,{"$f":"IF(A51=\"\",\"\",IFERROR(VLOOKUP(A51,CADASTRO!C:D,2,FALSE),\"Produto Não Cadastrado\"))","v":"PASTEL DE BELÉM (MASSA)"},{"$f":"IFERROR(VLOOKUP(A51,CADASTRO!C:F,3,0),\"\")","v":0},{"$f":"VLOOKUP(A51,CADASTRO!C:F,4,0)","v":"FOLHATERIA"},8,"2023-02-16"]
[28,{"$f":"IF(A52=\"\",\"\",IFERROR(VLOOKUP(A52,CADASTRO!C:D,2,FALSE),\"Produto Não Cadastrado\"))","v":"CATARINA DE BACALHAU "},{"$f":"IFERROR(VLOOKUP(A52,CADASTRO!C:F,3,0),\"\")","v":0},{"$f":"VLOOKUP(A52,CADASTRO!C:F,4,0)","v":"FOLHATERIA"},12,"2023-02-16"]
[180,{"$f":"IF(A53=\"\",\"\",IFERROR(VLOOKUP(A53,CADASTRO!C:D,2,FALSE),\"Produto Não Cadastrado\"))","v":"PIZZA FOLHADA MIX FRIOS "},{"$f":"IFERROR(VLOOKUP(A53,CADASTRO!C:F,3,0),\"\")","v":0},{"$f":"VLOOKUP(A53,CADASTRO!C:F,4,0)","v":"FOLHATERIA"},85,"2023-02-16"]
[95,{"$f":"IF(A54=\"\",\"\",IFERROR(VLOOKUP(A54,CADASTRO!C:D,2,FALSE),\"Produto Não Cadastrado\"))","v":"MINI TRANÇA CALABRESA"},{"$f":"IFERROR(VLOOKUP(A54,CADASTRO!C:F,3,0),\"\")","v":0},{"$f":"VLOOKUP(A54,CADASTRO!C:F,4,0)","v":"FOLHATERIA"},16,"2023-02-16"]
[83,{"$f":"IF(A55=\"\",\"\",IFERROR(VLOOKUP(A55,CADASTRO!C:D,2,FALSE),\"Produto Não Cadastrado\"))","v":"MINI FOLHADO GOIABADA"},{"$f":"IFERROR(VLOOKUP(A55,CADASTRO!C:F,3,0),\"\")","v":0},{"$f":"VLOOKUP(A55,CADASTRO!C:F,4,0)","v":"FOLHATERIA"},6.38,"2023-02-16"]
[80,{"$f":"IF(A56=\"\",\"\",IFERROR(VLOOKUP(A56,CADASTRO!C:D,2,FALSE),\"Produto Não Cadastrado\"))","v":"MINI FOLHADO CUPUAÇU"},{"$f":"IFERROR(VLOOKUP(A56,CADASTRO!C:F,3,0),\"\")","v":0},{"$f":"VLOOKUP(A56,CADASTRO!C:F,4,0)","v":"FOLHATERIA"},7.81,"2023-02-16"]
[161,{"$f":"IF(A57=\"\",\"\",IFERROR(VLOOKUP(A57,CADASTRO!C:D,2,FALSE),\"Produto Não Cadastrado\"))","v":"PÃO FRANCÊS 10H"},{"$f":"IFERROR(VLOOKUP(A57,CADASTRO!C:F,3,0),\"\")","v":0},{"$f":"VLOOKUP(A57,CADASTRO!C:F,4,0)","v":"PADARIA TRADICIONAL"},38,"2023-02-16"]
[163,{"$f":"IF(A58=\"\",\"\",IFERROR(VLOOKUP(A58,CADASTRO!C:D,2,FALSE),\"Produto Não Cadastrado\"))","v":"PÃO FRANCÊS 5H"},{"$f":"IFERROR(VLOOKUP(A58,CADASTRO!C:F,3,0),\"\")","v":0},{"$f":"VLOOKUP(A58,CADASTRO!C:F,4,0)","v":"PADARIA TRADICIONAL"},38,"2023-02-16"]
[116,{"$f":"IF(A59=\"\",\"\",IFERROR(VLOOKUP(A59,CADASTRO!C:D,2,FALSE),\"Produto Não Cadastrado\"))","v":"PÃO BAGUETE 10 HORAS"},{"$f":"IFERROR(VLOOKUP(A59,CADASTRO!C:F,3,0),\"\")","v":0},{"$f":"VLOOKUP(A59,CADASTRO!C:F,4,0)","v":"PADARIA TRADICIONAL"},10,"2023-02-16"]
[93,{"$f":"IF(A60=\"\",\"\",IFERROR(VLOOKUP(A60,CADASTRO!C:D,2,FALSE),\"Produto Não Cadastrado\"))","v":"MINI PASTEL FOLHADO"},{"$f":"IFERROR(VLOOKUP(A60,CADASTRO!C:F,3,0),\"\")","v":0},{"$f":"VLOOKUP(A60,CADASTRO!C:F,4,0)","v":"FOLHATERIA"},6.77,"2023-02-16"]
[81,{"$f":"IF(A61=\"\",\"\",IFERROR(VLOOKUP(A61,CADASTRO!C:D,2,FALSE),\"Produto Não Cadastrado\"))","v":"MINI FOLHADO DE QUEIJO"},{"$f":"IFERROR(VLOOKUP(A61,CADASTRO!C:F,3,0),\"\")","v":0},{"$f":"VLOOKUP(A61,CADASTRO!C:F,4,0)","v":"FOLHATERIA"},7,"2023-02-16"]
[14,{"$f":"IF(A62=\"\",\"\",IFERROR(VLOOKUP(A62,CADASTRO!C:D,2,FALSE),\"Produto Não Cadastrado\"))","v":"BISCOITO COCO"},{"$f":"IFERROR(VLOOKUP(A62,CADASTRO!C:F,3,0),\"\")","v":0},{"$f":"VLOOKUP(A62,CADASTRO!C:F,4,0)","v":"PADARIA TRADICIONAL"},11.25,"2023-02-16"]
[17,{"$f":"IF(A63=\"\",\"\",IFERROR(VLOOKUP(A63,CADASTRO!C:D,2,FALSE),\"Produto Não Cadastrado\"))","v":"BISCOITO MONTEIRO LOPES"},{"$f":"IFERROR(VLOOKUP(A63,CADASTRO!C:F,3,0),\"\")","v":0},{"$f":"VLOOKUP(A63,CADASTRO!C:F,4,0)","v":"PADARIA TRADICIONAL"},19.73,"2023-02-16"]
[87,{"$f":"IF(A64=\"\",\"\",IFERROR(VLOOKUP(A64,CADASTRO!C:D,2,FALSE),\"Produto Não Cadastrado\"))","v":"MINI PAIN AU CHOCOLAT "},{"$f":"IFERROR(VLOOKUP(A64,CADASTRO!C:F,3,0),\"\")","v":0},{"$f":"VLOOKUP(A64,CADASTRO!C:F,4,0)","v":"FOLHATERIA"},7.13,"2023-02-16"]
[175,{"$f":"IF(A65=\"\",\"\",IFERROR(VLOOKUP(A65,CADASTRO!C:D,2,FALSE),\"Produto Não Cadastrado\"))","v":"PASTEL FOLHADO MISTO "},{"$f":"IFERROR(VLOOKUP(A65,CADASTRO!C:F,3,0),\"\")","v":0},{"$f":"VLOOKUP(A65,CADASTRO!C:F,4,0)","v":"FOLHATERIA"},108,"2023-02-16"]
[176,{"$f":"IF(A66=\"\",\"\",IFERROR(VLOOKUP(A66,CADASTRO!C:D,2,FALSE),\"Produto Não Cadastrado\"))","v":"PASTEL FOLHADO QUEIJO "},{"$f":"IFERROR(VLOOKUP(A66,CADASTRO!C:F,3,0),\"\")","v":0},{"$f":"VLOOKUP(A66,CADASTRO!C:F,4,0)","v":"FOLHATERIA"},108,"2023-02-16"]
[26,{"$f":"IF(A67=\"\",\"\",IFERROR(VLOOKUP(A67,CADASTRO!C:D,2,FALSE),\"Produto Não Cadastrado\"))","v":"CARRET"},{"$f":"IFERROR(VLOOKUP(A67,CADASTRO!C:F,3,0),\"\")","v":0},{"$f":"VLOOKUP(A67,CADASTRO!C:F,4,0)","v":"FOLHATERIA"},61,"2023-02-16"]
[169,{"$f":"IF(A68=\"\",\"\",IFERROR(VLOOKUP(A68,CADASTRO!C:D,2,FALSE),\"Produto Não Cadastrado\"))","v":"PÃO SEMI ITALIANO"},{"$f":"IFERROR(VLOOKUP(A68,CADASTRO!C:F,3,0),\"\")","v":0},{"$f":"VLOOKUP(A68,CADASTRO!C:F,4,0)","v":"PADARIA TRADICIONAL"},142,"2023-02-16"]
[50,{"$f":"IF(A69=\"\",\"\",IFERROR(VLOOKUP(A69,CADASTRO!C:D,2,FALSE),\"Produto Não Cadastrado\"))","v":"EMPADA BACALHAU"},{"$f":"IFERROR(VLOOKUP(A69,CADASTRO!C:F,3,0),\"\")","v":0},{"$f":"VLOOKUP(A69,CADASTRO!C:F,4,0)","v":"PADARIA TRADICIONAL"},74,"2023-02-16"]
[29,{"$f":"IF(A70=\"\",\"\",IFERROR(VLOOKUP(A70,CADASTRO!C:D,2,FALSE),\"Produto Não Cadastrado\"))","v":"CATARINA DE FRANGO"},{"$f":"IFERROR(VLOOKUP(A70,CADASTRO!C:F,3,0),\"\")","v":0},{"$f":"VLOOKUP(A70,CADASTRO!C:F,4,0)","v":"FOLHATERIA"},12,"2023-02-16"]
[66,{"$f":"IF(A71=\"\",\"\",IFERROR(VLOOKUP(A71,CADASTRO!C:D,2,FALSE),\"Produto Não Cadastrado\"))","v":"LASANHA FOLHADA MISTA"},{"$f":"IFERROR(VLOOKUP(A71,CADASTRO!C:F,3,0),\"\")","v":0},{"$f":"VLOOKUP(A71,CADASTRO!C:F,4,0)","v":"FOLHATERIA"},2,"2023-02-16"]
[264,{"$f":"IF(A72=\"\",\"\",IFERROR(VLOOKUP(A72,CADASTRO!C:D,2,FALSE),\"Produto Não Cadastrado\"))","v":"TRANÇA FOLHADA CALABRESA"},{"$f":"IFERROR(VLOOKUP(A72,CADASTRO!C:F,3,0),\"\")","v":0},{"$f":"VLOOKUP(A72,CADASTRO!C:F,4,0)","v":"FOLHATERIA"},18,"2023-02-16"]
[174,{"$f":"IF(A73=\"\",\"\",IFERROR(VLOOKUP(A73,CADASTRO!C:D,2,FALSE),\"Produto Não Cadastrado\"))","v":"PASTEL FOLHADO FRANGO "},{"$f":"IFERROR(VLOOKUP(A73,CADASTRO!C:F,3,0),\"\")","v":0},{"$f":"VLOOKUP(A73,CADASTRO!C:F,4,0)","v":"FOLHATERIA"},72,"2023-02-16"]
[173,{"$f":"IF(A74=\"\",\"\",IFERROR(VLOOKUP(A74,CADASTRO!C:D,2,FALSE),\"Produto Não Cadastrado\"))","v":"PASTEL FOLHADO BACALHAU "},{"$f":"IFERROR(VLOOKUP(A74,CADASTRO!C:F,3,0),\"\")","v":0},{"$f":"VLOOKUP(A74,CADASTRO!C:F,4,0)","v":"FOLHATERIA"},72,"2023-02-16"]
[50,{"$f":"IF(A75=\"\",\"\",IFERROR(VLOOKUP(A75,CADASTRO!C:D,2,FALSE),\"Produto Não Cadastrado\"))","v":"EMPADA BACALHAU"},{"$f":"IFERROR(VLOOKUP(A75,CADASTRO!C:F,3,0),\"\")","v":0},{"$f":"VLOOKUP(A75,CADASTRO!C:F,4,0)","v":"PADARIA TRADICIONAL"},2,"2023-02-20"]
[61,{"$f":"IF(A76=\"\",\"\",IFERROR(VLOOKUP(A76,CADASTRO!C:D,2,FALSE),\"Produto Não Cadastrado\"))","v":"FOCACCIA TABULEIRO"},{"$f":"IFERROR(VLOOKUP(A76,CADASTRO!C:F,3,0),\"\")","v":0},{"$f":"VLOOKUP(A76,CADASTRO!C:F,4,0)","v":"PADARIA RÚSTICA"},1,"2023-02-20"]
[83,{"$f":"IF(A77=\"\",\"\",IFERROR(VLOOKUP(A77,CADASTRO!C:D,2,FALSE),\"Produto Não Cadastrado\"))","v":"MINI FOLHADO GOIABADA"},{"$f":"IFERROR(VLOOKUP(A77,CADASTRO!C:F,3,0),\"\")","v":0},{"$f":"VLOOKUP(A77,CADASTRO!C:F,4,0)","v":"FOLHATERIA"},0.01,"2023-02-20"]
[93,{"$f":"IF(A78=\"\",\"\",IFERROR(VLOOKUP(A78,CADASTRO!C:D,2,FALSE),\"Produto Não Cadastrado\"))","v":"MINI PASTEL FOLHADO"},{"$f":"IFERROR(VLOOKUP(A78,CADASTRO!C:F,3,0),\"\")","v":0},{"$f":"VLOOKUP(A78,CADASTRO!C:F,4,0)","v":"FOLHATERIA"},0,"2023-02-20"]
[116,{"$f":"IF(A79=\"\",\"\",IFERROR(VLOOKUP(A79,CADASTRO!C:D,2,FALSE),\"Produto Não Cadastrado\"))","v":"PÃO BAGUETE 10 HORAS"},{"$f":"IFERROR(VLOOKUP(A79,CADASTRO!C:F,3,0),\"\")","v":0},{"$f":"VLOOKUP(A79,CADASTRO!C:F,4,0)","v":"PADARIA TRADICIONAL"},5,"2023-02-20"]
[119,{"$f":"IF(A80=\"\",\"\",IFERROR(VLOOKUP(A80,CADASTRO!C:D,2,FALSE),\"Produto Não Cadastrado\"))","v":"PÃO BAGUETE LYON"},{"$f":"IFERROR(VLOOKUP(A80,CADASTRO!C:F,3,0),\"\")","v":0},{"$f":"VLOOKUP(A80,CADASTRO!C:F,4,0)","v":"PADARIA RÚSTICA"},20,"2023-02-20"]
[122,{"$f":"IF(A81=\"\",\"\",IFERROR(VLOOKUP(A81,CADASTRO!C:D,2,FALSE),\"Produto Não Cadastrado\"))","v":"PÃO BENGALA 10 HORAS"},{"$f":"IFERROR(VLOOKUP(A81,CADASTRO!C:F,3,0),\"\")","v":0},{"$f":"VLOOKUP(A81,CADASTRO!C:F,4,0)","v":"PADARIA TRADICIONAL"},16,"2023-02-20"]
[124,{"$f":"IF(A82=\"\",\"\",IFERROR(VLOOKUP(A82,CADASTRO!C:D,2,FALSE),\"Produto Não Cadastrado\"))","v":"PÃO BRIOCHE HAMBÚRGUER"},{"$f":"IFERROR(VLOOKUP(A82,CADASTRO!C:F,3,0),\"\")","v":0},{"$f":"VLOOKUP(A82,CADASTRO!C:F,4,0)","v":"PADARIA TRADICIONAL"},9,"2023-02-20"]
[126,{"$f":"IF(A83=\"\",\"\",IFERROR(VLOOKUP(A83,CADASTRO!C:D,2,FALSE),\"Produto Não Cadastrado\"))","v":"PÃO CAMPONÊS"},{"$f":"IFERROR(VLOOKUP(A83,CADASTRO!C:F,3,0),\"\")","v":0},{"$f":"VLOOKUP(A83,CADASTRO!C:F,4,0)","v":"PADARIA RÚSTICA"},31,"2023-02-20"]
[153,{"$f":"IF(A84=\"\",\"\",IFERROR(VLOOKUP(A84,CADASTRO!C:D,2,FALSE),\"Produto Não Cadastrado\"))","v":"PÃO FORMA BATATA A25"},{"$f":"IFERROR(VLOOKUP(A84,CADASTRO!C:F,3,0),\"\")","v":0},{"$f":"VLOOKUP(A84,CADASTRO!C:F,4,0)","v":"PADARIA TRADICIONAL"},2,"2023-02-20"]
[155,{"$f":"IF(A85=\"\",\"\",IFERROR(VLOOKUP(A85,CADASTRO!C:D,2,FALSE),\"Produto Não Cadastrado\"))","v":"PÃO FORMA INTEGRAL 1000"},{"$f":"IFERROR(VLOOKUP(A85,CADASTRO!C:F,3,0),\"\")","v":0},{"$f":"VLOOKUP(A85,CADASTRO!C:F,4,0)","v":"PADARIA TRADICIONAL"},3,"2023-02-20"]
[156,{"$f":"IF(A86=\"\",\"\",IFERROR(VLOOKUP(A86,CADASTRO!C:D,2,FALSE),\"Produto Não Cadastrado\"))","v":"PÃO FORMA INTEGRAL 700"},{"$f":"IFERROR(VLOOKUP(A86,CADASTRO!C:F,3,0),\"\")","v":0},{"$f":"VLOOKUP(A86,CADASTRO!C:F,4,0)","v":"PADARIA TRADICIONAL"},2,"2023-02-20"]
[161,{"$f":"IF(A87=\"\",\"\",IFERROR(VLOOKUP(A87,CADASTRO!C:D,2,FALSE),\"Produto Não Cadastrado\"))","v":"PÃO FRANCÊS 10H"},{"$f":"IFERROR(VLOOKUP(A87,CADASTRO!C:F,3,0),\"\")","v":0},{"$f":"VLOOKUP(A87,CADASTRO!C:F,4,0)","v":"PADARIA TRADICIONAL"},77,"2023-02-20"]
[163,{"$f":"IF(A88=\"\",\"\",IFERROR(VLOOKUP(A88,CADASTRO!C:D,2,FALSE),\"Produto Não Cadastrado\"))","v":"PÃO FRANCÊS 5H"},{"$f":"IFERROR(VLOOKUP(A88,CADASTRO!C:F,3,0),\"\")","v":0},{"$f":"VLOOKUP(A88,CADASTRO!C:F,4,0)","v":"PADARIA TRADICIONAL"},37,"2023-02-20"]
[224,{"$f":"IF(A89=\"\",\"\",IFERROR(VLOOKUP(A89,CADASTRO!C:D,2,FALSE),\"Produto Não Cadastrado\"))","v":"QUICHE BACALHAU"},{"$f":"IFERROR(VLOOKUP(A89,CADASTRO!C:F,3,0),\"\")","v":0},{"$f":"VLOOKUP(A89,CADASTRO!C:F,4,0)","v":"QUITUTERIA"},58,"2023-02-20"]
[225,{"$f":"IF(A90=\"\",\"\",IFERROR(VLOOKUP(A90,CADASTRO!C:D,2,FALSE),\"Produto Não Cadastrado\"))","v":"QUICHE FRANGO"},{"$f":"IFERROR(VLOOKUP(A90,CADASTRO!C:F,3,0),\"\")","v":0},{"$f":"VLOOKUP(A90,CADASTRO!C:F,4,0)","v":"QUITUTERIA"},64,"2023-02-20"]
[227,{"$f":"IF(A91=\"\",\"\",IFERROR(VLOOKUP(A91,CADASTRO!C:D,2,FALSE),\"Produto Não Cadastrado\"))","v":"QUICHE MARAJOARA"},{"$f":"IFERROR(VLOOKUP(A91,CADASTRO!C:F,3,0),\"\")","v":0},{"$f":"VLOOKUP(A91,CADASTRO!C:F,4,0)","v":"QUITUTERIA"},68,"2023-02-20"]
[229,{"$f":"IF(A92=\"\",\"\",IFERROR(VLOOKUP(A92,CADASTRO!C:D,2,FALSE),\"Produto Não Cadastrado\"))","v":"QUICHE QUEIJO CUIA"},{"$f":"IFERROR(VLOOKUP(A92,CADASTRO!C:F,3,0),\"\")","v":0},{"$f":"VLOOKUP(A92,CADASTRO!C:F,4,0)","v":"QUITUTERIA"},10,"2023-02-20"]
[246,{"$f":"IF(A93=\"\",\"\",IFERROR(VLOOKUP(A93,CADASTRO!C:D,2,FALSE),\"Produto Não Cadastrado\"))","v":"SALGADO ITALIANO MIX FRIOS"},{"$f":"IFERROR(VLOOKUP(A93,CADASTRO!C:F,3,0),\"\")","v":0},{"$f":"VLOOKUP(A93,CADASTRO!C:F,4,0)","v":"PADARIA TRADICIONAL"},80,"2023-02-20"]
[273,{"$f":"IF(A94=\"\",\"\",IFERROR(VLOOKUP(A94,CADASTRO!C:D,2,FALSE),\"Produto Não Cadastrado\"))","v":"PÃO BENGALA 5 HORAS"},{"$f":"IFERROR(VLOOKUP(A94,CADASTRO!C:F,3,0),\"\")","v":0},{"$f":"VLOOKUP(A94,CADASTRO!C:F,4,0)","v":"PADARIA TRADICIONAL"},20,"2023-02-20"]
[71,{"$f":"IF(A95=\"\",\"\",IFERROR(VLOOKUP(A95,CADASTRO!C:D,2,FALSE),\"Produto Não Cadastrado\"))","v":"MASSA MINI PIZZA"},{"$f":"IFERROR(VLOOKUP(A95,CADASTRO!C:F,3,0),\"\")","v":0},{"$f":"VLOOKUP(A95,CADASTRO!C:F,4,0)","v":"PADARIA TRADICIONAL"},3,"2023-02-20"]
[267,{"$f":"IF(A96=\"\",\"\",IFERROR(VLOOKUP(A96,CADASTRO!C:D,2,FALSE),\"Produto Não Cadastrado\"))","v":"TRANÇA FOLHADA MISTA"},{"$f":"IFERROR(VLOOKUP(A96,CADASTRO!C:F,3,0),\"\")","v":0},{"$f":"VLOOKUP(A96,CADASTRO!C:F,4,0)","v":"FOLHATERIA"},18,"2023-02-22"]
[108,{"$f":"IF(A97=\"\",\"\",IFERROR(VLOOKUP(A97,CADASTRO!C:D,2,FALSE),\"Produto Não Cadastrado\"))","v":"ORELINHA TRADICIONAL"},{"$f":"IFERROR(VLOOKUP(A97,CADASTRO!C:F,3,0),\"\")","v":0},{"$f":"VLOOKUP(A97,CADASTRO!C:F,4,0)","v":"FOLHATERIA"},16,"2023-02-22"]
[66,{"$f":"IF(A98=\"\",\"\",IFERROR(VLOOKUP(A98,CADASTRO!C:D,2,FALSE),\"Produto Não Cadastrado\"))","v":"LASANHA FOLHADA MISTA"},{"$f":"IFERROR(VLOOKUP(A98,CADASTRO!C:F,3,0),\"\")","v":0},{"$f":"VLOOKUP(A98,CADASTRO!C:F,4,0)","v":"FOLHATERIA"},2,"2023-02-22"]
[94,{"$f":"IF(A99=\"\",\"\",IFERROR(VLOOKUP(A99,CADASTRO!C:D,2,FALSE),\"Produto Não Cadastrado\"))","v":"MINI TRANÇA BACALHAU"},{"$f":"IFERROR(VLOOKUP(A99,CADASTRO!C:F,3,0),\"\")","v":0},{"$f":"VLOOKUP(A99,CADASTRO!C:F,4,0)","v":"FOLHATERIA"},16,"2023-02-20"]
[270,{"$f":"IF(A100=\"\",\"\",IFERROR(VLOOKUP(A100,CADASTRO!C:D,2,FALSE),\"Produto Não Cadastrado\"))","v":"TRANÇA FOLHADA PERNIL"},{"$f":"IFERROR(VLOOKUP(A100,CADASTRO!C:F,3,0),\"\")","v":0},{"$f":"VLOOKUP(A100,CADASTRO!C:F,4,0)","v":"FOLHATERIA"},12,"2023-02-20"]
[269,{"$f":"IF(A101=\"\",\"\",IFERROR(VLOOKUP(A101,CADASTRO!C:D,2,FALSE),\"Produto Não Cadastrado\"))","v":"TRANÇA FOLHADA PEITO DEFUMADO"},{"$f":"IFERROR(VLOOKUP(A101,CADASTRO!C:F,3,0),\"\")","v":0},{"$f":"VLOOKUP(A101,CADASTRO!C:F,4,0)","v":"FOLHATERIA"},12,"2023-02-20"]
[266,{"$f":"IF(A102=\"\",\"\",IFERROR(VLOOKUP(A102,CADASTRO!C:D,2,FALSE),\"Produto Não Cadastrado\"))","v":"TRANÇA FOLHADA FRANGO/JAMBU"},{"$f":"IFERROR(VLOOKUP(A102,CADASTRO!C:F,3,0),\"\")","v":0},{"$f":"VLOOKUP(A102,CADASTRO!C:F,4,0)","v":"FOLHATERIA"},12,"2023-02-20"]
[71,{"$f":"IF(A103=\"\",\"\",IFERROR(VLOOKUP(A103,CADASTRO!C:D,2,FALSE),\"Produto Não Cadastrado\"))","v":"MASSA MINI PIZZA"},{"$f":"IFERROR(VLOOKUP(A103,CADASTRO!C:F,3,0),\"\")","v":0},{"$f":"VLOOKUP(A103,CADASTRO!C:F,4,0)","v":"PADARIA TRADICIONAL"},3,"2023-02-20"]
[53,{"$f":"IF(A104=\"\",\"\",IFERROR(VLOOKUP(A104,CADASTRO!C:D,2,FALSE),\"Produto Não Cadastrado\"))","v":"EMPADA PALMITO"},{"$f":"IFERROR(VLOOKUP(A104,CADASTRO!C:F,3,0),\"\")","v":0},{"$f":"VLOOKUP(A104,CADASTRO!C:F,4,0)","v":"PADARIA TRADICIONAL"},72,"2023-02-20"]
[154,{"$f":"IF(A105=\"\",\"\",IFERROR(VLOOKUP(A105,CADASTRO!C:D,2,FALSE),\"Produto Não Cadastrado\"))","v":"PÃO FORMA BRIOCHE A25"},{"$f":"IFERROR(VLOOKUP(A105,CADASTRO!C:F,3,0),\"\")","v":0},{"$f":"VLOOKUP(A105,CADASTRO!C:F,4,0)","v":"PADARIA TRADICIONAL"},39,"2023-02-20"]
[92,{"$f":"IF(A106=\"\",\"\",IFERROR(VLOOKUP(A106,CADASTRO!C:D,2,FALSE),\"Produto Não Cadastrado\"))","v":"MINI PÃO DELÍCIA  (PCT C/ 24UND)"},{"$f":"IFERROR(VLOOKUP(A106,CADASTRO!C:F,3,0),\"\")","v":0},{"$f":"VLOOKUP(A106,CADASTRO!C:F,4,0)","v":"PADARIA TRADICIONAL"},18,"2023-02-20"]
[78,{"$f":"IF(A107=\"\",\"\",IFERROR(VLOOKUP(A107,CADASTRO!C:D,2,FALSE),\"Produto Não Cadastrado\"))","v":"MINI FOLHADO BACALHAU"},{"$f":"IFERROR(VLOOKUP(A107,CADASTRO!C:F,3,0),\"\")","v":0},{"$f":"VLOOKUP(A107,CADASTRO!C:F,4,0)","v":"FOLHATERIA"},7.33,"2023-02-20"]
[79,{"$f":"IF(A108=\"\",\"\",IFERROR(VLOOKUP(A108,CADASTRO!C:D,2,FALSE),\"Produto Não Cadastrado\"))","v":"MINI FOLHADO CALABRESA"},{"$f":"IFERROR(VLOOKUP(A108,CADASTRO!C:F,3,0),\"\")","v":0},{"$f":"VLOOKUP(A108,CADASTRO!C:F,4,0)","v":"FOLHATERIA"},6.29,"2023-02-20"]
[81,{"$f":"IF(A109=\"\",\"\",IFERROR(VLOOKUP(A109,CADASTRO!C:D,2,FALSE),\"Produto Não Cadastrado\"))","v":"MINI FOLHADO DE QUEIJO"},{"$f":"IFERROR(VLOOKUP(A109,CADASTRO!C:F,3,0),\"\")","v":0},{"$f":"VLOOKUP(A109,CADASTRO!C:F,4,0)","v":"FOLHATERIA"},6.73,"2023-02-20"]
[82,{"$f":"IF(A110=\"\",\"\",IFERROR(VLOOKUP(A110,CADASTRO!C:D,2,FALSE),\"Produto Não Cadastrado\"))","v":"MINI FOLHADO FRANGO"},{"$f":"IFERROR(VLOOKUP(A110,CADASTRO!C:F,3,0),\"\")","v":0},{"$f":"VLOOKUP(A110,CADASTRO!C:F,4,0)","v":"FOLHATERIA"},3.3,"2023-02-20"]
[41,{"$f":"IF(A111=\"\",\"\",IFERROR(VLOOKUP(A111,CADASTRO!C:D,2,FALSE),\"Produto Não Cadastrado\"))","v":"CROISSANT CONGELADO "},{"$f":"IFERROR(VLOOKUP(A111,CADASTRO!C:F,3,0),\"\")","v":0},{"$f":"VLOOKUP(A111,CADASTRO!C:F,4,0)","v":"PADARIA TRADICIONAL"},648,"2023-02-22"]
[131,{"$f":"IF(A112=\"\",\"\",IFERROR(VLOOKUP(A112,CADASTRO!C:D,2,FALSE),\"Produto Não Cadastrado\"))","v":"PÃO CUCA DE BANANA"},{"$f":"IFERROR(VLOOKUP(A112,CADASTRO!C:F,3,0),\"\")","v":0},{"$f":"VLOOKUP(A112,CADASTRO!C:F,4,0)","v":"PADARIA TRADICIONAL"},25,"2023-02-22"]
[132,{"$f":"IF(A113=\"\",\"\",IFERROR(VLOOKUP(A113,CADASTRO!C:D,2,FALSE),\"Produto Não Cadastrado\"))","v":"PÃO CUCA GOIABADA"},{"$f":"IFERROR(VLOOKUP(A113,CADASTRO!C:F,3,0),\"\")","v":0},{"$f":"VLOOKUP(A113,CADASTRO!C:F,4,0)","v":"PADARIA TRADICIONAL"},32,"2023-02-22"]
[17,{"$f":"IF(A114=\"\",\"\",IFERROR(VLOOKUP(A114,CADASTRO!C:D,2,FALSE),\"Produto Não Cadastrado\"))","v":"BISCOITO MONTEIRO LOPES"},{"$f":"IFERROR(VLOOKUP(A114,CADASTRO!C:F,3,0),\"\")","v":0},{"$f":"VLOOKUP(A114,CADASTRO!C:F,4,0)","v":"PADARIA TRADICIONAL"},18,"2023-02-22"]
[91,{"$f":"IF(A115=\"\",\"\",IFERROR(VLOOKUP(A115,CADASTRO!C:D,2,FALSE),\"Produto Não Cadastrado\"))","v":"MINI PÃO BRIOCHE (PCT C/ 24UND)"},{"$f":"IFERROR(VLOOKUP(A115,CADASTRO!C:F,3,0),\"\")","v":0},{"$f":"VLOOKUP(A115,CADASTRO!C:F,4,0)","v":"PADARIA TRADICIONAL"},8,"2023-02-22"]
[123,{"$f":"IF(A116=\"\",\"\",IFERROR(VLOOKUP(A116,CADASTRO!C:D,2,FALSE),\"Produto Não Cadastrado\"))","v":"PÃO BRIOCHE DE FORMA  1000"},{"$f":"IFERROR(VLOOKUP(A116,CADASTRO!C:F,3,0),\"\")","v":0},{"$f":"VLOOKUP(A116,CADASTRO!C:F,4,0)","v":"PADARIA TRADICIONAL"},32,"2023-02-22"]
[154,{"$f":"IF(A117=\"\",\"\",IFERROR(VLOOKUP(A117,CADASTRO!C:D,2,FALSE),\"Produto Não Cadastrado\"))","v":"PÃO FORMA BRIOCHE A25"},{"$f":"IFERROR(VLOOKUP(A117,CADASTRO!C:F,3,0),\"\")","v":0},{"$f":"VLOOKUP(A117,CADASTRO!C:F,4,0)","v":"PADARIA TRADICIONAL"},12,"2023-02-22"]
[159,{"$f":"IF(A118=\"\",\"\",IFERROR(VLOOKUP(A118,CADASTRO!C:D,2,FALSE),\"Produto Não Cadastrado\"))","v":"PÃO FORMA TRADICIONAL 1000"},{"$f":"IFERROR(VLOOKUP(A118,CADASTRO!C:F,3,0),\"\")","v":0},{"$f":"VLOOKUP(A118,CADASTRO!C:F,4,0)","v":"PADARIA TRADICIONAL"},37,"2023-02-22"]
[160,{"$f":"IF(A119=\"\",\"\",IFERROR(VLOOKUP(A119,CADASTRO!C:D,2,FALSE),\"Produto Não Cadastrado\"))","v":"PÃO FORMA TRADICIONAL 700"},{"$f":"IFERROR(VLOOKUP(A119,CADASTRO!C:F,3,0),\"\")","v":0},{"$f":"VLOOKUP(A119,CADASTRO!C:F,4,0)","v":"PADARIA TRADICIONAL"},2,"2023-02-22"]
[39,{"$f":"IF(A120=\"\",\"\",IFERROR(VLOOKUP(A120,CADASTRO!C:D,2,FALSE),\"Produto Não Cadastrado\"))","v":"CROISSANT AMÊNDOAS"},{"$f":"IFERROR(VLOOKUP(A120,CADASTRO!C:F,3,0),\"\")","v":0},{"$f":"VLOOKUP(A120,CADASTRO!C:F,4,0)","v":"PADARIA TRADICIONAL"},122,"2023-02-22"]
[13,{"$f":"IF(A121=\"\",\"\",IFERROR(VLOOKUP(A121,CADASTRO!C:D,2,FALSE),\"Produto Não Cadastrado\"))","v":"BISCOITO CATUPIRI"},{"$f":"IFERROR(VLOOKUP(A121,CADASTRO!C:F,3,0),\"\")","v":0},{"$f":"VLOOKUP(A121,CADASTRO!C:F,4,0)","v":"PADARIA TRADICIONAL"},9.57,"2023-02-22"]
[80,{"$f":"IF(A122=\"\",\"\",IFERROR(VLOOKUP(A122,CADASTRO!C:D,2,FALSE),\"Produto Não Cadastrado\"))","v":"MINI FOLHADO CUPUAÇU"},{"$f":"IFERROR(VLOOKUP(A122,CADASTRO!C:F,3,0),\"\")","v":0},{"$f":"VLOOKUP(A122,CADASTRO!C:F,4,0)","v":"FOLHATERIA"},7.31,"2023-02-22"]
[107,{"$f":"IF(A123=\"\",\"\",IFERROR(VLOOKUP(A123,CADASTRO!C:D,2,FALSE),\"Produto Não Cadastrado\"))","v":"ORELHINHA CANELA"},{"$f":"IFERROR(VLOOKUP(A123,CADASTRO!C:F,3,0),\"\")","v":0},{"$f":"VLOOKUP(A123,CADASTRO!C:F,4,0)","v":"FOLHATERIA"},7.48,"2023-02-22"]
[108,{"$f":"IF(A124=\"\",\"\",IFERROR(VLOOKUP(A124,CADASTRO!C:D,2,FALSE),\"Produto Não Cadastrado\"))","v":"ORELINHA TRADICIONAL"},{"$f":"IFERROR(VLOOKUP(A124,CADASTRO!C:F,3,0),\"\")","v":0},{"$f":"VLOOKUP(A124,CADASTRO!C:F,4,0)","v":"FOLHATERIA"},7.38,"2023-02-22"]
[263,{"$f":"IF(A125=\"\",\"\",IFERROR(VLOOKUP(A125,CADASTRO!C:D,2,FALSE),\"Produto Não Cadastrado\"))","v":"TRANÇA FOLHADA BACALHAU"},{"$f":"IFERROR(VLOOKUP(A125,CADASTRO!C:F,3,0),\"\")","v":0},{"$f":"VLOOKUP(A125,CADASTRO!C:F,4,0)","v":"FOLHATERIA"},12,"2023-02-23"]
[270,{"$f":"IF(A126=\"\",\"\",IFERROR(VLOOKUP(A126,CADASTRO!C:D,2,FALSE),\"Produto Não Cadastrado\"))","v":"TRANÇA FOLHADA PERNIL"},{"$f":"IFERROR(VLOOKUP(A126,CADASTRO!C:F,3,0),\"\")","v":0},{"$f":"VLOOKUP(A126,CADASTRO!C:F,4,0)","v":"FOLHATERIA"},12,"2023-02-23"]
[155,{"$f":"IF(A127=\"\",\"\",IFERROR(VLOOKUP(A127,CADASTRO!C:D,2,FALSE),\"Produto Não Cadastrado\"))","v":"PÃO FORMA INTEGRAL 1000"},{"$f":"IFERROR(VLOOKUP(A127,CADASTRO!C:F,3,0),\"\")","v":0},{"$f":"VLOOKUP(A127,CADASTRO!C:F,4,0)","v":"PADARIA TRADICIONAL"},30,"2023-02-23"]
[110,{"$f":"IF(A128=\"\",\"\",IFERROR(VLOOKUP(A128,CADASTRO!C:D,2,FALSE),\"Produto Não Cadastrado\"))","v":"PALITO CANELA"},{"$f":"IFERROR(VLOOKUP(A128,CADASTRO!C:F,3,0),\"\")","v":0},{"$f":"VLOOKUP(A128,CADASTRO!C:F,4,0)","v":"FOLHATERIA"},7.78,"2023-02-23"]
[153,{"$f":"IF(A129=\"\",\"\",IFERROR(VLOOKUP(A129,CADASTRO!C:D,2,FALSE),\"Produto Não Cadastrado\"))","v":"PÃO FORMA BATATA A25"},{"$f":"IFERROR(VLOOKUP(A129,CADASTRO!C:F,3,0),\"\")","v":0},{"$f":"VLOOKUP(A129,CADASTRO!C:F,4,0)","v":"PADARIA TRADICIONAL"},66,"2023-02-23"]
[156,{"$f":"IF(A130=\"\",\"\",IFERROR(VLOOKUP(A130,CADASTRO!C:D,2,FALSE),\"Produto Não Cadastrado\"))","v":"PÃO FORMA INTEGRAL 700"},{"$f":"IFERROR(VLOOKUP(A130,CADASTRO!C:F,3,0),\"\")","v":0},{"$f":"VLOOKUP(A130,CADASTRO!C:F,4,0)","v":"PADARIA TRADICIONAL"},10,"2023-02-23"]
[157,{"$f":"IF(A131=\"\",\"\",IFERROR(VLOOKUP(A131,CADASTRO!C:D,2,FALSE),\"Produto Não Cadastrado\"))","v":"PÃO FORMA LEITE A25"},{"$f":"IFERROR(VLOOKUP(A131,CADASTRO!C:F,3,0),\"\")","v":0},{"$f":"VLOOKUP(A131,CADASTRO!C:F,4,0)","v":"PADARIA TRADICIONAL"},89,"2023-02-23"]
[170,{"$f":"IF(A132=\"\",\"\",IFERROR(VLOOKUP(A132,CADASTRO!C:D,2,FALSE),\"Produto Não Cadastrado\"))","v":"PÃO VIENNOIS"},{"$f":"IFERROR(VLOOKUP(A132,CADASTRO!C:F,3,0),\"\")","v":0},{"$f":"VLOOKUP(A132,CADASTRO!C:F,4,0)","v":"PADARIA TRADICIONAL"},191,"2023-02-23"]
[135,{"$f":"IF(A133=\"\",\"\",IFERROR(VLOOKUP(A133,CADASTRO!C:D,2,FALSE),\"Produto Não Cadastrado\"))","v":"PÃO DE BATATA FILÃO"},{"$f":"IFERROR(VLOOKUP(A133,CADASTRO!C:F,3,0),\"\")","v":0},{"$f":"VLOOKUP(A133,CADASTRO!C:F,4,0)","v":"PADARIA TRADICIONAL"},100,"2023-02-23"]
[88,{"$f":"IF(A134=\"\",\"\",IFERROR(VLOOKUP(A134,CADASTRO!C:D,2,FALSE),\"Produto Não Cadastrado\"))","v":"MINI PÃO BATATA (ERVAS,PARMESÃO)"},{"$f":"IFERROR(VLOOKUP(A134,CADASTRO!C:F,3,0),\"\")","v":0},{"$f":"VLOOKUP(A134,CADASTRO!C:F,4,0)","v":"PADARIA TRADICIONAL"},300,"2023-02-23"]
[89,{"$f":"IF(A135=\"\",\"\",IFERROR(VLOOKUP(A135,CADASTRO!C:D,2,FALSE),\"Produto Não Cadastrado\"))","v":"MINI PÃO BATATA HAMBÚRGUER"},{"$f":"IFERROR(VLOOKUP(A135,CADASTRO!C:F,3,0),\"\")","v":0},{"$f":"VLOOKUP(A135,CADASTRO!C:F,4,0)","v":"PADARIA TRADICIONAL"},216,"2023-02-23"]
[41,{"$f":"IF(A136=\"\",\"\",IFERROR(VLOOKUP(A136,CADASTRO!C:D,2,FALSE),\"Produto Não Cadastrado\"))","v":"CROISSANT CONGELADO "},{"$f":"IFERROR(VLOOKUP(A136,CADASTRO!C:F,3,0),\"\")","v":0},{"$f":"VLOOKUP(A136,CADASTRO!C:F,4,0)","v":"PADARIA TRADICIONAL"},445,"2023-02-23"]
[181,{"$f":"IF(A137=\"\",\"\",IFERROR(VLOOKUP(A137,CADASTRO!C:D,2,FALSE),\"Produto Não Cadastrado\"))","v":"PIZZA INTEGRAL (MASSA)"},{"$f":"IFERROR(VLOOKUP(A137,CADASTRO!C:F,3,0),\"\")","v":0},{"$f":"VLOOKUP(A137,CADASTRO!C:F,4,0)","v":"PADARIA TRADICIONAL"},16,"2023-02-23"]
[154,{"$f":"IF(A138=\"\",\"\",IFERROR(VLOOKUP(A138,CADASTRO!C:D,2,FALSE),\"Produto Não Cadastrado\"))","v":"PÃO FORMA BRIOCHE A25"},{"$f":"IFERROR(VLOOKUP(A138,CADASTRO!C:F,3,0),\"\")","v":0},{"$f":"VLOOKUP(A138,CADASTRO!C:F,4,0)","v":"PADARIA TRADICIONAL"},88,"2023-02-23"]
[49,{"$f":"IF(A139=\"\",\"\",IFERROR(VLOOKUP(A139,CADASTRO!C:D,2,FALSE),\"Produto Não Cadastrado\"))","v":"DONNUTS"},{"$f":"IFERROR(VLOOKUP(A139,CADASTRO!C:F,3,0),\"\")","v":0},{"$f":"VLOOKUP(A139,CADASTRO!C:F,4,0)","v":"PADARIA TRADICIONAL"},88,"2023-02-24"]
[244,{"$f":"IF(A140=\"\",\"\",IFERROR(VLOOKUP(A140,CADASTRO!C:D,2,FALSE),\"Produto Não Cadastrado\"))","v":"ROSQUINHA DE LEITE (PCT C/ 32UND)"},{"$f":"IFERROR(VLOOKUP(A140,CADASTRO!C:F,3,0),\"\")","v":0},{"$f":"VLOOKUP(A140,CADASTRO!C:F,4,0)","v":"PADARIA TRADICIONAL"},889,"2023-02-24"]
[41,{"$f":"IF(A141=\"\",\"\",IFERROR(VLOOKUP(A141,CADASTRO!C:D,2,FALSE),\"Produto Não Cadastrado\"))","v":"CROISSANT CONGELADO "},{"$f":"IFERROR(VLOOKUP(A141,CADASTRO!C:F,3,0),\"\")","v":0},{"$f":"VLOOKUP(A141,CADASTRO!C:F,4,0)","v":"PADARIA TRADICIONAL"},16,"2023-02-24"]
[172,{"$f":"IF(A142=\"\",\"\",IFERROR(VLOOKUP(A142,CADASTRO!C:D,2,FALSE),\"Produto Não Cadastrado\"))","v":"PASTEL DE BELÉM (MASSA)"},{"$f":"IFERROR(VLOOKUP(A142,CADASTRO!C:F,3,0),\"\")","v":0},{"$f":"VLOOKUP(A142,CADASTRO!C:F,4,0)","v":"FOLHATERIA"},16,"2023-02-24"]
[26,{"$f":"IF(A143=\"\",\"\",IFERROR(VLOOKUP(A143,CADASTRO!C:D,2,FALSE),\"Produto Não Cadastrado\"))","v":"CARRET"},{"$f":"IFERROR(VLOOKUP(A143,CADASTRO!C:F,3,0),\"\")","v":0},{"$f":"VLOOKUP(A143,CADASTRO!C:F,4,0)","v":"FOLHATERIA"},159,"2023-02-24"]
[112,{"$f":"IF(A144=\"\",\"\",IFERROR(VLOOKUP(A144,CADASTRO!C:D,2,FALSE),\"Produto Não Cadastrado\"))","v":"PALMIER"},{"$f":"IFERROR(VLOOKUP(A144,CADASTRO!C:F,3,0),\"\")","v":0},{"$f":"VLOOKUP(A144,CADASTRO!C:F,4,0)","v":"FOLHATERIA"},140,"2023-02-24"]
[269,{"$f":"IF(A145=\"\",\"\",IFERROR(VLOOKUP(A145,CADASTRO!C:D,2,FALSE),\"Produto Não Cadastrado\"))","v":"TRANÇA FOLHADA PEITO DEFUMADO"},{"$f":"IFERROR(VLOOKUP(A145,CADASTRO!C:F,3,0),\"\")","v":0},{"$f":"VLOOKUP(A145,CADASTRO!C:F,4,0)","v":"FOLHATERIA"},12,"2023-02-24"]
[264,{"$f":"IF(A146=\"\",\"\",IFERROR(VLOOKUP(A146,CADASTRO!C:D,2,FALSE),\"Produto Não Cadastrado\"))","v":"TRANÇA FOLHADA CALABRESA"},{"$f":"IFERROR(VLOOKUP(A146,CADASTRO!C:F,3,0),\"\")","v":0},{"$f":"VLOOKUP(A146,CADASTRO!C:F,4,0)","v":"FOLHATERIA"},12,"2023-02-24"]
[176,{"$f":"IF(A147=\"\",\"\",IFERROR(VLOOKUP(A147,CADASTRO!C:D,2,FALSE),\"Produto Não Cadastrado\"))","v":"PASTEL FOLHADO QUEIJO "},{"$f":"IFERROR(VLOOKUP(A147,CADASTRO!C:F,3,0),\"\")","v":0},{"$f":"VLOOKUP(A147,CADASTRO!C:F,4,0)","v":"FOLHATERIA"},72,"2023-02-24"]
[119,{"$f":"IF(A148=\"\",\"\",IFERROR(VLOOKUP(A148,CADASTRO!C:D,2,FALSE),\"Produto Não Cadastrado\"))","v":"PÃO BAGUETE LYON"},{"$f":"IFERROR(VLOOKUP(A148,CADASTRO!C:F,3,0),\"\")","v":0},{"$f":"VLOOKUP(A148,CADASTRO!C:F,4,0)","v":"PADARIA RÚSTICA"},39,"2023-02-24"]
[126,{"$f":"IF(A149=\"\",\"\",IFERROR(VLOOKUP(A149,CADASTRO!C:D,2,FALSE),\"Produto Não Cadastrado\"))","v":"PÃO CAMPONÊS"},{"$f":"IFERROR(VLOOKUP(A149,CADASTRO!C:F,3,0),\"\")","v":0},{"$f":"VLOOKUP(A149,CADASTRO!C:F,4,0)","v":"PADARIA RÚSTICA"},14,"2023-02-24"]
[61,{"$f":"IF(A150=\"\",\"\",IFERROR(VLOOKUP(A150,CADASTRO!C:D,2,FALSE),\"Produto Não Cadastrado\"))","v":"FOCACCIA TABULEIRO"},{"$f":"IFERROR(VLOOKUP(A150,CADASTRO!C:F,3,0),\"\")","v":0},{"$f":"VLOOKUP(A150,CADASTRO!C:F,4,0)","v":"PADARIA RÚSTICA"},3,"2023-02-24"]
[78,{"$f":"IF(A151=\"\",\"\",IFERROR(VLOOKUP(A151,CADASTRO!C:D,2,FALSE),\"Produto Não Cadastrado\"))","v":"MINI FOLHADO BACALHAU"},{"$f":"IFERROR(VLOOKUP(A151,CADASTRO!C:F,3,0),\"\")","v":0},{"$f":"VLOOKUP(A151,CADASTRO!C:F,4,0)","v":"FOLHATERIA"},3.4,"2023-02-24"]
[93,{"$f":"IF(A152=\"\",\"\",IFERROR(VLOOKUP(A152,CADASTRO!C:D,2,FALSE),\"Produto Não Cadastrado\"))","v":"MINI PASTEL FOLHADO"},{"$f":"IFERROR(VLOOKUP(A152,CADASTRO!C:F,3,0),\"\")","v":0},{"$f":"VLOOKUP(A152,CADASTRO!C:F,4,0)","v":"FOLHATERIA"},3.65,"2023-02-24"]
[111,{"$f":"IF(A153=\"\",\"\",IFERROR(VLOOKUP(A153,CADASTRO!C:D,2,FALSE),\"Produto Não Cadastrado\"))","v":"PALITO QUEIJO"},{"$f":"IFERROR(VLOOKUP(A153,CADASTRO!C:F,3,0),\"\")","v":0},{"$f":"VLOOKUP(A153,CADASTRO!C:F,4,0)","v":"FOLHATERIA"},3.3,"2023-02-24"]
[61,{"$f":"IF(A154=\"\",\"\",IFERROR(VLOOKUP(A154,CADASTRO!C:D,2,FALSE),\"Produto Não Cadastrado\"))","v":"FOCACCIA TABULEIRO"},null,null,70,"2023-03-02"]
[null,{"$f":"IF(A155=\"\",\"\",IFERROR(VLOOKUP(A155,CADASTRO!C:D,2,FALSE),\"Produto Não Cadastrado\"))","v":""}]
[null,{"$f":"IF(A156=\"\",\"\",IFERROR(VLOOKUP(A156,CADASTRO!C:D,2,FALSE),\"Produto Não Cadastrado\"))","v":""}]
[null,{"$f":"IF(A157=\"\",\"\",IFERROR(VLOOKUP(A157,CADASTRO!C:D,2,FALSE),\"Produto Não Cadastrado\"))","v":""}]
[null,{"$f":"IF(A158=\"\",\"\",IFERROR(VLOOKUP(A158,CADASTRO!C:D,2,FALSE),\"Produto Não Cadastrado\"))","v":""}]
[null,{"$f":"IF(A159=\"\",\"\",IFERROR(VLOOKUP(A159,CADASTRO!C:D,2,FALSE),\"Produto Não Cadastrado\"))","v":""},{"$f":"IFERROR(VLOOKUP(A159,CADASTRO!C:F,3,0),\"\")","v":""},{"$f":"VLOOKUP(A159,CADASTRO!C:F,4,0)","v":{"$error":"#N/A"}}]
[null,{"$f":"IF(A160=\"\",\"\",IFERROR(VLOOKUP(A160,CADASTRO!C:D,2,FALSE),\"Produto Não Cadastrado\"))","v":""},{"$f":"IFERROR(VLOOKUP(A160,CADASTRO!C:F,3,0),\"\")","v":""},{"$f":"VLOOKUP(A160,CADASTRO!C:F,4,0)","v":{"$error":"#N/A"}}]
[null,{"$f":"IF(A161=\"\",\"\",IFERROR(VLOOKUP(A161,CADASTRO!C:D,2,FALSE),\"Produto Não Cadastrado\"))","v":""},{"$f":"IFERROR(VLOOKUP(A161,CADASTRO!C:F,3,0),\"\")","v":""},{"$f":"VLOOKUP(A161,CADASTRO!C:F,4,0)","v":{"$error":"#N/A"}}]
[null,{"$f":"IF(A162=\"\",\"\",IFERROR(VLOOKUP(A162,CADASTRO!C:D,2,FALSE),\"Produto Não Cadastrado\"))","v":""},{"$f":"IFERROR(VLOOKUP(A162,CADASTRO!C:F,3,0),\"\")","v":""},{"$f":"VLOOKUP(A162,CADASTRO!C:F,4,0)","v":{"$error":"#N/A"}}]
[null,{"$f":"IF(A163=\"\",\"\",IFERROR(VLOOKUP(A163,CADASTRO!C:D,2,FALSE),\"Produto Não Cadastrado\"))","v":""},{"$f":"IFERROR(VLOOKUP(A163,CADASTRO!C:F,3,0),\"\")","v":""},{"$f":"VLOOKUP(A163,CADASTRO!C:F,4,0)","v":{"$error":"#N/A"}}]
[null,{"$f":"IF(A164=\"\",\"\",IFERROR(VLOOKUP(A164,CADASTRO!C:D,2,FALSE),\"Produto Não Cadastrado\"))","v":""},{"$f":"IFERROR(VLOOKUP(A164,CADASTRO!C:F,3,0),\"\")","v":""},{"$f":"VLOOKUP(A164,CADASTRO!C:F,4,0)","v":{"$error":"#N/A"}}]
[null,{"$f":"IF(A165=\"\",\"\",IFERROR(VLOOKUP(A165,CADASTRO!C:D,2,FALSE),\"Produto Não Cadastrado\"))","v":""},{"$f":"IFERROR(VLOOKUP(A165,CADASTRO!C:F,3,0),\"\")","v":""},{"$f":"VLOOKUP(A165,CADASTRO!C:F,4,0)","v":{"$error":"#N/A"}}]
[null,{"$f":"IF(A166=\"\",\"\",IFERROR(VLOOKUP(A166,CADASTRO!C:D,2,FALSE),\"Produto Não Cadastrado\"))","v":""},{"$f":"IFERROR(VLOOKUP(A166,CADASTRO!C:F,3,0),\"\")","v":""},{"$f":"VLOOKUP(A166,CADASTRO!C:F,4,0)","v":{"$error":"#N/A"}}]
[null,{"$f":"IF(A167=\"\",\"\",IFERROR(VLOOKUP(A167,CADASTRO!C:D,2,FALSE),\"Produto Não Cadastrado\"))","v":""},{"$f":"IFERROR(VLOOKUP(A167,CADASTRO!C:F,3,0),\"\")","v":""},{"$f":"VLOOKUP(A167,CADASTRO!C:F,4,0)","v":{"$error":"#N/A"}}]
[null,{"$f":"IF(A168=\"\",\"\",IFERROR(VLOOKUP(A168,CADASTRO!C:D,2,FALSE),\"Produto Não Cadastrado\"))","v":""},{"$f":"IFERROR(VLOOKUP(A168,CADASTRO!C:F,3,0),\"\")","v":""},{"$f":"VLOOKUP(A168,CADASTRO!C:F,4,0)","v":{"$error":"#N/A"}}]
[null,{"$f":"IF(A169=\"\",\"\",IFERROR(VLOOKUP(A169,CADASTRO!C:D,2,FALSE),\"Produto Não Cadastrado\"))","v":""},{"$f":"IFERROR(VLOOKUP(A169,CADASTRO!C:F,3,0),\"\")","v":""},{"$f":"VLOOKUP(A169,CADASTRO!C:F,4,0)","v":{"$error":"#N/A"}}]
[null,{"$f":"IF(A170=\"\",\"\",IFERROR(VLOOKUP(A170,CADASTRO!C:D,2,FALSE),\"Produto Não Cadastrado\"))","v":""},{"$f":"IFERROR(VLOOKUP(A170,CADASTRO!C:F,3,0),\"\")","v":""},{"$f":"VLOOKUP(A170,CADASTRO!C:F,4,0)","v":{"$error":"#N/A"}}]
[null,{"$f":"IF(A171=\"\",\"\",IFERROR(VLOOKUP(A171,CADASTRO!C:D,2,FALSE),\"Produto Não Cadastrado\"))","v":""},{"$f":"IFERROR(VLOOKUP(A171,CADASTRO!C:F,3,0),\"\")","v":""},{"$f":"VLOOKUP(A171,CADASTRO!C:F,4,0)","v":{"$error":"#N/A"}}]
[null,{"$f":"IF(A172=\"\",\"\",IFERROR(VLOOKUP(A172,CADASTRO!C:D,2,FALSE),\"Produto Não Cadastrado\"))","v":""},{"$f":"IFERROR(VLOOKUP(A172,CADASTRO!C:F,3,0),\"\")","v":""},{"$f":"VLOOKUP(A172,CADASTRO!C:F,4,0)","v":{"$error":"#N/A"}}]
[null,{"$f":"IF(A173=\"\",\"\",IFERROR(VLOOKUP(A173,CADASTRO!C:D,2,FALSE),\"Produto Não Cadastrado\"))","v":""},{"$f":"IFERROR(VLOOKUP(A173,CADASTRO!C:F,3,0),\"\")","v":""},{"$f":"VLOOKUP(A173,CADASTRO!C:F,4,0)","v":{"$error":"#N/A"}}]
[null,{"$f":"IF(A174=\"\",\"\",IFERROR(VLOOKUP(A174,CADASTRO!C:D,2,FALSE),\"Produto Não Cadastrado\"))","v":""},{"$f":"IFERROR(VLOOKUP(A174,CADASTRO!C:F,3,0),\"\")","v":""},{"$f":"VLOOKUP(A174,CADASTRO!C:F,4,0)","v":{"$error":"#N/A"}}]
[null,{"$f":"IF(A175=\"\",\"\",IFERROR(VLOOKUP(A175,CADASTRO!C:D,2,FALSE),\"Produto Não Cadastrado\"))","v":""},{"$f":"IFERROR(VLOOKUP(A175,CADASTRO!C:F,3,0),\"\")","v":""},{"$f":"VLOOKUP(A175,CADASTRO!C:F,4,0)","v":{"$error":"#N/A"}}]
[null,{"$f":"IF(A176=\"\",\"\",IFERROR(VLOOKUP(A176,CADASTRO!C:D,2,FALSE),\"Produto Não Cadastrado\"))","v":""},{"$f":"IFERROR(VLOOKUP(A176,CADASTRO!C:F,3,0),\"\")","v":""},{"$f":"VLOOKUP(A176,CADASTRO!C:F,4,0)","v":{"$error":"#N/A"}}]
[null,{"$f":"IF(A177=\"\",\"\",IFERROR(VLOOKUP(A177,CADASTRO!C:D,2,FALSE),\"Produto Não Cadastrado\"))","v":""},{"$f":"IFERROR(VLOOKUP(A177,CADASTRO!C:F,3,0),\"\")","v":""},{"$f":"VLOOKUP(A177,CADASTRO!C:F,4,0)","v":{"$error":"#N/A"}}]
[null,{"$f":"IF(A178=\"\",\"\",IFERROR(VLOOKUP(A178,CADASTRO!C:D,2,FALSE),\"Produto Não Cadastrado\"))","v":""},{"$f":"IFERROR(VLOOKUP(A178,CADASTRO!C:F,3,0),\"\")","v":""},{"$f":"VLOOKUP(A178,CADASTRO!C:F,4,0)","v":{"$error":"#N/A"}}]
[null,{"$f":"IF(A179=\"\",\"\",IFERROR(VLOOKUP(A179,CADASTRO!C:D,2,FALSE),\"Produto Não Cadastrado\"))","v":""},{"$f":"IFERROR(VLOOKUP(A179,CADASTRO!C:F,3,0),\"\")","v":""},{"$f":"VLOOKUP(A179,CADASTRO!C:F,4,0)","v":{"$error":"#N/A"}}]
[null,{"$f":"IF(A180=\"\",\"\",IFERROR(VLOOKUP(A180,CADASTRO!C:D,2,FALSE),\"Produto Não Cadastrado\"))","v":""},{"$f":"IFERROR(VLOOKUP(A180,CADASTRO!C:F,3,0),\"\")","v":""},{"$f":"VLOOKUP(A180,CADASTRO!C:F,4,0)","v":{"$error":"#N/A"}}]
[null,{"$f":"IF(A181=\"\",\"\",IFERROR(VLOOKUP(A181,CADASTRO!C:D,2,FALSE),\"Produto Não Cadastrado\"))","v":""},{"$f":"IFERROR(VLOOKUP(A181,CADASTRO!C:F,3,0),\"\")","v":""},{"$f":"VLOOKUP(A181,CADASTRO!C:F,4,0)","v":{"$error":"#N/A"}}]
[null,{"$f":"IF(A182=\"\",\"\",IFERROR(VLOOKUP(A182,CADASTRO!C:D,2,FALSE),\"Produto Não Cadastrado\"))","v":""},{"$f":"IFERROR(VLOOKUP(A182,CADASTRO!C:F,3,0),\"\")","v":""},{"$f":"VLOOKUP(A182,CADASTRO!C:F,4,0)","v":{"$error":"#N/A"}}]
[null,{"$f":"IF(A183=\"\",\"\",IFERROR(VLOOKUP(A183,CADASTRO!C:D,2,FALSE),\"Produto Não Cadastrado\"))","v":""},{"$f":"IFERROR(VLOOKUP(A183,CADASTRO!C:F,3,0),\"\")","v":""},{"$f":"VLOOKUP(A183,CADASTRO!C:F,4,0)","v":{"$error":"#N/A"}}]
[null,{"$f":"IF(A184=\"\",\"\",IFERROR(VLOOKUP(A184,CADASTRO!C:D,2,FALSE),\"Produto Não Cadastrado\"))","v":""},{"$f":"IFERROR(VLOOKUP(A184,CADASTRO!C:F,3,0),\"\")","v":""},{"$f":"VLOOKUP(A184,CADASTRO!C:F,4,0)","v":{"$error":"#N/A"}}]
[null,{"$f":"IF(A185=\"\",\"\",IFERROR(VLOOKUP(A185,CADASTRO!C:D,2,FALSE),\"Produto Não Cadastrado\"))","v":""},{"$f":"IFERROR(VLOOKUP(A185,CADASTRO!C:F,3,0),\"\")","v":""},{"$f":"VLOOKUP(A185,CADASTRO!C:F,4,0)","v":{"$error":"#N/A"}}]
[null,{"$f":"IF(A186=\"\",\"\",IFERROR(VLOOKUP(A186,CADASTRO!C:D,2,FALSE),\"Produto Não Cadastrado\"))","v":""},{"$f":"IFERROR(VLOOKUP(A186,CADASTRO!C:F,3,0),\"\")","v":""},{"$f":"VLOOKUP(A186,CADASTRO!C:F,4,0)","v":{"$error":"#N/A"}}]
[null,{"$f":"IF(A187=\"\",\"\",IFERROR(VLOOKUP(A187,CADASTRO!C:D,2,FALSE),\"Produto Não Cadastrado\"))","v":""},{"$f":"IFERROR(VLOOKUP(A187,CADASTRO!C:F,3,0),\"\")","v":""},{"$f":"VLOOKUP(A187,CADASTRO!C:F,4,0)","v":{"$error":"#N/A"}}]
[null,{"$f":"IF(A188=\"\",\"\",IFERROR(VLOOKUP(A188,CADASTRO!C:D,2,FALSE),\"Produto Não Cadastrado\"))","v":""},{"$f":"IFERROR(VLOOKUP(A188,CADASTRO!C:F,3,0),\"\")","v":""},{"$f":"VLOOKUP(A188,CADASTRO!C:F,4,0)","v":{"$error":"#N/A"}}]
[null,{"$f":"IF(A189=\"\",\"\",IFERROR(VLOOKUP(A189,CADASTRO!C:D,2,FALSE),\"Produto Não Cadastrado\"))","v":""},{"$f":"IFERROR(VLOOKUP(A189,CADASTRO!C:F,3,0),\"\")","v":""},{"$f":"VLOOKUP(A189,CADASTRO!C:F,4,0)","v":{"$error":"#N/A"}}]
[null,{"$f":"IF(A190=\"\",\"\",IFERROR(VLOOKUP(A190,CADASTRO!C:D,2,FALSE),\"Produto Não Cadastrado\"))","v":""},{"$f":"IFERROR(VLOOKUP(A190,CADASTRO!C:F,3,0),\"\")","v":""},{"$f":"VLOOKUP(A190,CADASTRO!C:F,4,0)","v":{"$error":"#N/A"}}]
[null,{"$f":"IF(A191=\"\",\"\",IFERROR(VLOOKUP(A191,CADASTRO!C:D,2,FALSE),\"Produto Não Cadastrado\"))","v":""},{"$f":"IFERROR(VLOOKUP(A191,CADASTRO!C:F,3,0),\"\")","v":""},{"$f":"VLOOKUP(A191,CADASTRO!C:F,4,0)","v":{"$error":"#N/A"}}]
[null,{"$f":"IF(A192=\"\",\"\",IFERROR(VLOOKUP(A192,CADASTRO!C:D,2,FALSE),\"Produto Não Cadastrado\"))","v":""},{"$f":"IFERROR(VLOOKUP(A192,CADASTRO!C:F,3,0),\"\")","v":""},{"$f":"VLOOKUP(A192,CADASTRO!C:F,4,0)","v":{"$error":"#N/A"}}]
[null,{"$f":"IF(A193=\"\",\"\",IFERROR(VLOOKUP(A193,CADASTRO!C:D,2,FALSE),\"Produto Não Cadastrado\"))","v":""},{"$f":"IFERROR(VLOOKUP(A193,CADASTRO!C:F,3,0),\"\")","v":""},{"$f":"VLOOKUP(A193,CADASTRO!C:F,4,0)","v":{"$error":"#N/A"}}]
[null,{"$f":"IF(A194=\"\",\"\",IFERROR(VLOOKUP(A194,CADASTRO!C:D,2,FALSE),\"Produto Não Cadastrado\"))","v":""},{"$f":"IFERROR(VLOOKUP(A194,CADASTRO!C:F,3,0),\"\")","v":""},{"$f":"VLOOKUP(A194,CADASTRO!C:F,4,0)","v":{"$error":"#N/A"}}]
[null,{"$f":"IF(A195=\"\",\"\",IFERROR(VLOOKUP(A195,CADASTRO!C:D,2,FALSE),\"Produto Não Cadastrado\"))","v":""},{"$f":"IFERROR(VLOOKUP(A195,CADASTRO!C:F,3,0),\"\")","v":""},{"$f":"VLOOKUP(A195,CADASTRO!C:F,4,0)","v":{"$error":"#N/A"}}]
[null,{"$f":"IF(A196=\"\",\"\",IFERROR(VLOOKUP(A196,CADASTRO!C:D,2,FALSE),\"Produto Não Cadastrado\"))","v":""},{"$f":"IFERROR(VLOOKUP(A196,CADASTRO!C:F,3,0),\"\")","v":""},{"$f":"VLOOKUP(A196,CADASTRO!C:F,4,0)","v":{"$error":"#N/A"}}]
[null,{"$f":"IF(A197=\"\",\"\",IFERROR(VLOOKUP(A197,CADASTRO!C:D,2,FALSE),\"Produto Não Cadastrado\"))","v":""},{"$f":"IFERROR(VLOOKUP(A197,CADASTRO!C:F,3,0),\"\")","v":""},{"$f":"VLOOKUP(A197,CADASTRO!C:F,4,0)","v":{"$error":"#N/A"}}]
[null,{"$f":"IF(A198=\"\",\"\",IFERROR(VLOOKUP(A198,CADASTRO!C:D,2,FALSE),\"Produto Não Cadastrado\"))","v":""},{"$f":"IFERROR(VLOOKUP(A198,CADASTRO!C:F,3,0),\"\")","v":""},{"$f":"VLOOKUP(A198,CADASTRO!C:F,4,0)","v":{"$error":"#N/A"}}]
[null,{"$f":"IF(A199=\"\",\"\",IFERROR(VLOOKUP(A199,CADASTRO!C:D,2,FALSE),\"Produto Não Cadastrado\"))","v":""},{"$f":"IFERROR(VLOOKUP(A199,CADASTRO!C:F,3,0),\"\")","v":""},{"$f":"VLOOKUP(A199,CADASTRO!C:F,4,0)","v":{"$error":"#N/A"}}]
[null,{"$f":"IF(A200=\"\",\"\",IFERROR(VLOOKUP(A200,CADASTRO!C:D,2,FALSE),\"Produto Não Cadastrado\"))","v":""},{"$f":"IFERROR(VLOOKUP(A200,CADASTRO!C:F,3,0),\"\")","v":""},{"$f":"VLOOKUP(A200,CADASTRO!C:F,4,0)","v":{"$error":"#N/A"}}]
[null,{"$f":"IF(A201=\"\",\"\",IFERROR(VLOOKUP(A201,CADASTRO!C:D,2,FALSE),\"Produto Não Cadastrado\"))","v":""},{"$f":"IFERROR(VLOOKUP(A201,CADASTRO!C:F,3,0),\"\")","v":""},{"$f":"VLOOKUP(A201,CADASTRO!C:F,4,0)","v":{"$error":"#N/A"}}]
[null,{"$f":"IF(A202=\"\",\"\",IFERROR(VLOOKUP(A202,CADASTRO!C:D,2,FALSE),\"Produto Não Cadastrado\"))","v":""},{"$f":"IFERROR(VLOOKUP(A202,CADASTRO!C:F,3,0),\"\")","v":""},{"$f":"VLOOKUP(A202,CADASTRO!C:F,4,0)","v":{"$error":"#N/A"}}]
[null,{"$f":"IF(A203=\"\",\"\",IFERROR(VLOOKUP(A203,CADASTRO!C:D,2,FALSE),\"Produto Não Cadastrado\"))","v":""},{"$f":"IFERROR(VLOOKUP(A203,CADASTRO!C:F,3,0),\"\")","v":""},{"$f":"VLOOKUP(A203,CADASTRO!C:F,4,0)","v":{"$error":"#N/A"}}]
[null,{"$f":"IF(A204=\"\",\"\",IFERROR(VLOOKUP(A204,CADASTRO!C:D,2,FALSE),\"Produto Não Cadastrado\"))","v":""},{"$f":"IFERROR(VLOOKUP(A204,CADASTRO!C:F,3,0),\"\")","v":""},{"$f":"VLOOKUP(A204,CADASTRO!C:F,4,0)","v":{"$error":"#N/A"}}]
[null,{"$f":"IF(A205=\"\",\"\",IFERROR(VLOOKUP(A205,CADASTRO!C:D,2,FALSE),\"Produto Não Cadastrado\"))","v":""},{"$f":"IFERROR(VLOOKUP(A205,CADASTRO!C:F,3,0),\"\")","v":""},{"$f":"VLOOKUP(A205,CADASTRO!C:F,4,0)","v":{"$error":"#N/A"}}]
[null,{"$f":"IF(A206=\"\",\"\",IFERROR(VLOOKUP(A206,CADASTRO!C:D,2,FALSE),\"Produto Não Cadastrado\"))","v":""},{"$f":"IFERROR(VLOOKUP(A206,CADASTRO!C:F,3,0),\"\")","v":""},{"$f":"VLOOKUP(A206,CADASTRO!C:F,4,0)","v":{"$error":"#N/A"}}]
[null,{"$f":"IF(A207=\"\",\"\",IFERROR(VLOOKUP(A207,CADASTRO!C:D,2,FALSE),\"Produto Não Cadastrado\"))","v":""},{"$f":"IFERROR(VLOOKUP(A207,CADASTRO!C:F,3,0),\"\")","v":""},{"$f":"VLOOKUP(A207,CADASTRO!C:F,4,0)","v":{"$error":"#N/A"}}]
[null,{"$f":"IF(A208=\"\",\"\",IFERROR(VLOOKUP(A208,CADASTRO!C:D,2,FALSE),\"Produto Não Cadastrado\"))","v":""},{"$f":"IFERROR(VLOOKUP(A208,CADASTRO!C:F,3,0),\"\")","v":""},{"$f":"VLOOKUP(A208,CADASTRO!C:F,4,0)","v":{"$error":"#N/A"}}]
[null,{"$f":"IF(A209=\"\",\"\",IFERROR(VLOOKUP(A209,CADASTRO!C:D,2,FALSE),\"Produto Não Cadastrado\"))","v":""},{"$f":"IFERROR(VLOOKUP(A209,CADASTRO!C:F,3,0),\"\")","v":""},{"$f":"VLOOKUP(A209,CADASTRO!C:F,4,0)","v":{"$error":"#N/A"}}]
[null,{"$f":"IF(A210=\"\",\"\",IFERROR(VLOOKUP(A210,CADASTRO!C:D,2,FALSE),\"Produto Não Cadastrado\"))","v":""},{"$f":"IFERROR(VLOOKUP(A210,CADASTRO!C:F,3,0),\"\")","v":""},{"$f":"VLOOKUP(A210,CADASTRO!C:F,4,0)","v":{"$error":"#N/A"}}]
[null,{"$f":"IF(A211=\"\",\"\",IFERROR(VLOOKUP(A211,CADASTRO!C:D,2,FALSE),\"Produto Não Cadastrado\"))","v":""},{"$f":"IFERROR(VLOOKUP(A211,CADASTRO!C:F,3,0),\"\")","v":""},{"$f":"VLOOKUP(A211,CADASTRO!C:F,4,0)","v":{"$error":"#N/A"}}]
[null,{"$f":"IF(A212=\"\",\"\",IFERROR(VLOOKUP(A212,CADASTRO!C:D,2,FALSE),\"Produto Não Cadastrado\"))","v":""},{"$f":"IFERROR(VLOOKUP(A212,CADASTRO!C:F,3,0),\"\")","v":""},{"$f":"VLOOKUP(A212,CADASTRO!C:F,4,0)","v":{"$error":"#N/A"}}]
[null,{"$f":"IF(A213=\"\",\"\",IFERROR(VLOOKUP(A213,CADASTRO!C:D,2,FALSE),\"Produto Não Cadastrado\"))","v":""},{"$f":"IFERROR(VLOOKUP(A213,CADASTRO!C:F,3,0),\"\")","v":""},{"$f":"VLOOKUP(A213,CADASTRO!C:F,4,0)","v":{"$error":"#N/A"}}]
[null,{"$f":"IF(A214=\"\",\"\",IFERROR(VLOOKUP(A214,CADASTRO!C:D,2,FALSE),\"Produto Não Cadastrado\"))","v":""},{"$f":"IFERROR(VLOOKUP(A214,CADASTRO!C:F,3,0),\"\")","v":""},{"$f":"VLOOKUP(A214,CADASTRO!C:F,4,0)","v":{"$error":"#N/A"}}]
[null,{"$f":"IF(A215=\"\",\"\",IFERROR(VLOOKUP(A215,CADASTRO!C:D,2,FALSE),\"Produto Não Cadastrado\"))","v":""},{"$f":"IFERROR(VLOOKUP(A215,CADASTRO!C:F,3,0),\"\")","v":""},{"$f":"VLOOKUP(A215,CADASTRO!C:F,4,0)","v":{"$error":"#N/A"}}]
[null,{"$f":"IF(A216=\"\",\"\",IFERROR(VLOOKUP(A216,CADASTRO!C:D,2,FALSE),\"Produto Não Cadastrado\"))","v":""},{"$f":"IFERROR(VLOOKUP(A216,CADASTRO!C:F,3,0),\"\")","v":""},{"$f":"VLOOKUP(A216,CADASTRO!C:F,4,0)","v":{"$error":"#N/A"}}]
[null,{"$f":"IF(A217=\"\",\"\",IFERROR(VLOOKUP(A217,CADASTRO!C:D,2,FALSE),\"Produto Não Cadastrado\"))","v":""},{"$f":"IFERROR(VLOOKUP(A217,CADASTRO!C:F,3,0),\"\")","v":""},{"$f":"VLOOKUP(A217,CADASTRO!C:F,4,0)","v":{"$error":"#N/A"}}]
[null,{"$f":"IF(A218=\"\",\"\",IFERROR(VLOOKUP(A218,CADASTRO!C:D,2,FALSE),\"Produto Não Cadastrado\"))","v":""},{"$f":"IFERROR(VLOOKUP(A218,CADASTRO!C:F,3,0),\"\")","v":""},{"$f":"VLOOKUP(A218,CADASTRO!C:F,4,0)","v":{"$error":"#N/A"}}]
[null,{"$f":"IF(A219=\"\",\"\",IFERROR(VLOOKUP(A219,CADASTRO!C:D,2,FALSE),\"Produto Não Cadastrado\"))","v":""},{"$f":"IFERROR(VLOOKUP(A219,CADASTRO!C:F,3,0),\"\")","v":""},{"$f":"VLOOKUP(A219,CADASTRO!C:F,4,0)","v":{"$error":"#N/A"}}]
[null,{"$f":"IF(A220=\"\",\"\",IFERROR(VLOOKUP(A220,CADASTRO!C:D,2,FALSE),\"Produto Não Cadastrado\"))","v":""},{"$f":"IFERROR(VLOOKUP(A220,CADASTRO!C:F,3,0),\"\")","v":""},{"$f":"VLOOKUP(A220,CADASTRO!C:F,4,0)","v":{"$error":"#N/A"}}]
[null,{"$f":"IF(A221=\"\",\"\",IFERROR(VLOOKUP(A221,CADASTRO!C:D,2,FALSE),\"Produto Não Cadastrado\"))","v":""},{"$f":"IFERROR(VLOOKUP(A221,CADASTRO!C:F,3,0),\"\")","v":""},{"$f":"VLOOKUP(A221,CADASTRO!C:F,4,0)","v":{"$error":"#N/A"}}]
[null,{"$f":"IF(A222=\"\",\"\",IFERROR(VLOOKUP(A222,CADASTRO!C:D,2,FALSE),\"Produto Não Cadastrado\"))","v":""},{"$f":"IFERROR(VLOOKUP(A222,CADASTRO!C:F,3,0),\"\")","v":""},{"$f":"VLOOKUP(A222,CADASTRO!C:F,4,0)","v":{"$error":"#N/A"}}]
[null,{"$f":"IF(A223=\"\",\"\",IFERROR(VLOOKUP(A223,CADASTRO!C:D,2,FALSE),\"Produto Não Cadastrado\"))","v":""},{"$f":"IFERROR(VLOOKUP(A223,CADASTRO!C:F,3,0),\"\")","v":""},{"$f":"VLOOKUP(A223,CADASTRO!C:F,4,0)","v":{"$error":"#N/A"}}]
[null,{"$f":"IF(A224=\"\",\"\",IFERROR(VLOOKUP(A224,CADASTRO!C:D,2,FALSE),\"Produto Não Cadastrado\"))","v":""},{"$f":"IFERROR(VLOOKUP(A224,CADASTRO!C:F,3,0),\"\")","v":""},{"$f":"VLOOKUP(A224,CADASTRO!C:F,4,0)","v":{"$error":"#N/A"}}]
[null,{"$f":"IF(A225=\"\",\"\",IFERROR(VLOOKUP(A225,CADASTRO!C:D,2,FALSE),\"Produto Não Cadastrado\"))","v":""},{"$f":"IFERROR(VLOOKUP(A225,CADASTRO!C:F,3,0),\"\")","v":""},{"$f":"VLOOKUP(A225,CADASTRO!C:F,4,0)","v":{"$error":"#N/A"}}]
[null,{"$f":"IF(A226=\"\",\"\",IFERROR(VLOOKUP(A226,CADASTRO!C:D,2,FALSE),\"Produto Não Cadastrado\"))","v":""},{"$f":"IFERROR(VLOOKUP(A226,CADASTRO!C:F,3,0),\"\")","v":""},{"$f":"VLOOKUP(A226,CADASTRO!C:F,4,0)","v":{"$error":"#N/A"}}]
[null,{"$f":"IF(A227=\"\",\"\",IFERROR(VLOOKUP(A227,CADASTRO!C:D,2,FALSE),\"Produto Não Cadastrado\"))","v":""},{"$f":"IFERROR(VLOOKUP(A227,CADASTRO!C:F,3,0),\"\")","v":""},{"$f":"VLOOKUP(A227,CADASTRO!C:F,4,0)","v":{"$error":"#N/A"}}]
[null,{"$f":"IF(A228=\"\",\"\",IFERROR(VLOOKUP(A228,CADASTRO!C:D,2,FALSE),\"Produto Não Cadastrado\"))","v":""},{"$f":"IFERROR(VLOOKUP(A228,CADASTRO!C:F,3,0),\"\")","v":""},{"$f":"VLOOKUP(A228,CADASTRO!C:F,4,0)","v":{"$error":"#N/A"}}]
[null,{"$f":"IF(A229=\"\",\"\",IFERROR(VLOOKUP(A229,CADASTRO!C:D,2,FALSE),\"Produto Não Cadastrado\"))","v":""},{"$f":"IFERROR(VLOOKUP(A229,CADASTRO!C:F,3,0),\"\")","v":""},{"$f":"VLOOKUP(A229,CADASTRO!C:F,4,0)","v":{"$error":"#N/A"}}]
[null,{"$f":"IF(A230=\"\",\"\",IFERROR(VLOOKUP(A230,CADASTRO!C:D,2,FALSE),\"Produto Não Cadastrado\"))","v":""},{"$f":"IFERROR(VLOOKUP(A230,CADASTRO!C:F,3,0),\"\")","v":""},{"$f":"VLOOKUP(A230,CADASTRO!C:F,4,0)","v":{"$error":"#N/A"}}]
[null,{"$f":"IF(A231=\"\",\"\",IFERROR(VLOOKUP(A231,CADASTRO!C:D,2,FALSE),\"Produto Não Cadastrado\"))","v":""},{"$f":"IFERROR(VLOOKUP(A231,CADASTRO!C:F,3,0),\"\")","v":""},{"$f":"VLOOKUP(A231,CADASTRO!C:F,4,0)","v":{"$error":"#N/A"}}]
[null,{"$f":"IF(A232=\"\",\"\",IFERROR(VLOOKUP(A232,CADASTRO!C:D,2,FALSE),\"Produto Não Cadastrado\"))","v":""},{"$f":"IFERROR(VLOOKUP(A232,CADASTRO!C:F,3,0),\"\")","v":""},{"$f":"VLOOKUP(A232,CADASTRO!C:F,4,0)","v":{"$error":"#N/A"}}]
[null,{"$f":"IF(A233=\"\",\"\",IFERROR(VLOOKUP(A233,CADASTRO!C:D,2,FALSE),\"Produto Não Cadastrado\"))","v":""},{"$f":"IFERROR(VLOOKUP(A233,CADASTRO!C:F,3,0),\"\")","v":""},{"$f":"VLOOKUP(A233,CADASTRO!C:F,4,0)","v":{"$error":"#N/A"}}]
[null,{"$f":"IF(A234=\"\",\"\",IFERROR(VLOOKUP(A234,CADASTRO!C:D,2,FALSE),\"Produto Não Cadastrado\"))","v":""},{"$f":"IFERROR(VLOOKUP(A234,CADASTRO!C:F,3,0),\"\")","v":""},{"$f":"VLOOKUP(A234,CADASTRO!C:F,4,0)","v":{"$error":"#N/A"}}]
[null,{"$f":"IF(A235=\"\",\"\",IFERROR(VLOOKUP(A235,CADASTRO!C:D,2,FALSE),\"Produto Não Cadastrado\"))","v":""},{"$f":"IFERROR(VLOOKUP(A235,CADASTRO!C:F,3,0),\"\")","v":""},{"$f":"VLOOKUP(A235,CADASTRO!C:F,4,0)","v":{"$error":"#N/A"}}]
[null,{"$f":"IF(A236=\"\",\"\",IFERROR(VLOOKUP(A236,CADASTRO!C:D,2,FALSE),\"Produto Não Cadastrado\"))","v":""},{"$f":"IFERROR(VLOOKUP(A236,CADASTRO!C:F,3,0),\"\")","v":""},{"$f":"VLOOKUP(A236,CADASTRO!C:F,4,0)","v":{"$error":"#N/A"}}]
[null,{"$f":"IF(A237=\"\",\"\",IFERROR(VLOOKUP(A237,CADASTRO!C:D,2,FALSE),\"Produto Não Cadastrado\"))","v":""},{"$f":"IFERROR(VLOOKUP(A237,CADASTRO!C:F,3,0),\"\")","v":""},{"$f":"VLOOKUP(A237,CADASTRO!C:F,4,0)","v":{"$error":"#N/A"}}]
[null,{"$f":"IF(A238=\"\",\"\",IFERROR(VLOOKUP(A238,CADASTRO!C:D,2,FALSE),\"Produto Não Cadastrado\"))","v":""},{"$f":"IFERROR(VLOOKUP(A238,CADASTRO!C:F,3,0),\"\")","v":""},{"$f":"VLOOKUP(A238,CADASTRO!C:F,4,0)","v":{"$error":"#N/A"}}]
[null,{"$f":"IF(A239=\"\",\"\",IFERROR(VLOOKUP(A239,CADASTRO!C:D,2,FALSE),\"Produto Não Cadastrado\"))","v":""},{"$f":"IFERROR(VLOOKUP(A239,CADASTRO!C:F,3,0),\"\")","v":""},{"$f":"VLOOKUP(A239,CADASTRO!C:F,4,0)","v":{"$error":"#N/A"}}]
[null,{"$f":"IF(A240=\"\",\"\",IFERROR(VLOOKUP(A240,CADASTRO!C:D,2,FALSE),\"Produto Não Cadastrado\"))","v":""},{"$f":"IFERROR(VLOOKUP(A240,CADASTRO!C:F,3,0),\"\")","v":""},{"$f":"VLOOKUP(A240,CADASTRO!C:F,4,0)","v":{"$error":"#N/A"}}]
[null,{"$f":"IF(A241=\"\",\"\",IFERROR(VLOOKUP(A241,CADASTRO!C:D,2,FALSE),\"Produto Não Cadastrado\"))","v":""},{"$f":"IFERROR(VLOOKUP(A241,CADASTRO!C:F,3,0),\"\")","v":""},{"$f":"VLOOKUP(A241,CADASTRO!C:F,4,0)","v":{"$error":"#N/A"}}]
[null,{"$f":"IF(A242=\"\",\"\",IFERROR(VLOOKUP(A242,CADASTRO!C:D,2,FALSE),\"Produto Não Cadastrado\"))","v":""},{"$f":"IFERROR(VLOOKUP(A242,CADASTRO!C:F,3,0),\"\")","v":""},{"$f":"VLOOKUP(A242,CADASTRO!C:F,4,0)","v":{"$error":"#N/A"}}]
[null,{"$f":"IF(A243=\"\",\"\",IFERROR(VLOOKUP(A243,CADASTRO!C:D,2,FALSE),\"Produto Não Cadastrado\"))","v":""},{"$f":"IFERROR(VLOOKUP(A243,CADASTRO!C:F,3,0),\"\")","v":""},{"$f":"VLOOKUP(A243,CADASTRO!C:F,4,0)","v":{"$error":"#N/A"}}]
[null,{"$f":"IF(A244=\"\",\"\",IFERROR(VLOOKUP(A244,CADASTRO!C:D,2,FALSE),\"Produto Não Cadastrado\"))","v":""},{"$f":"IFERROR(VLOOKUP(A244,CADASTRO!C:F,3,0),\"\")","v":""},{"$f":"VLOOKUP(A244,CADASTRO!C:F,4,0)","v":{"$error":"#N/A"}}]
[null,{"$f":"IF(A245=\"\",\"\",IFERROR(VLOOKUP(A245,CADASTRO!C:D,2,FALSE),\"Produto Não Cadastrado\"))","v":""},{"$f":"IFERROR(VLOOKUP(A245,CADASTRO!C:F,3,0),\"\")","v":""},{"$f":"VLOOKUP(A245,CADASTRO!C:F,4,0)","v":{"$error":"#N/A"}}]
[null,{"$f":"IF(A246=\"\",\"\",IFERROR(VLOOKUP(A246,CADASTRO!C:D,2,FALSE),\"Produto Não Cadastrado\"))","v":""},{"$f":"IFERROR(VLOOKUP(A246,CADASTRO!C:F,3,0),\"\")","v":""},{"$f":"VLOOKUP(A246,CADASTRO!C:F,4,0)","v":{"$error":"#N/A"}}]
[null,{"$f":"IF(A247=\"\",\"\",IFERROR(VLOOKUP(A247,CADASTRO!C:D,2,FALSE),\"Produto Não Cadastrado\"))","v":""},{"$f":"IFERROR(VLOOKUP(A247,CADASTRO!C:F,3,0),\"\")","v":""},{"$f":"VLOOKUP(A247,CADASTRO!C:F,4,0)","v":{"$error":"#N/A"}}]
[null,{"$f":"IF(A248=\"\",\"\",IFERROR(VLOOKUP(A248,CADASTRO!C:D,2,FALSE),\"Produto Não Cadastrado\"))","v":""},{"$f":"IFERROR(VLOOKUP(A248,CADASTRO!C:F,3,0),\"\")","v":""},{"$f":"VLOOKUP(A248,CADASTRO!C:F,4,0)","v":{"$error":"#N/A"}}]
[null,{"$f":"IF(A249=\"\",\"\",IFERROR(VLOOKUP(A249,CADASTRO!C:D,2,FALSE),\"Produto Não Cadastrado\"))","v":""},{"$f":"IFERROR(VLOOKUP(A249,CADASTRO!C:F,3,0),\"\")","v":""},{"$f":"VLOOKUP(A249,CADASTRO!C:F,4,0)","v":{"$error":"#N/A"}}]
[null,{"$f":"IF(A250=\"\",\"\",IFERROR(VLOOKUP(A250,CADASTRO!C:D,2,FALSE),\"Produto Não Cadastrado\"))","v":""},{"$f":"IFERROR(VLOOKUP(A250,CADASTRO!C:F,3,0),\"\")","v":""},{"$f":"VLOOKUP(A250,CADASTRO!C:F,4,0)","v":{"$error":"#N/A"}}]
[null,{"$f":"IF(A251=\"\",\"\",IFERROR(VLOOKUP(A251,CADASTRO!C:D,2,FALSE),\"Produto Não Cadastrado\"))","v":""},{"$f":"IFERROR(VLOOKUP(A251,CADASTRO!C:F,3,0),\"\")","v":""},{"$f":"VLOOKUP(A251,CADASTRO!C:F,4,0)","v":{"$error":"#N/A"}}]
[null,{"$f":"IF(A252=\"\",\"\",IFERROR(VLOOKUP(A252,CADASTRO!C:D,2,FALSE),\"Produto Não Cadastrado\"))","v":""},{"$f":"IFERROR(VLOOKUP(A252,CADASTRO!C:F,3,0),\"\")","v":""},{"$f":"VLOOKUP(A252,CADASTRO!C:F,4,0)","v":{"$error":"#N/A"}}]
[null,{"$f":"IF(A253=\"\",\"\",IFERROR(VLOOKUP(A253,CADASTRO!C:D,2,FALSE),\"Produto Não Cadastrado\"))","v":""},{"$f":"IFERROR(VLOOKUP(A253,CADASTRO!C:F,3,0),\"\")","v":""},{"$f":"VLOOKUP(A253,CADASTRO!C:F,4,0)","v":{"$error":"#N/A"}}]
[null,{"$f":"IF(A254=\"\",\"\",IFERROR(VLOOKUP(A254,CADASTRO!C:D,2,FALSE),\"Produto Não Cadastrado\"))","v":""},{"$f":"IFERROR(VLOOKUP(A254,CADASTRO!C:F,3,0),\"\")","v":""},{"$f":"VLOOKUP(A254,CADASTRO!C:F,4,0)","v":{"$error":"#N/A"}}]
[null,{"$f":"IF(A255=\"\",\"\",IFERROR(VLOOKUP(A255,CADASTRO!C:D,2,FALSE),\"Produto Não Cadastrado\"))","v":""},{"$f":"IFERROR(VLOOKUP(A255,CADASTRO!C:F,3,0),\"\")","v":""},{"$f":"VLOOKUP(A255,CADASTRO!C:F,4,0)","v":{"$error":"#N/A"}}]
[null,{"$f":"IF(A256=\"\",\"\",IFERROR(VLOOKUP(A256,CADASTRO!C:D,2,FALSE),\"Produto Não Cadastrado\"))","v":""},{"$f":"IFERROR(VLOOKUP(A256,CADASTRO!C:F,3,0),\"\")","v":""},{"$f":"VLOOKUP(A256,CADASTRO!C:F,4,0)","v":{"$error":"#N/A"}}]
[null,{"$f":"IF(A257=\"\",\"\",IFERROR(VLOOKUP(A257,CADASTRO!C:D,2,FALSE),\"Produto Não Cadastrado\"))","v":""},{"$f":"IFERROR(VLOOKUP(A257,CADASTRO!C:F,3,0),\"\")","v":""},{"$f":"VLOOKUP(A257,CADASTRO!C:F,4,0)","v":{"$error":"#N/A"}}]
[null,{"$f":"IF(A258=\"\",\"\",IFERROR(VLOOKUP(A258,CADASTRO!C:D,2,FALSE),\"Produto Não Cadastrado\"))","v":""},{"$f":"IFERROR(VLOOKUP(A258,CADASTRO!C:F,3,0),\"\")","v":""},{"$f":"VLOOKUP(A258,CADASTRO!C:F,4,0)","v":{"$error":"#N/A"}}]
[null,{"$f":"IF(A259=\"\",\"\",IFERROR(VLOOKUP(A259,CADASTRO!C:D,2,FALSE),\"Produto Não Cadastrado\"))","v":""},{"$f":"IFERROR(VLOOKUP(A259,CADASTRO!C:F,3,0),\"\")","v":""},{"$f":"VLOOKUP(A259,CADASTRO!C:F,4,0)","v":{"$error":"#N/A"}}]
[null,{"$f":"IF(A260=\"\",\"\",IFERROR(VLOOKUP(A260,CADASTRO!C:D,2,FALSE),\"Produto Não Cadastrado\"))","v":""},{"$f":"IFERROR(VLOOKUP(A260,CADASTRO!C:F,3,0),\"\")","v":""},{"$f":"VLOOKUP(A260,CADASTRO!C:F,4,0)","v":{"$error":"#N/A"}}]
[null,{"$f":"IF(A261=\"\",\"\",IFERROR(VLOOKUP(A261,CADASTRO!C:D,2,FALSE),\"Produto Não Cadastrado\"))","v":""},{"$f":"IFERROR(VLOOKUP(A261,CADASTRO!C:F,3,0),\"\")","v":""},{"$f":"VLOOKUP(A261,CADASTRO!C:F,4,0)","v":{"$error":"#N/A"}}]
[null,{"$f":"IF(A262=\"\",\"\",IFERROR(VLOOKUP(A262,CADASTRO!C:D,2,FALSE),\"Produto Não Cadastrado\"))","v":""},{"$f":"IFERROR(VLOOKUP(A262,CADASTRO!C:F,3,0),\"\")","v":""},{"$f":"VLOOKUP(A262,CADASTRO!C:F,4,0)","v":{"$error":"#N/A"}}]
[null,{"$f":"IF(A263=\"\",\"\",IFERROR(VLOOKUP(A263,CADASTRO!C:D,2,FALSE),\"Produto Não Cadastrado\"))","v":""},{"$f":"IFERROR(VLOOKUP(A263,CADASTRO!C:F,3,0),\"\")","v":""},{"$f":"VLOOKUP(A263,CADASTRO!C:F,4,0)","v":{"$error":"#N/A"}}]
[null,{"$f":"IF(A264=\"\",\"\",IFERROR(VLOOKUP(A264,CADASTRO!C:D,2,FALSE),\"Produto Não Cadastrado\"))","v":""},{"$f":"IFERROR(VLOOKUP(A264,CADASTRO!C:F,3,0),\"\")","v":""},{"$f":"VLOOKUP(A264,CADASTRO!C:F,4,0)","v":{"$error":"#N/A"}}]
[null,{"$f":"IF(A265=\"\",\"\",IFERROR(VLOOKUP(A265,CADASTRO!C:D,2,FALSE),\"Produto Não Cadastrado\"))","v":""},{"$f":"IFERROR(VLOOKUP(A265,CADASTRO!C:F,3,0),\"\")","v":""},{"$f":"VLOOKUP(A265,CADASTRO!C:F,4,0)","v":{"$error":"#N/A"}}]
[null,{"$f":"IF(A266=\"\",\"\",IFERROR(VLOOKUP(A266,CADASTRO!C:D,2,FALSE),\"Produto Não Cadastrado\"))","v":""},{"$f":"IFERROR(VLOOKUP(A266,CADASTRO!C:F,3,0),\"\")","v":""},{"$f":"VLOOKUP(A266,CADASTRO!C:F,4,0)","v":{"$error":"#N/A"}}]
[null,{"$f":"IF(A267=\"\",\"\",IFERROR(VLOOKUP(A267,CADASTRO!C:D,2,FALSE),\"Produto Não Cadastrado\"))","v":""},{"$f":"IFERROR(VLOOKUP(A267,CADASTRO!C:F,3,0),\"\")","v":""},{"$f":"VLOOKUP(A267,CADASTRO!C:F,4,0)","v":{"$error":"#N/A"}}]
[null,{"$f":"IF(A268=\"\",\"\",IFERROR(VLOOKUP(A268,CADASTRO!C:D,2,FALSE),\"Produto Não Cadastrado\"))","v":""},{"$f":"IFERROR(VLOOKUP(A268,CADASTRO!C:F,3,0),\"\")","v":""},{"$f":"VLOOKUP(A268,CADASTRO!C:F,4,0)","v":{"$error":"#N/A"}}]
[null,{"$f":"IF(A269=\"\",\"\",IFERROR(VLOOKUP(A269,CADASTRO!C:D,2,FALSE),\"Produto Não Cadastrado\"))","v":""},{"$f":"IFERROR(VLOOKUP(A269,CADASTRO!C:F,3,0),\"\")","v":""},{"$f":"VLOOKUP(A269,CADASTRO!C:F,4,0)","v":{"$error":"#N/A"}}]
[null,{"$f":"IF(A270=\"\",\"\",IFERROR(VLOOKUP(A270,CADASTRO!C:D,2,FALSE),\"Produto Não Cadastrado\"))","v":""},{"$f":"IFERROR(VLOOKUP(A270,CADASTRO!C:F,3,0),\"\")","v":""},{"$f":"VLOOKUP(A270,CADASTRO!C:F,4,0)","v":{"$error":"#N/A"}}]
[null,{"$f":"IF(A271=\"\",\"\",IFERROR(VLOOKUP(A271,CADASTRO!C:D,2,FALSE),\"Produto Não Cadastrado\"))","v":""},{"$f":"IFERROR(VLOOKUP(A271,CADASTRO!C:F,3,0),\"\")","v":""},{"$f":"VLOOKUP(A271,CADASTRO!C:F,4,0)","v":{"$error":"#N/A"}}]
[null,{"$f":"IF(A272=\"\",\"\",IFERROR(VLOOKUP(A272,CADASTRO!C:D,2,FALSE),\"Produto Não Cadastrado\"))","v":""},{"$f":"IFERROR(VLOOKUP(A272,CADASTRO!C:F,3,0),\"\")","v":""},{"$f":"VLOOKUP(A272,CADASTRO!C:F,4,0)","v":{"$error":"#N/A"}}]
[null,{"$f":"IF(A273=\"\",\"\",IFERROR(VLOOKUP(A273,CADASTRO!C:D,2,FALSE),\"Produto Não Cadastrado\"))","v":""},{"$f":"IFERROR(VLOOKUP(A273,CADASTRO!C:F,3,0),\"\")","v":""},{"$f":"VLOOKUP(A273,CADASTRO!C:F,4,0)","v":{"$error":"#N/A"}}]
[null,{"$f":"IF(A274=\"\",\"\",IFERROR(VLOOKUP(A274,CADASTRO!C:D,2,FALSE),\"Produto Não Cadastrado\"))","v":""},{"$f":"IFERROR(VLOOKUP(A274,CADASTRO!C:F,3,0),\"\")","v":""},{"$f":"VLOOKUP(A274,CADASTRO!C:F,4,0)","v":{"$error":"#N/A"}}]
[null,{"$f":"IF(A275=\"\",\"\",IFERROR(VLOOKUP(A275,CADASTRO!C:D,2,FALSE),\"Produto Não Cadastrado\"))","v":""},{"$f":"IFERROR(VLOOKUP(A275,CADASTRO!C:F,3,0),\"\")","v":""},{"$f":"VLOOKUP(A275,CADASTRO!C:F,4,0)","v":{"$error":"#N/A"}}]
[null,{"$f":"IF(A276=\"\",\"\",IFERROR(VLOOKUP(A276,CADASTRO!C:D,2,FALSE),\"Produto Não Cadastrado\"))","v":""},{"$f":"IFERROR(VLOOKUP(A276,CADASTRO!C:F,3,0),\"\")","v":""},{"$f":"VLOOKUP(A276,CADASTRO!C:F,4,0)","v":{"$error":"#N/A"}}]
[null,{"$f":"IF(A277=\"\",\"\",IFERROR(VLOOKUP(A277,CADASTRO!C:D,2,FALSE),\"Produto Não Cadastrado\"))","v":""},{"$f":"IFERROR(VLOOKUP(A277,CADASTRO!C:F,3,0),\"\")","v":""},{"$f":"VLOOKUP(A277,CADASTRO!C:F,4,0)","v":{"$error":"#N/A"}}]
[null,{"$f":"IF(A278=\"\",\"\",IFERROR(VLOOKUP(A278,CADASTRO!C:D,2,FALSE),\"Produto Não Cadastrado\"))","v":""},{"$f":"IFERROR(VLOOKUP(A278,CADASTRO!C:F,3,0),\"\")","v":""},{"$f":"VLOOKUP(A278,CADASTRO!C:F,4,0)","v":{"$error":"#N/A"}}]
[null,{"$f":"IF(A279=\"\",\"\",IFERROR(VLOOKUP(A279,CADASTRO!C:D,2,FALSE),\"Produto Não Cadastrado\"))","v":""},{"$f":"IFERROR(VLOOKUP(A279,CADASTRO!C:F,3,0),\"\")","v":""},{"$f":"VLOOKUP(A279,CADASTRO!C:F,4,0)","v":{"$error":"#N/A"}}]
[null,{"$f":"IF(A280=\"\",\"\",IFERROR(VLOOKUP(A280,CADASTRO!C:D,2,FALSE),\"Produto Não Cadastrado\"))","v":""},{"$f":"IFERROR(VLOOKUP(A280,CADASTRO!C:F,3,0),\"\")","v":""},{"$f":"VLOOKUP(A280,CADASTRO!C:F,4,0)","v":{"$error":"#N/A"}}]
[null,{"$f":"IF(A281=\"\",\"\",IFERROR(VLOOKUP(A281,CADASTRO!C:D,2,FALSE),\"Produto Não Cadastrado\"))","v":""},{"$f":"IFERROR(VLOOKUP(A281,CADASTRO!C:F,3,0),\"\")","v":""},{"$f":"VLOOKUP(A281,CADASTRO!C:F,4,0)","v":{"$error":"#N/A"}}]
[null,{"$f":"IF(A282=\"\",\"\",IFERROR(VLOOKUP(A282,CADASTRO!C:D,2,FALSE),\"Produto Não Cadastrado\"))","v":""},{"$f":"IFERROR(VLOOKUP(A282,CADASTRO!C:F,3,0),\"\")","v":""},{"$f":"VLOOKUP(A282,CADASTRO!C:F,4,0)","v":{"$error":"#N/A"}}]
[null,{"$f":"IF(A283=\"\",\"\",IFERROR(VLOOKUP(A283,CADASTRO!C:D,2,FALSE),\"Produto Não Cadastrado\"))","v":""},{"$f":"IFERROR(VLOOKUP(A283,CADASTRO!C:F,3,0),\"\")","v":""},{"$f":"VLOOKUP(A283,CADASTRO!C:F,4,0)","v":{"$error":"#N/A"}}]
[null,{"$f":"IF(A284=\"\",\"\",IFERROR(VLOOKUP(A284,CADASTRO!C:D,2,FALSE),\"Produto Não Cadastrado\"))","v":""},{"$f":"IFERROR(VLOOKUP(A284,CADASTRO!C:F,3,0),\"\")","v":""},{"$f":"VLOOKUP(A284,CADASTRO!C:F,4,0)","v":{"$error":"#N/A"}}]
[null,{"$f":"IF(A285=\"\",\"\",IFERROR(VLOOKUP(A285,CADASTRO!C:D,2,FALSE),\"Produto Não Cadastrado\"))","v":""},{"$f":"IFERROR(VLOOKUP(A285,CADASTRO!C:F,3,0),\"\")","v":""},{"$f":"VLOOKUP(A285,CADASTRO!C:F,4,0)","v":{"$error":"#N/A"}}]
[null,{"$f":"IF(A286=\"\",\"\",IFERROR(VLOOKUP(A286,CADASTRO!C:D,2,FALSE),\"Produto Não Cadastrado\"))","v":""},{"$f":"IFERROR(VLOOKUP(A286,CADASTRO!C:F,3,0),\"\")","v":""},{"$f":"VLOOKUP(A286,CADASTRO!C:F,4,0)","v":{"$error":"#N/A"}}]
[null,{"$f":"IF(A287=\"\",\"\",IFERROR(VLOOKUP(A287,CADASTRO!C:D,2,FALSE),\"Produto Não Cadastrado\"))","v":""},{"$f":"IFERROR(VLOOKUP(A287,CADASTRO!C:F,3,0),\"\")","v":""},{"$f":"VLOOKUP(A287,CADASTRO!C:F,4,0)","v":{"$error":"#N/A"}}]
[null,{"$f":"IF(A288=\"\",\"\",IFERROR(VLOOKUP(A288,CADASTRO!C:D,2,FALSE),\"Produto Não Cadastrado\"))","v":""},{"$f":"IFERROR(VLOOKUP(A288,CADASTRO!C:F,3,0),\"\")","v":""},{"$f":"VLOOKUP(A288,CADASTRO!C:F,4,0)","v":{"$error":"#N/A"}}]
[null,{"$f":"IF(A289=\"\",\"\",IFERROR(VLOOKUP(A289,CADASTRO!C:D,2,FALSE),\"Produto Não Cadastrado\"))","v":""},{"$f":"IFERROR(VLOOKUP(A289,CADASTRO!C:F,3,0),\"\")","v":""},{"$f":"VLOOKUP(A289,CADASTRO!C:F,4,0)","v":{"$error":"#N/A"}}]
[null,{"$f":"IF(A290=\"\",\"\",IFERROR(VLOOKUP(A290,CADASTRO!C:D,2,FALSE),\"Produto Não Cadastrado\"))","v":""},{"$f":"IFERROR(VLOOKUP(A290,CADASTRO!C:F,3,0),\"\")","v":""},{"$f":"VLOOKUP(A290,CADASTRO!C:F,4,0)","v":{"$error":"#N/A"}}]
[null,{"$f":"IF(A291=\"\",\"\",IFERROR(VLOOKUP(A291,CADASTRO!C:D,2,FALSE),\"Produto Não Cadastrado\"))","v":""},{"$f":"IFERROR(VLOOKUP(A291,CADASTRO!C:F,3,0),\"\")","v":""},{"$f":"VLOOKUP(A291,CADASTRO!C:F,4,0)","v":{"$error":"#N/A"}}]
[null,{"$f":"IF(A292=\"\",\"\",IFERROR(VLOOKUP(A292,CADASTRO!C:D,2,FALSE),\"Produto Não Cadastrado\"))","v":""},{"$f":"IFERROR(VLOOKUP(A292,CADASTRO!C:F,3,0),\"\")","v":""},{"$f":"VLOOKUP(A292,CADASTRO!C:F,4,0)","v":{"$error":"#N/A"}}]
[null,{"$f":"IF(A293=\"\",\"\",IFERROR(VLOOKUP(A293,CADASTRO!C:D,2,FALSE),\"Produto Não Cadastrado\"))","v":""},{"$f":"IFERROR(VLOOKUP(A293,CADASTRO!C:F,3,0),\"\")","v":""},{"$f":"VLOOKUP(A293,CADASTRO!C:F,4,0)","v":{"$error":"#N/A"}}]
[null,{"$f":"IF(A294=\"\",\"\",IFERROR(VLOOKUP(A294,CADASTRO!C:D,2,FALSE),\"Produto Não Cadastrado\"))","v":""},{"$f":"IFERROR(VLOOKUP(A294,CADASTRO!C:F,3,0),\"\")","v":""},{"$f":"VLOOKUP(A294,CADASTRO!C:F,4,0)","v":{"$error":"#N/A"}}]
[null,{"$f":"IF(A295=\"\",\"\",IFERROR(VLOOKUP(A295,CADASTRO!C:D,2,FALSE),\"Produto Não Cadastrado\"))","v":""},{"$f":"IFERROR(VLOOKUP(A295,CADASTRO!C:F,3,0),\"\")","v":""},{"$f":"VLOOKUP(A295,CADASTRO!C:F,4,0)","v":{"$error":"#N/A"}}]
[null,{"$f":"IF(A296=\"\",\"\",IFERROR(VLOOKUP(A296,CADASTRO!C:D,2,FALSE),\"Produto Não Cadastrado\"))","v":""},{"$f":"IFERROR(VLOOKUP(A296,CADASTRO!C:F,3,0),\"\")","v":""},{"$f":"VLOOKUP(A296,CADASTRO!C:F,4,0)","v":{"$error":"#N/A"}}]
[null,{"$f":"IF(A297=\"\",\"\",IFERROR(VLOOKUP(A297,CADASTRO!C:D,2,FALSE),\"Produto Não Cadastrado\"))","v":""},{"$f":"IFERROR(VLOOKUP(A297,CADASTRO!C:F,3,0),\"\")","v":""},{"$f":"VLOOKUP(A297,CADASTRO!C:F,4,0)","v":{"$error":"#N/A"}}]
[null,{"$f":"IF(A298=\"\",\"\",IFERROR(VLOOKUP(A298,CADASTRO!C:D,2,FALSE),\"Produto Não Cadastrado\"))","v":""},{"$f":"IFERROR(VLOOKUP(A298,CADASTRO!C:F,3,0),\"\")","v":""},{"$f":"VLOOKUP(A298,CADASTRO!C:F,4,0)","v":{"$error":"#N/A"}}]
[null,{"$f":"IF(A299=\"\",\"\",IFERROR(VLOOKUP(A299,CADASTRO!C:D,2,FALSE),\"Produto Não Cadastrado\"))","v":""},{"$f":"IFERROR(VLOOKUP(A299,CADASTRO!C:F,3,0),\"\")","v":""},{"$f":"VLOOKUP(A299,CADASTRO!C:F,4,0)","v":{"$error":"#N/A"}}]
[null,{"$f":"IF(A300=\"\",\"\",IFERROR(VLOOKUP(A300,CADASTRO!C:D,2,FALSE),\"Produto Não Cadastrado\"))","v":""},{"$f":"IFERROR(VLOOKUP(A300,CADASTRO!C:F,3,0),\"\")","v":""},{"$f":"VLOOKUP(A300,CADASTRO!C:F,4,0)","v":{"$error":"#N/A"}}]
[null,{"$f":"IF(A301=\"\",\"\",IFERROR(VLOOKUP(A301,CADASTRO!C:D,2,FALSE),\"Produto Não Cadastrado\"))","v":""},{"$f":"IFERROR(VLOOKUP(A301,CADASTRO!C:F,3,0),\"\")","v":""},{"$f":"VLOOKUP(A301,CADASTRO!C:F,4,0)","v":{"$error":"#N/A"}}]
[null,{"$f":"IF(A302=\"\",\"\",IFERROR(VLOOKUP(A302,CADASTRO!C:D,2,FALSE),\"Produto Não Cadastrado\"))","v":""},{"$f":"IFERROR(VLOOKUP(A302,CADASTRO!C:F,3,0),\"\")","v":""},{"$f":"VLOOKUP(A302,CADASTRO!C:F,4,0)","v":{"$error":"#N/A"}}]
[null,{"$f":"IF(A303=\"\",\"\",IFERROR(VLOOKUP(A303,CADASTRO!C:D,2,FALSE),\"Produto Não Cadastrado\"))","v":""},{"$f":"IFERROR(VLOOKUP(A303,CADASTRO!C:F,3,0),\"\")","v":""},{"$f":"VLOOKUP(A303,CADASTRO!C:F,4,0)","v":{"$error":"#N/A"}}]
[null,{"$f":"IF(A304=\"\",\"\",IFERROR(VLOOKUP(A304,CADASTRO!C:D,2,FALSE),\"Produto Não Cadastrado\"))","v":""},{"$f":"IFERROR(VLOOKUP(A304,CADASTRO!C:F,3,0),\"\")","v":""},{"$f":"VLOOKUP(A304,CADASTRO!C:F,4,0)","v":{"$error":"#N/A"}}]
[null,{"$f":"IF(A305=\"\",\"\",IFERROR(VLOOKUP(A305,CADASTRO!C:D,2,FALSE),\"Produto Não Cadastrado\"))","v":""},{"$f":"IFERROR(VLOOKUP(A305,CADASTRO!C:F,3,0),\"\")","v":""},{"$f":"VLOOKUP(A305,CADASTRO!C:F,4,0)","v":{"$error":"#N/A"}}]
[null,{"$f":"IF(A306=\"\",\"\",IFERROR(VLOOKUP(A306,CADASTRO!C:D,2,FALSE),\"Produto Não Cadastrado\"))","v":""},{"$f":"IFERROR(VLOOKUP(A306,CADASTRO!C:F,3,0),\"\")","v":""},{"$f":"VLOOKUP(A306,CADASTRO!C:F,4,0)","v":{"$error":"#N/A"}}]
[null,{"$f":"IF(A307=\"\",\"\",IFERROR(VLOOKUP(A307,CADASTRO!C:D,2,FALSE),\"Produto Não Cadastrado\"))","v":""},{"$f":"IFERROR(VLOOKUP(A307,CADASTRO!C:F,3,0),\"\")","v":""},{"$f":"VLOOKUP(A307,CADASTRO!C:F,4,0)","v":{"$error":"#N/A"}}]
[null,{"$f":"IF(A308=\"\",\"\",IFERROR(VLOOKUP(A308,CADASTRO!C:D,2,FALSE),\"Produto Não Cadastrado\"))","v":""},{"$f":"IFERROR(VLOOKUP(A308,CADASTRO!C:F,3,0),\"\")","v":""},{"$f":"VLOOKUP(A308,CADASTRO!C:F,4,0)","v":{"$error":"#N/A"}}]
[null,{"$f":"IF(A309=\"\",\"\",IFERROR(VLOOKUP(A309,CADASTRO!C:D,2,FALSE),\"Produto Não Cadastrado\"))","v":""},{"$f":"IFERROR(VLOOKUP(A309,CADASTRO!C:F,3,0),\"\")","v":""},{"$f":"VLOOKUP(A309,CADASTRO!C:F,4,0)","v":{"$error":"#N/A"}}]
[null,{"$f":"IF(A310=\"\",\"\",IFERROR(VLOOKUP(A310,CADASTRO!C:D,2,FALSE),\"Produto Não Cadastrado\"))","v":""},{"$f":"IFERROR(VLOOKUP(A310,CADASTRO!C:F,3,0),\"\")","v":""},{"$f":"VLOOKUP(A310,CADASTRO!C:F,4,0)","v":{"$error":"#N/A"}}]
[null,{"$f":"IF(A311=\"\",\"\",IFERROR(VLOOKUP(A311,CADASTRO!C:D,2,FALSE),\"Produto Não Cadastrado\"))","v":""},{"$f":"IFERROR(VLOOKUP(A311,CADASTRO!C:F,3,0),\"\")","v":""},{"$f":"VLOOKUP(A311,CADASTRO!C:F,4,0)","v":{"$error":"#N/A"}}]
[null,{"$f":"IF(A312=\"\",\"\",IFERROR(VLOOKUP(A312,CADASTRO!C:D,2,FALSE),\"Produto Não Cadastrado\"))","v":""},{"$f":"IFERROR(VLOOKUP(A312,CADASTRO!C:F,3,0),\"\")","v":""},{"$f":"VLOOKUP(A312,CADASTRO!C:F,4,0)","v":{"$error":"#N/A"}}]
[null,{"$f":"IF(A313=\"\",\"\",IFERROR(VLOOKUP(A313,CADASTRO!C:D,2,FALSE),\"Produto Não Cadastrado\"))","v":""},{"$f":"IFERROR(VLOOKUP(A313,CADASTRO!C:F,3,0),\"\")","v":""},{"$f":"VLOOKUP(A313,CADASTRO!C:F,4,0)","v":{"$error":"#N/A"}}]
[null,{"$f":"IF(A314=\"\",\"\",IFERROR(VLOOKUP(A314,CADASTRO!C:D,2,FALSE),\"Produto Não Cadastrado\"))","v":""},{"$f":"IFERROR(VLOOKUP(A314,CADASTRO!C:F,3,0),\"\")","v":""},{"$f":"VLOOKUP(A314,CADASTRO!C:F,4,0)","v":{"$error":"#N/A"}}]
[null,{"$f":"IF(A315=\"\",\"\",IFERROR(VLOOKUP(A315,CADASTRO!C:D,2,FALSE),\"Produto Não Cadastrado\"))","v":""},{"$f":"IFERROR(VLOOKUP(A315,CADASTRO!C:F,3,0),\"\")","v":""},{"$f":"VLOOKUP(A315,CADASTRO!C:F,4,0)","v":{"$error":"#N/A"}}]
[null,{"$f":"IF(A316=\"\",\"\",IFERROR(VLOOKUP(A316,CADASTRO!C:D,2,FALSE),\"Produto Não Cadastrado\"))","v":""},{"$f":"IFERROR(VLOOKUP(A316,CADASTRO!C:F,3,0),\"\")","v":""},{"$f":"VLOOKUP(A316,CADASTRO!C:F,4,0)","v":{"$error":"#N/A"}}]
[null,{"$f":"IF(A317=\"\",\"\",IFERROR(VLOOKUP(A317,CADASTRO!C:D,2,FALSE),\"Produto Não Cadastrado\"))","v":""},{"$f":"IFERROR(VLOOKUP(A317,CADASTRO!C:F,3,0),\"\")","v":""},{"$f":"VLOOKUP(A317,CADASTRO!C:F,4,0)","v":{"$error":"#N/A"}}]
[null,{"$f":"IF(A318=\"\",\"\",IFERROR(VLOOKUP(A318,CADASTRO!C:D,2,FALSE),\"Produto Não Cadastrado\"))","v":""},{"$f":"IFERROR(VLOOKUP(A318,CADASTRO!C:F,3,0),\"\")","v":""},{"$f":"VLOOKUP(A318,CADASTRO!C:F,4,0)","v":{"$error":"#N/A"}}]
[null,{"$f":"IF(A319=\"\",\"\",IFERROR(VLOOKUP(A319,CADASTRO!C:D,2,FALSE),\"Produto Não Cadastrado\"))","v":""},{"$f":"IFERROR(VLOOKUP(A319,CADASTRO!C:F,3,0),\"\")","v":""},{"$f":"VLOOKUP(A319,CADASTRO!C:F,4,0)","v":{"$error":"#N/A"}}]
[null,{"$f":"IF(A320=\"\",\"\",IFERROR(VLOOKUP(A320,CADASTRO!C:D,2,FALSE),\"Produto Não Cadastrado\"))","v":""},{"$f":"IFERROR(VLOOKUP(A320,CADASTRO!C:F,3,0),\"\")","v":""},{"$f":"VLOOKUP(A320,CADASTRO!C:F,4,0)","v":{"$error":"#N/A"}}]
[null,{"$f":"IF(A321=\"\",\"\",IFERROR(VLOOKUP(A321,CADASTRO!C:D,2,FALSE),\"Produto Não Cadastrado\"))","v":""},{"$f":"IFERROR(VLOOKUP(A321,CADASTRO!C:F,3,0),\"\")","v":""},{"$f":"VLOOKUP(A321,CADASTRO!C:F,4,0)","v":{"$error":"#N/A"}}]
[null,{"$f":"IF(A322=\"\",\"\",IFERROR(VLOOKUP(A322,CADASTRO!C:D,2,FALSE),\"Produto Não Cadastrado\"))","v":""},{"$f":"IFERROR(VLOOKUP(A322,CADASTRO!C:F,3,0),\"\")","v":""},{"$f":"VLOOKUP(A322,CADASTRO!C:F,4,0)","v":{"$error":"#N/A"}}]
[null,{"$f":"IF(A323=\"\",\"\",IFERROR(VLOOKUP(A323,CADASTRO!C:D,2,FALSE),\"Produto Não Cadastrado\"))","v":""},{"$f":"IFERROR(VLOOKUP(A323,CADASTRO!C:F,3,0),\"\")","v":""},{"$f":"VLOOKUP(A323,CADASTRO!C:F,4,0)","v":{"$error":"#N/A"}}]
[null,{"$f":"IF(A324=\"\",\"\",IFERROR(VLOOKUP(A324,CADASTRO!C:D,2,FALSE),\"Produto Não Cadastrado\"))","v":""},{"$f":"IFERROR(VLOOKUP(A324,CADASTRO!C:F,3,0),\"\")","v":""},{"$f":"VLOOKUP(A324,CADASTRO!C:F,4,0)","v":{"$error":"#N/A"}}]
[null,{"$f":"IF(A325=\"\",\"\",IFERROR(VLOOKUP(A325,CADASTRO!C:D,2,FALSE),\"Produto Não Cadastrado\"))","v":""},{"$f":"IFERROR(VLOOKUP(A325,CADASTRO!C:F,3,0),\"\")","v":""},{"$f":"VLOOKUP(A325,CADASTRO!C:F,4,0)","v":{"$error":"#N/A"}}]
[null,{"$f":"IF(A326=\"\",\"\",IFERROR(VLOOKUP(A326,CADASTRO!C:D,2,FALSE),\"Produto Não Cadastrado\"))","v":""},{"$f":"IFERROR(VLOOKUP(A326,CADASTRO!C:F,3,0),\"\")","v":""},{"$f":"VLOOKUP(A326,CADASTRO!C:F,4,0)","v":{"$error":"#N/A"}}]
[null,{"$f":"IF(A327=\"\",\"\",IFERROR(VLOOKUP(A327,CADASTRO!C:D,2,FALSE),\"Produto Não Cadastrado\"))","v":""},{"$f":"IFERROR(VLOOKUP(A327,CADASTRO!C:F,3,0),\"\")","v":""},{"$f":"VLOOKUP(A327,CADASTRO!C:F,4,0)","v":{"$error":"#N/A"}}]
[null,{"$f":"IF(A328=\"\",\"\",IFERROR(VLOOKUP(A328,CADASTRO!C:D,2,FALSE),\"Produto Não Cadastrado\"))","v":""},{"$f":"IFERROR(VLOOKUP(A328,CADASTRO!C:F,3,0),\"\")","v":""},{"$f":"VLOOKUP(A328,CADASTRO!C:F,4,0)","v":{"$error":"#N/A"}}]
[null,{"$f":"IF(A329=\"\",\"\",IFERROR(VLOOKUP(A329,CADASTRO!C:D,2,FALSE),\"Produto Não Cadastrado\"))","v":""},{"$f":"IFERROR(VLOOKUP(A329,CADASTRO!C:F,3,0),\"\")","v":""},{"$f":"VLOOKUP(A329,CADASTRO!C:F,4,0)","v":{"$error":"#N/A"}}]
[null,{"$f":"IF(A330=\"\",\"\",IFERROR(VLOOKUP(A330,CADASTRO!C:D,2,FALSE),\"Produto Não Cadastrado\"))","v":""},{"$f":"IFERROR(VLOOKUP(A330,CADASTRO!C:F,3,0),\"\")","v":""},{"$f":"VLOOKUP(A330,CADASTRO!C:F,4,0)","v":{"$error":"#N/A"}}]
[null,{"$f":"IF(A331=\"\",\"\",IFERROR(VLOOKUP(A331,CADASTRO!C:D,2,FALSE),\"Produto Não Cadastrado\"))","v":""},{"$f":"IFERROR(VLOOKUP(A331,CADASTRO!C:F,3,0),\"\")","v":""},{"$f":"VLOOKUP(A331,CADASTRO!C:F,4,0)","v":{"$error":"#N/A"}}]
[null,{"$f":"IF(A332=\"\",\"\",IFERROR(VLOOKUP(A332,CADASTRO!C:D,2,FALSE),\"Produto Não Cadastrado\"))","v":""},{"$f":"IFERROR(VLOOKUP(A332,CADASTRO!C:F,3,0),\"\")","v":""},{"$f":"VLOOKUP(A332,CADASTRO!C:F,4,0)","v":{"$error":"#N/A"}}]
[null,{"$f":"IF(A333=\"\",\"\",IFERROR(VLOOKUP(A333,CADASTRO!C:D,2,FALSE),\"Produto Não Cadastrado\"))","v":""},{"$f":"IFERROR(VLOOKUP(A333,CADASTRO!C:F,3,0),\"\")","v":""},{"$f":"VLOOKUP(A333,CADASTRO!C:F,4,0)","v":{"$error":"#N/A"}}]
[null,{"$f":"IF(A334=\"\",\"\",IFERROR(VLOOKUP(A334,CADASTRO!C:D,2,FALSE),\"Produto Não Cadastrado\"))","v":""},{"$f":"IFERROR(VLOOKUP(A334,CADASTRO!C:F,3,0),\"\")","v":""},{"$f":"VLOOKUP(A334,CADASTRO!C:F,4,0)","v":{"$error":"#N/A"}}]
[null,{"$f":"IF(A335=\"\",\"\",IFERROR(VLOOKUP(A335,CADASTRO!C:D,2,FALSE),\"Produto Não Cadastrado\"))","v":""},{"$f":"IFERROR(VLOOKUP(A335,CADASTRO!C:F,3,0),\"\")","v":""},{"$f":"VLOOKUP(A335,CADASTRO!C:F,4,0)","v":{"$error":"#N/A"}}]
[null,{"$f":"IF(A336=\"\",\"\",IFERROR(VLOOKUP(A336,CADASTRO!C:D,2,FALSE),\"Produto Não Cadastrado\"))","v":""},{"$f":"IFERROR(VLOOKUP(A336,CADASTRO!C:F,3,0),\"\")","v":""},{"$f":"VLOOKUP(A336,CADASTRO!C:F,4,0)","v":{"$error":"#N/A"}}]
[null,{"$f":"IF(A337=\"\",\"\",IFERROR(VLOOKUP(A337,CADASTRO!C:D,2,FALSE),\"Produto Não Cadastrado\"))","v":""},{"$f":"IFERROR(VLOOKUP(A337,CADASTRO!C:F,3,0),\"\")","v":""},{"$f":"VLOOKUP(A337,CADASTRO!C:F,4,0)","v":{"$error":"#N/A"}}]
[null,{"$f":"IF(A338=\"\",\"\",IFERROR(VLOOKUP(A338,CADASTRO!C:D,2,FALSE),\"Produto Não Cadastrado\"))","v":""},{"$f":"IFERROR(VLOOKUP(A338,CADASTRO!C:F,3,0),\"\")","v":""},{"$f":"VLOOKUP(A338,CADASTRO!C:F,4,0)","v":{"$error":"#N/A"}}]
[null,{"$f":"IF(A339=\"\",\"\",IFERROR(VLOOKUP(A339,CADASTRO!C:D,2,FALSE),\"Produto Não Cadastrado\"))","v":""},{"$f":"IFERROR(VLOOKUP(A339,CADASTRO!C:F,3,0),\"\")","v":""},{"$f":"VLOOKUP(A339,CADASTRO!C:F,4,0)","v":{"$error":"#N/A"}}]
[null,{"$f":"IF(A340=\"\",\"\",IFERROR(VLOOKUP(A340,CADASTRO!C:D,2,FALSE),\"Produto Não Cadastrado\"))","v":""},{"$f":"IFERROR(VLOOKUP(A340,CADASTRO!C:F,3,0),\"\")","v":""},{"$f":"VLOOKUP(A340,CADASTRO!C:F,4,0)","v":{"$error":"#N/A"}}]
[null,{"$f":"IF(A341=\"\",\"\",IFERROR(VLOOKUP(A341,CADASTRO!C:D,2,FALSE),\"Produto Não Cadastrado\"))","v":""},{"$f":"IFERROR(VLOOKUP(A341,CADASTRO!C:F,3,0),\"\")","v":""},{"$f":"VLOOKUP(A341,CADASTRO!C:F,4,0)","v":{"$error":"#N/A"}}]
[null,{"$f":"IF(A342=\"\",\"\",IFERROR(VLOOKUP(A342,CADASTRO!C:D,2,FALSE),\"Produto Não Cadastrado\"))","v":""},{"$f":"IFERROR(VLOOKUP(A342,CADASTRO!C:F,3,0),\"\")","v":""},{"$f":"VLOOKUP(A342,CADASTRO!C:F,4,0)","v":{"$error":"#N/A"}}]
[null,{"$f":"IF(A343=\"\",\"\",IFERROR(VLOOKUP(A343,CADASTRO!C:D,2,FALSE),\"Produto Não Cadastrado\"))","v":""},{"$f":"IFERROR(VLOOKUP(A343,CADASTRO!C:F,3,0),\"\")","v":""},{"$f":"VLOOKUP(A343,CADASTRO!C:F,4,0)","v":{"$error":"#N/A"}}]
[null,{"$f":"IF(A344=\"\",\"\",IFERROR(VLOOKUP(A344,CADASTRO!C:D,2,FALSE),\"Produto Não Cadastrado\"))","v":""},{"$f":"IFERROR(VLOOKUP(A344,CADASTRO!C:F,3,0),\"\")","v":""},{"$f":"VLOOKUP(A344,CADASTRO!C:F,4,0)","v":{"$error":"#N/A"}}]
[null,{"$f":"IF(A345=\"\",\"\",IFERROR(VLOOKUP(A345,CADASTRO!C:D,2,FALSE),\"Produto Não Cadastrado\"))","v":""},{"$f":"IFERROR(VLOOKUP(A345,CADASTRO!C:F,3,0),\"\")","v":""},{"$f":"VLOOKUP(A345,CADASTRO!C:F,4,0)","v":{"$error":"#N/A"}}]
[null,{"$f":"IF(A346=\"\",\"\",IFERROR(VLOOKUP(A346,CADASTRO!C:D,2,FALSE),\"Produto Não Cadastrado\"))","v":""},{"$f":"IFERROR(VLOOKUP(A346,CADASTRO!C:F,3,0),\"\")","v":""},{"$f":"VLOOKUP(A346,CADASTRO!C:F,4,0)","v":{"$error":"#N/A"}}]
[null,{"$f":"IF(A347=\"\",\"\",IFERROR(VLOOKUP(A347,CADASTRO!C:D,2,FALSE),\"Produto Não Cadastrado\"))","v":""},{"$f":"IFERROR(VLOOKUP(A347,CADASTRO!C:F,3,0),\"\")","v":""},{"$f":"VLOOKUP(A347,CADASTRO!C:F,4,0)","v":{"$error":"#N/A"}}]
[null,{"$f":"IF(A348=\"\",\"\",IFERROR(VLOOKUP(A348,CADASTRO!C:D,2,FALSE),\"Produto Não Cadastrado\"))","v":""},{"$f":"IFERROR(VLOOKUP(A348,CADASTRO!C:F,3,0),\"\")","v":""},{"$f":"VLOOKUP(A348,CADASTRO!C:F,4,0)","v":{"$error":"#N/A"}}]
[null,{"$f":"IF(A349=\"\",\"\",IFERROR(VLOOKUP(A349,CADASTRO!C:D,2,FALSE),\"Produto Não Cadastrado\"))","v":""},{"$f":"IFERROR(VLOOKUP(A349,CADASTRO!C:F,3,0),\"\")","v":""},{"$f":"VLOOKUP(A349,CADASTRO!C:F,4,0)","v":{"$error":"#N/A"}}]
[null,{"$f":"IF(A350=\"\",\"\",IFERROR(VLOOKUP(A350,CADASTRO!C:D,2,FALSE),\"Produto Não Cadastrado\"))","v":""},{"$f":"IFERROR(VLOOKUP(A350,CADASTRO!C:F,3,0),\"\")","v":""},{"$f":"VLOOKUP(A350,CADASTRO!C:F,4,0)","v":{"$error":"#N/A"}}]
[null,{"$f":"IF(A351=\"\",\"\",IFERROR(VLOOKUP(A351,CADASTRO!C:D,2,FALSE),\"Produto Não Cadastrado\"))","v":""},{"$f":"IFERROR(VLOOKUP(A351,CADASTRO!C:F,3,0),\"\")","v":""},{"$f":"VLOOKUP(A351,CADASTRO!C:F,4,0)","v":{"$error":"#N/A"}}]
[null,{"$f":"IF(A352=\"\",\"\",IFERROR(VLOOKUP(A352,CADASTRO!C:D,2,FALSE),\"Produto Não Cadastrado\"))","v":""},{"$f":"IFERROR(VLOOKUP(A352,CADASTRO!C:F,3,0),\"\")","v":""},{"$f":"VLOOKUP(A352,CADASTRO!C:F,4,0)","v":{"$error":"#N/A"}}]
[null,{"$f":"IF(A353=\"\",\"\",IFERROR(VLOOKUP(A353,CADASTRO!C:D,2,FALSE),\"Produto Não Cadastrado\"))","v":""},{"$f":"IFERROR(VLOOKUP(A353,CADASTRO!C:F,3,0),\"\")","v":""},{"$f":"VLOOKUP(A353,CADASTRO!C:F,4,0)","v":{"$error":"#N/A"}}]
[null,{"$f":"IF(A354=\"\",\"\",IFERROR(VLOOKUP(A354,CADASTRO!C:D,2,FALSE),\"Produto Não Cadastrado\"))","v":""},{"$f":"IFERROR(VLOOKUP(A354,CADASTRO!C:F,3,0),\"\")","v":""},{"$f":"VLOOKUP(A354,CADASTRO!C:F,4,0)","v":{"$error":"#N/A"}}]
[null,{"$f":"IF(A355=\"\",\"\",IFERROR(VLOOKUP(A355,CADASTRO!C:D,2,FALSE),\"Produto Não Cadastrado\"))","v":""},{"$f":"IFERROR(VLOOKUP(A355,CADASTRO!C:F,3,0),\"\")","v":""},{"$f":"VLOOKUP(A355,CADASTRO!C:F,4,0)","v":{"$error":"#N/A"}}]
[null,{"$f":"IF(A356=\"\",\"\",IFERROR(VLOOKUP(A356,CADASTRO!C:D,2,FALSE),\"Produto Não Cadastrado\"))","v":""},{"$f":"IFERROR(VLOOKUP(A356,CADASTRO!C:F,3,0),\"\")","v":""},{"$f":"VLOOKUP(A356,CADASTRO!C:F,4,0)","v":{"$error":"#N/A"}}]
[null,{"$f":"IF(A357=\"\",\"\",IFERROR(VLOOKUP(A357,CADASTRO!C:D,2,FALSE),\"Produto Não Cadastrado\"))","v":""},{"$f":"IFERROR(VLOOKUP(A357,CADASTRO!C:F,3,0),\"\")","v":""},{"$f":"VLOOKUP(A357,CADASTRO!C:F,4,0)","v":{"$error":"#N/A"}}]
[null,{"$f":"IF(A358=\"\",\"\",IFERROR(VLOOKUP(A358,CADASTRO!C:D,2,FALSE),\"Produto Não Cadastrado\"))","v":""},{"$f":"IFERROR(VLOOKUP(A358,CADASTRO!C:F,3,0),\"\")","v":""},{"$f":"VLOOKUP(A358,CADASTRO!C:F,4,0)","v":{"$error":"#N/A"}}]
[null,{"$f":"IF(A359=\"\",\"\",IFERROR(VLOOKUP(A359,CADASTRO!C:D,2,FALSE),\"Produto Não Cadastrado\"))","v":""},{"$f":"IFERROR(VLOOKUP(A359,CADASTRO!C:F,3,0),\"\")","v":""},{"$f":"VLOOKUP(A359,CADASTRO!C:F,4,0)","v":{"$error":"#N/A"}}]
[null,{"$f":"IF(A360=\"\",\"\",IFERROR(VLOOKUP(A360,CADASTRO!C:D,2,FALSE),\"Produto Não Cadastrado\"))","v":""},{"$f":"IFERROR(VLOOKUP(A360,CADASTRO!C:F,3,0),\"\")","v":""},{"$f":"VLOOKUP(A360,CADASTRO!C:F,4,0)","v":{"$error":"#N/A"}}]
[null,{"$f":"IF(A361=\"\",\"\",IFERROR(VLOOKUP(A361,CADASTRO!C:D,2,FALSE),\"Produto Não Cadastrado\"))","v":""},{"$f":"IFERROR(VLOOKUP(A361,CADASTRO!C:F,3,0),\"\")","v":""},{"$f":"VLOOKUP(A361,CADASTRO!C:F,4,0)","v":{"$error":"#N/A"}}]
[null,{"$f":"IF(A362=\"\",\"\",IFERROR(VLOOKUP(A362,CADASTRO!C:D,2,FALSE),\"Produto Não Cadastrado\"))","v":""},{"$f":"IFERROR(VLOOKUP(A362,CADASTRO!C:F,3,0),\"\")","v":""},{"$f":"VLOOKUP(A362,CADASTRO!C:F,4,0)","v":{"$error":"#N/A"}}]
[null,{"$f":"IF(A363=\"\",\"\",IFERROR(VLOOKUP(A363,CADASTRO!C:D,2,FALSE),\"Produto Não Cadastrado\"))","v":""},{"$f":"IFERROR(VLOOKUP(A363,CADASTRO!C:F,3,0),\"\")","v":""},{"$f":"VLOOKUP(A363,CADASTRO!C:F,4,0)","v":{"$error":"#N/A"}}]
[null,{"$f":"IF(A364=\"\",\"\",IFERROR(VLOOKUP(A364,CADASTRO!C:D,2,FALSE),\"Produto Não Cadastrado\"))","v":""},{"$f":"IFERROR(VLOOKUP(A364,CADASTRO!C:F,3,0),\"\")","v":""},{"$f":"VLOOKUP(A364,CADASTRO!C:F,4,0)","v":{"$error":"#N/A"}}]
[null,{"$f":"IF(A365=\"\",\"\",IFERROR(VLOOKUP(A365,CADASTRO!C:D,2,FALSE),\"Produto Não Cadastrado\"))","v":""},{"$f":"IFERROR(VLOOKUP(A365,CADASTRO!C:F,3,0),\"\")","v":""},{"$f":"VLOOKUP(A365,CADASTRO!C:F,4,0)","v":{"$error":"#N/A"}}]
[null,{"$f":"IF(A366=\"\",\"\",IFERROR(VLOOKUP(A366,CADASTRO!C:D,2,FALSE),\"Produto Não Cadastrado\"))","v":""},{"$f":"IFERROR(VLOOKUP(A366,CADASTRO!C:F,3,0),\"\")","v":""},{"$f":"VLOOKUP(A366,CADASTRO!C:F,4,0)","v":{"$error":"#N/A"}}]
[null,{"$f":"IF(A367=\"\",\"\",IFERROR(VLOOKUP(A367,CADASTRO!C:D,2,FALSE),\"Produto Não Cadastrado\"))","v":""},{"$f":"IFERROR(VLOOKUP(A367,CADASTRO!C:F,3,0),\"\")","v":""},{"$f":"VLOOKUP(A367,CADASTRO!C:F,4,0)","v":{"$error":"#N/A"}}]
[null,{"$f":"IF(A368=\"\",\"\",IFERROR(VLOOKUP(A368,CADASTRO!C:D,2,FALSE),\"Produto Não Cadastrado\"))","v":""},{"$f":"IFERROR(VLOOKUP(A368,CADASTRO!C:F,3,0),\"\")","v":""},{"$f":"VLOOKUP(A368,CADASTRO!C:F,4,0)","v":{"$error":"#N/A"}}]
[null,{"$f":"IF(A369=\"\",\"\",IFERROR(VLOOKUP(A369,CADASTRO!C:D,2,FALSE),\"Produto Não Cadastrado\"))","v":""},{"$f":"IFERROR(VLOOKUP(A369,CADASTRO!C:F,3,0),\"\")","v":""},{"$f":"VLOOKUP(A369,CADASTRO!C:F,4,0)","v":{"$error":"#N/A"}}]
[null,{"$f":"IF(A370=\"\",\"\",IFERROR(VLOOKUP(A370,CADASTRO!C:D,2,FALSE),\"Produto Não Cadastrado\"))","v":""},{"$f":"IFERROR(VLOOKUP(A370,CADASTRO!C:F,3,0),\"\")","v":""},{"$f":"VLOOKUP(A370,CADASTRO!C:F,4,0)","v":{"$error":"#N/A"}}]
[null,{"$f":"IF(A371=\"\",\"\",IFERROR(VLOOKUP(A371,CADASTRO!C:D,2,FALSE),\"Produto Não Cadastrado\"))","v":""},{"$f":"IFERROR(VLOOKUP(A371,CADASTRO!C:F,3,0),\"\")","v":""},{"$f":"VLOOKUP(A371,CADASTRO!C:F,4,0)","v":{"$error":"#N/A"}}]
[null,{"$f":"IF(A372=\"\",\"\",IFERROR(VLOOKUP(A372,CADASTRO!C:D,2,FALSE),\"Produto Não Cadastrado\"))","v":""},{"$f":"IFERROR(VLOOKUP(A372,CADASTRO!C:F,3,0),\"\")","v":""},{"$f":"VLOOKUP(A372,CADASTRO!C:F,4,0)","v":{"$error":"#N/A"}}]
[null,{"$f":"IF(A373=\"\",\"\",IFERROR(VLOOKUP(A373,CADASTRO!C:D,2,FALSE),\"Produto Não Cadastrado\"))","v":""},{"$f":"IFERROR(VLOOKUP(A373,CADASTRO!C:F,3,0),\"\")","v":""},{"$f":"VLOOKUP(A373,CADASTRO!C:F,4,0)","v":{"$error":"#N/A"}}]
[null,{"$f":"IF(A374=\"\",\"\",IFERROR(VLOOKUP(A374,CADASTRO!C:D,2,FALSE),\"Produto Não Cadastrado\"))","v":""},{"$f":"IFERROR(VLOOKUP(A374,CADASTRO!C:F,3,0),\"\")","v":""},{"$f":"VLOOKUP(A374,CADASTRO!C:F,4,0)","v":{"$error":"#N/A"}}]
[null,{"$f":"IF(A375=\"\",\"\",IFERROR(VLOOKUP(A375,CADASTRO!C:D,2,FALSE),\"Produto Não Cadastrado\"))","v":""},{"$f":"IFERROR(VLOOKUP(A375,CADASTRO!C:F,3,0),\"\")","v":""},{"$f":"VLOOKUP(A375,CADASTRO!C:F,4,0)","v":{"$error":"#N/A"}}]
[null,{"$f":"IF(A376=\"\",\"\",IFERROR(VLOOKUP(A376,CADASTRO!C:D,2,FALSE),\"Produto Não Cadastrado\"))","v":""},{"$f":"IFERROR(VLOOKUP(A376,CADASTRO!C:F,3,0),\"\")","v":""},{"$f":"VLOOKUP(A376,CADASTRO!C:F,4,0)","v":{"$error":"#N/A"}}]
[null,{"$f":"IF(A377=\"\",\"\",IFERROR(VLOOKUP(A377,CADASTRO!C:D,2,FALSE),\"Produto Não Cadastrado\"))","v":""},{"$f":"IFERROR(VLOOKUP(A377,CADASTRO!C:F,3,0),\"\")","v":""},{"$f":"VLOOKUP(A377,CADASTRO!C:F,4,0)","v":{"$error":"#N/A"}}]
[null,{"$f":"IF(A378=\"\",\"\",IFERROR(VLOOKUP(A378,CADASTRO!C:D,2,FALSE),\"Produto Não Cadastrado\"))","v":""},{"$f":"IFERROR(VLOOKUP(A378,CADASTRO!C:F,3,0),\"\")","v":""},{"$f":"VLOOKUP(A378,CADASTRO!C:F,4,0)","v":{"$error":"#N/A"}}]
[null,{"$f":"IF(A379=\"\",\"\",IFERROR(VLOOKUP(A379,CADASTRO!C:D,2,FALSE),\"Produto Não Cadastrado\"))","v":""},{"$f":"IFERROR(VLOOKUP(A379,CADASTRO!C:F,3,0),\"\")","v":""},{"$f":"VLOOKUP(A379,CADASTRO!C:F,4,0)","v":{"$error":"#N/A"}}]
[null,{"$f":"IF(A380=\"\",\"\",IFERROR(VLOOKUP(A380,CADASTRO!C:D,2,FALSE),\"Produto Não Cadastrado\"))","v":""},{"$f":"IFERROR(VLOOKUP(A380,CADASTRO!C:F,3,0),\"\")","v":""},{"$f":"VLOOKUP(A380,CADASTRO!C:F,4,0)","v":{"$error":"#N/A"}}]
[null,{"$f":"IF(A381=\"\",\"\",IFERROR(VLOOKUP(A381,CADASTRO!C:D,2,FALSE),\"Produto Não Cadastrado\"))","v":""},{"$f":"IFERROR(VLOOKUP(A381,CADASTRO!C:F,3,0),\"\")","v":""},{"$f":"VLOOKUP(A381,CADASTRO!C:F,4,0)","v":{"$error":"#N/A"}}]
[null,{"$f":"IF(A382=\"\",\"\",IFERROR(VLOOKUP(A382,CADASTRO!C:D,2,FALSE),\"Produto Não Cadastrado\"))","v":""},{"$f":"IFERROR(VLOOKUP(A382,CADASTRO!C:F,3,0),\"\")","v":""},{"$f":"VLOOKUP(A382,CADASTRO!C:F,4,0)","v":{"$error":"#N/A"}}]
[null,{"$f":"IF(A383=\"\",\"\",IFERROR(VLOOKUP(A383,CADASTRO!C:D,2,FALSE),\"Produto Não Cadastrado\"))","v":""},{"$f":"IFERROR(VLOOKUP(A383,CADASTRO!C:F,3,0),\"\")","v":""},{"$f":"VLOOKUP(A383,CADASTRO!C:F,4,0)","v":{"$error":"#N/A"}}]
[null,{"$f":"IF(A384=\"\",\"\",IFERROR(VLOOKUP(A384,CADASTRO!C:D,2,FALSE),\"Produto Não Cadastrado\"))","v":""},{"$f":"IFERROR(VLOOKUP(A384,CADASTRO!C:F,3,0),\"\")","v":""},{"$f":"VLOOKUP(A384,CADASTRO!C:F,4,0)","v":{"$error":"#N/A"}}]
[null,{"$f":"IF(A385=\"\",\"\",IFERROR(VLOOKUP(A385,CADASTRO!C:D,2,FALSE),\"Produto Não Cadastrado\"))","v":""},{"$f":"IFERROR(VLOOKUP(A385,CADASTRO!C:F,3,0),\"\")","v":""},{"$f":"VLOOKUP(A385,CADASTRO!C:F,4,0)","v":{"$error":"#N/A"}}]
[null,{"$f":"IF(A386=\"\",\"\",IFERROR(VLOOKUP(A386,CADASTRO!C:D,2,FALSE),\"Produto Não Cadastrado\"))","v":""},{"$f":"IFERROR(VLOOKUP(A386,CADASTRO!C:F,3,0),\"\")","v":""},{"$f":"VLOOKUP(A386,CADASTRO!C:F,4,0)","v":{"$error":"#N/A"}}]
[null,{"$f":"IF(A387=\"\",\"\",IFERROR(VLOOKUP(A387,CADASTRO!C:D,2,FALSE),\"Produto Não Cadastrado\"))","v":""},{"$f":"IFERROR(VLOOKUP(A387,CADASTRO!C:F,3,0),\"\")","v":""},{"$f":"VLOOKUP(A387,CADASTRO!C:F,4,0)","v":{"$error":"#N/A"}}]
[null,{"$f":"IF(A388=\"\",\"\",IFERROR(VLOOKUP(A388,CADASTRO!C:D,2,FALSE),\"Produto Não Cadastrado\"))","v":""},{"$f":"IFERROR(VLOOKUP(A388,CADASTRO!C:F,3,0),\"\")","v":""},{"$f":"VLOOKUP(A388,CADASTRO!C:F,4,0)","v":{"$error":"#N/A"}}]
[null,{"$f":"IF(A389=\"\",\"\",IFERROR(VLOOKUP(A389,CADASTRO!C:D,2,FALSE),\"Produto Não Cadastrado\"))","v":""},{"$f":"IFERROR(VLOOKUP(A389,CADASTRO!C:F,3,0),\"\")","v":""},{"$f":"VLOOKUP(A389,CADASTRO!C:F,4,0)","v":{"$error":"#N/A"}}]
[null,{"$f":"IF(A390=\"\",\"\",IFERROR(VLOOKUP(A390,CADASTRO!C:D,2,FALSE),\"Produto Não Cadastrado\"))","v":""},{"$f":"IFERROR(VLOOKUP(A390,CADASTRO!C:F,3,0),\"\")","v":""},{"$f":"VLOOKUP(A390,CADASTRO!C:F,4,0)","v":{"$error":"#N/A"}}]
[null,{"$f":"IF(A391=\"\",\"\",IFERROR(VLOOKUP(A391,CADASTRO!C:D,2,FALSE),\"Produto Não Cadastrado\"))","v":""},{"$f":"IFERROR(VLOOKUP(A391,CADASTRO!C:F,3,0),\"\")","v":""},{"$f":"VLOOKUP(A391,CADASTRO!C:F,4,0)","v":{"$error":"#N/A"}}]
[null,{"$f":"IF(A392=\"\",\"\",IFERROR(VLOOKUP(A392,CADASTRO!C:D,2,FALSE),\"Produto Não Cadastrado\"))","v":""},{"$f":"IFERROR(VLOOKUP(A392,CADASTRO!C:F,3,0),\"\")","v":""},{"$f":"VLOOKUP(A392,CADASTRO!C:F,4,0)","v":{"$error":"#N/A"}}]
[null,{"$f":"IF(A393=\"\",\"\",IFERROR(VLOOKUP(A393,CADASTRO!C:D,2,FALSE),\"Produto Não Cadastrado\"))","v":""},{"$f":"IFERROR(VLOOKUP(A393,CADASTRO!C:F,3,0),\"\")","v":""},{"$f":"VLOOKUP(A393,CADASTRO!C:F,4,0)","v":{"$error":"#N/A"}}]
[null,{"$f":"IF(A394=\"\",\"\",IFERROR(VLOOKUP(A394,CADASTRO!C:D,2,FALSE),\"Produto Não Cadastrado\"))","v":""},{"$f":"IFERROR(VLOOKUP(A394,CADASTRO!C:F,3,0),\"\")","v":""},{"$f":"VLOOKUP(A394,CADASTRO!C:F,4,0)","v":{"$error":"#N/A"}}]
[null,{"$f":"IF(A395=\"\",\"\",IFERROR(VLOOKUP(A395,CADASTRO!C:D,2,FALSE),\"Produto Não Cadastrado\"))","v":""},{"$f":"IFERROR(VLOOKUP(A395,CADASTRO!C:F,3,0),\"\")","v":""},{"$f":"VLOOKUP(A395,CADASTRO!C:F,4,0)","v":{"$error":"#N/A"}}]
[null,{"$f":"IF(A396=\"\",\"\",IFERROR(VLOOKUP(A396,CADASTRO!C:D,2,FALSE),\"Produto Não Cadastrado\"))","v":""},{"$f":"IFERROR(VLOOKUP(A396,CADASTRO!C:F,3,0),\"\")","v":""},{"$f":"VLOOKUP(A396,CADASTRO!C:F,4,0)","v":{"$error":"#N/A"}}]
[null,{"$f":"IF(A397=\"\",\"\",IFERROR(VLOOKUP(A397,CADASTRO!C:D,2,FALSE),\"Produto Não Cadastrado\"))","v":""},{"$f":"IFERROR(VLOOKUP(A397,CADASTRO!C:F,3,0),\"\")","v":""},{"$f":"VLOOKUP(A397,CADASTRO!C:F,4,0)","v":{"$error":"#N/A"}}]
[null,{"$f":"IF(A398=\"\",\"\",IFERROR(VLOOKUP(A398,CADASTRO!C:D,2,FALSE),\"Produto Não Cadastrado\"))","v":""},{"$f":"IFERROR(VLOOKUP(A398,CADASTRO!C:F,3,0),\"\")","v":""},{"$f":"VLOOKUP(A398,CADASTRO!C:F,4,0)","v":{"$error":"#N/A"}}]
[null,{"$f":"IF(A399=\"\",\"\",IFERROR(VLOOKUP(A399,CADASTRO!C:D,2,FALSE),\"Produto Não Cadastrado\"))","v":""},{"$f":"IFERROR(VLOOKUP(A399,CADASTRO!C:F,3,0),\"\")","v":""},{"$f":"VLOOKUP(A399,CADASTRO!C:F,4,0)","v":{"$error":"#N/A"}}]
[null,{"$f":"IF(A400=\"\",\"\",IFERROR(VLOOKUP(A400,CADASTRO!C:D,2,FALSE),\"Produto Não Cadastrado\"))","v":""},{"$f":"IFERROR(VLOOKUP(A400,CADASTRO!C:F,3,0),\"\")","v":""},{"$f":"VLOOKUP(A400,CADASTRO!C:F,4,0)","v":{"$error":"#N/A"}}]
[null,{"$f":"IF(A401=\"\",\"\",IFERROR(VLOOKUP(A401,CADASTRO!C:D,2,FALSE),\"Produto Não Cadastrado\"))","v":""},{"$f":"IFERROR(VLOOKUP(A401,CADASTRO!C:F,3,0),\"\")","v":""},{"$f":"VLOOKUP(A401,CADASTRO!C:F,4,0)","v":{"$error":"#N/A"}}]
[null,{"$f":"IF(A402=\"\",\"\",IFERROR(VLOOKUP(A402,CADASTRO!C:D,2,FALSE),\"Produto Não Cadastrado\"))","v":""},{"$f":"IFERROR(VLOOKUP(A402,CADASTRO!C:F,3,0),\"\")","v":""},{"$f":"VLOOKUP(A402,CADASTRO!C:F,4,0)","v":{"$error":"#N/A"}}]
[null,{"$f":"IF(A403=\"\",\"\",IFERROR(VLOOKUP(A403,CADASTRO!C:D,2,FALSE),\"Produto Não Cadastrado\"))","v":""},{"$f":"IFERROR(VLOOKUP(A403,CADASTRO!C:F,3,0),\"\")","v":""},{"$f":"VLOOKUP(A403,CADASTRO!C:F,4,0)","v":{"$error":"#N/A"}}]
[null,{"$f":"IF(A404=\"\",\"\",IFERROR(VLOOKUP(A404,CADASTRO!C:D,2,FALSE),\"Produto Não Cadastrado\"))","v":""},{"$f":"IFERROR(VLOOKUP(A404,CADASTRO!C:F,3,0),\"\")","v":""},{"$f":"VLOOKUP(A404,CADASTRO!C:F,4,0)","v":{"$error":"#N/A"}}]
[null,{"$f":"IF(A405=\"\",\"\",IFERROR(VLOOKUP(A405,CADASTRO!C:D,2,FALSE),\"Produto Não Cadastrado\"))","v":""},{"$f":"IFERROR(VLOOKUP(A405,CADASTRO!C:F,3,0),\"\")","v":""},{"$f":"VLOOKUP(A405,CADASTRO!C:F,4,0)","v":{"$error":"#N/A"}}]
[null,{"$f":"IF(A406=\"\",\"\",IFERROR(VLOOKUP(A406,CADASTRO!C:D,2,FALSE),\"Produto Não Cadastrado\"))","v":""},{"$f":"IFERROR(VLOOKUP(A406,CADASTRO!C:F,3,0),\"\")","v":""},{"$f":"VLOOKUP(A406,CADASTRO!C:F,4,0)","v":{"$error":"#N/A"}}]
[null,{"$f":"IF(A407=\"\",\"\",IFERROR(VLOOKUP(A407,CADASTRO!C:D,2,FALSE),\"Produto Não Cadastrado\"))","v":""},{"$f":"IFERROR(VLOOKUP(A407,CADASTRO!C:F,3,0),\"\")","v":""},{"$f":"VLOOKUP(A407,CADASTRO!C:F,4,0)","v":{"$error":"#N/A"}}]
[null,{"$f":"IF(A408=\"\",\"\",IFERROR(VLOOKUP(A408,CADASTRO!C:D,2,FALSE),\"Produto Não Cadastrado\"))","v":""},{"$f":"IFERROR(VLOOKUP(A408,CADASTRO!C:F,3,0),\"\")","v":""},{"$f":"VLOOKUP(A408,CADASTRO!C:F,4,0)","v":{"$error":"#N/A"}}]
[null,{"$f":"IF(A409=\"\",\"\",IFERROR(VLOOKUP(A409,CADASTRO!C:D,2,FALSE),\"Produto Não Cadastrado\"))","v":""},{"$f":"IFERROR(VLOOKUP(A409,CADASTRO!C:F,3,0),\"\")","v":""},{"$f":"VLOOKUP(A409,CADASTRO!C:F,4,0)","v":{"$error":"#N/A"}}]

{"sheet":"SAÍDAS","index":4,"n_rows":535,"n_cols":6,"rows_kept":535,"cut":false,"hidden":false,"merged":[[0,1,0,5]]}
[null,"               Saída de Estoque - Congelados"]
["CÓD","Descriçao","Medida","SETOR","Qtde","Data"]
[28,{"$f":"IF(A3=\"\",\"\",IFERROR(VLOOKUP(A3,CADASTRO!C:D,2,FALSE),\"Produto Não Cadastrado\"))","v":"CATARINA DE BACALHAU "},{"$f":"VLOOKUP(A3,CADASTRO!C:F,3,0)","v":0},{"$f":"VLOOKUP(A3,CADASTRO!C:F,4,0)","v":"FOLHATERIA"},3,"2023-02-14"]
[29,{"$f":"IF(A4=\"\",\"\",IFERROR(VLOOKUP(A4,CADASTRO!C:D,2,FALSE),\"Produto Não Cadastrado\"))","v":"CATARINA DE FRANGO"},{"$f":"VLOOKUP(A4,CADASTRO!C:F,3,0)","v":0},{"$f":"VLOOKUP(A4,CADASTRO!C:F,4,0)","v":"FOLHATERIA"},3,"2023-02-14"]
[79,{"$f":"IF(A5=\"\",\"\",IFERROR(VLOOKUP(A5,CADASTRO!C:D,2,FALSE),\"Produto Não Cadastrado\"))","v":"MINI FOLHADO CALABRESA"},{"$f":"VLOOKUP(A5,CADASTRO!C:F,3,0)","v":0},{"$f":"VLOOKUP(A5,CADASTRO!C:F,4,0)","v":"FOLHATERIA"},7.39,"2023-02-14"]
[108,{"$f":"IF(A6=\"\",\"\",IFERROR(VLOOKUP(A6,CADASTRO!C:D,2,FALSE),\"Produto Não Cadastrado\"))","v":"ORELINHA TRADICIONAL"},{"$f":"VLOOKUP(A6,CADASTRO!C:F,3,0)","v":0},{"$f":"VLOOKUP(A6,CADASTRO!C:F,4,0)","v":"FOLHATERIA"},3.38,"2023-02-14"]
[111,{"$f":"IF(A7=\"\",\"\",IFERROR(VLOOKUP(A7,CADASTRO!C:D,2,FALSE),\"Produto Não Cadastrado\"))","v":"PALITO QUEIJO"},{"$f":"VLOOKUP(A7,CADASTRO!C:F,3,0)","v":0},{"$f":"VLOOKUP(A7,CADASTRO!C:F,4,0)","v":"FOLHATERIA"},3.55,"2023-02-14"]
[263,{"$f":"IF(A8=\"\",\"\",IFERROR(VLOOKUP(A8,CADASTRO!C:D,2,FALSE),\"Produto Não Cadastrado\"))","v":"TRANÇA FOLHADA BACALHAU"},{"$f":"IFERROR(VLOOKUP(A8,CADASTRO!C:F,3,0),\"\")","v":0},{"$f":"VLOOKUP(A8,CADASTRO!C:F,4,0)","v":"FOLHATERIA"},2,"2023-02-14"]
[264,{"$f":"IF(A9=\"\",\"\",IFERROR(VLOOKUP(A9,CADASTRO!C:D,2,FALSE),\"Produto Não Cadastrado\"))","v":"TRANÇA FOLHADA CALABRESA"},{"$f":"IFERROR(VLOOKUP(A9,CADASTRO!C:F,3,0),\"\")","v":0},{"$f":"VLOOKUP(A9,CADASTRO!C:F,4,0)","v":"FOLHATERIA"},2,"2023-02-14"]
[268,{"$f":"IF(A10=\"\",\"\",IFERROR(VLOOKUP(A10,CADASTRO!C:D,2,FALSE),\"Produto Não Cadastrado\"))","v":"TRANÇA FOLHADA MORTADELA DEFUMADA"},{"$f":"IFERROR(VLOOKUP(A10,CADASTRO!C:F,3,0),\"\")","v":0},{"$f":"VLOOKUP(A10,CADASTRO!C:F,4,0)","v":"FOLHATERIA"},1,"2023-02-14"]
[271,{"$f":"IF(A11=\"\",\"\",IFERROR(VLOOKUP(A11,CADASTRO!C:D,2,FALSE),\"Produto Não Cadastrado\"))","v":"TRANÇA FOLHADA PERU/JAMBU"},{"$f":"IFERROR(VLOOKUP(A11,CADASTRO!C:F,3,0),\"\")","v":0},{"$f":"VLOOKUP(A11,CADASTRO!C:F,4,0)","v":"FOLHATERIA"},1,"2023-02-14"]
[272,{"$f":"IF(A12=\"\",\"\",IFERROR(VLOOKUP(A12,CADASTRO!C:D,2,FALSE),\"Produto Não Cadastrado\"))","v":"TRANÇA FOLHADA SALAME"},{"$f":"IFERROR(VLOOKUP(A12,CADASTRO!C:F,3,0),\"\")","v":0},{"$f":"VLOOKUP(A12,CADASTRO!C:F,4,0)","v":"FOLHATERIA"},1,"2023-02-14"]
[8,{"$f":"IF(A13=\"\",\"\",IFERROR(VLOOKUP(A13,CADASTRO!C:D,2,FALSE),\"Produto Não Cadastrado\"))","v":"BAGUETE INTEGRAL (PCT C/ 45 UND = 3 KG)"},{"$f":"IFERROR(VLOOKUP(A13,CADASTRO!C:F,3,0),\"\")","v":0},{"$f":"VLOOKUP(A13,CADASTRO!C:F,4,0)","v":"PADARIA TRADICIONAL"},1,"2023-02-14"]
[13,{"$f":"IF(A14=\"\",\"\",IFERROR(VLOOKUP(A14,CADASTRO!C:D,2,FALSE),\"Produto Não Cadastrado\"))","v":"BISCOITO CATUPIRI"},{"$f":"IFERROR(VLOOKUP(A14,CADASTRO!C:F,3,0),\"\")","v":0},{"$f":"VLOOKUP(A14,CADASTRO!C:F,4,0)","v":"PADARIA TRADICIONAL"},1,"2023-02-14"]
[14,{"$f":"IF(A15=\"\",\"\",IFERROR(VLOOKUP(A15,CADASTRO!C:D,2,FALSE),\"Produto Não Cadastrado\"))","v":"BISCOITO COCO"},{"$f":"IFERROR(VLOOKUP(A15,CADASTRO!C:F,3,0),\"\")","v":0},{"$f":"VLOOKUP(A15,CADASTRO!C:F,4,0)","v":"PADARIA TRADICIONAL"},1,"2023-02-14"]
[16,{"$f":"IF(A16=\"\",\"\",IFERROR(VLOOKUP(A16,CADASTRO!C:D,2,FALSE),\"Produto Não Cadastrado\"))","v":"BISCOITO MAISENA"},{"$f":"IFERROR(VLOOKUP(A16,CADASTRO!C:F,3,0),\"\")","v":0},{"$f":"VLOOKUP(A16,CADASTRO!C:F,4,0)","v":"PADARIA TRADICIONAL"},1,"2023-02-14"]
[17,{"$f":"IF(A17=\"\",\"\",IFERROR(VLOOKUP(A17,CADASTRO!C:D,2,FALSE),\"Produto Não Cadastrado\"))","v":"BISCOITO MONTEIRO LOPES"},{"$f":"IFERROR(VLOOKUP(A17,CADASTRO!C:F,3,0),\"\")","v":0},{"$f":"VLOOKUP(A17,CADASTRO!C:F,4,0)","v":"PADARIA TRADICIONAL"},5,"2023-02-14"]
[18,{"$f":"IF(A18=\"\",\"\",IFERROR(VLOOKUP(A18,CADASTRO!C:D,2,FALSE),\"Produto Não Cadastrado\"))","v":"BISCOITO OLHO DE BOI"},{"$f":"IFERROR(VLOOKUP(A18,CADASTRO!C:F,3,0),\"\")","v":0},{"$f":"VLOOKUP(A18,CADASTRO!C:F,4,0)","v":"PADARIA TRADICIONAL"},1,"2023-02-14"]
[39,{"$f":"IF(A19=\"\",\"\",IFERROR(VLOOKUP(A19,CADASTRO!C:D,2,FALSE),\"Produto Não Cadastrado\"))","v":"CROISSANT AMÊNDOAS"},{"$f":"IFERROR(VLOOKUP(A19,CADASTRO!C:F,3,0),\"\")","v":0},{"$f":"VLOOKUP(A19,CADASTRO!C:F,4,0)","v":"PADARIA TRADICIONAL"},20,"2023-02-14"]
[41,{"$f":"IF(A20=\"\",\"\",IFERROR(VLOOKUP(A20,CADASTRO!C:D,2,FALSE),\"Produto Não Cadastrado\"))","v":"CROISSANT CONGELADO "},{"$f":"IFERROR(VLOOKUP(A20,CADASTRO!C:F,3,0),\"\")","v":0},{"$f":"VLOOKUP(A20,CADASTRO!C:F,4,0)","v":"PADARIA TRADICIONAL"},350,"2023-02-14"]
[49,{"$f":"IF(A21=\"\",\"\",IFERROR(VLOOKUP(A21,CADASTRO!C:D,2,FALSE),\"Produto Não Cadastrado\"))","v":"DONNUTS"},{"$f":"IFERROR(VLOOKUP(A21,CADASTRO!C:F,3,0),\"\")","v":0},{"$f":"VLOOKUP(A21,CADASTRO!C:F,4,0)","v":"PADARIA TRADICIONAL"},20,"2023-02-14"]
[50,{"$f":"IF(A22=\"\",\"\",IFERROR(VLOOKUP(A22,CADASTRO!C:D,2,FALSE),\"Produto Não Cadastrado\"))","v":"EMPADA BACALHAU"},{"$f":"IFERROR(VLOOKUP(A22,CADASTRO!C:F,3,0),\"\")","v":0},{"$f":"VLOOKUP(A22,CADASTRO!C:F,4,0)","v":"PADARIA TRADICIONAL"},5,"2023-02-14"]
[89,{"$f":"IF(A23=\"\",\"\",IFERROR(VLOOKUP(A23,CADASTRO!C:D,2,FALSE),\"Produto Não Cadastrado\"))","v":"MINI PÃO BATATA HAMBÚRGUER"},{"$f":"IFERROR(VLOOKUP(A23,CADASTRO!C:F,3,0),\"\")","v":0},{"$f":"VLOOKUP(A23,CADASTRO!C:F,4,0)","v":"PADARIA TRADICIONAL"},108,"2023-02-14"]
[92,{"$f":"IF(A24=\"\",\"\",IFERROR(VLOOKUP(A24,CADASTRO!C:D,2,FALSE),\"Produto Não Cadastrado\"))","v":"MINI PÃO DELÍCIA  (PCT C/ 24UND)"},{"$f":"IFERROR(VLOOKUP(A24,CADASTRO!C:F,3,0),\"\")","v":0},{"$f":"VLOOKUP(A24,CADASTRO!C:F,4,0)","v":"PADARIA TRADICIONAL"},2,"2023-02-14"]
[121,{"$f":"IF(A25=\"\",\"\",IFERROR(VLOOKUP(A25,CADASTRO!C:D,2,FALSE),\"Produto Não Cadastrado\"))","v":"PÃO BAIÃO"},{"$f":"IFERROR(VLOOKUP(A25,CADASTRO!C:F,3,0),\"\")","v":0},{"$f":"VLOOKUP(A25,CADASTRO!C:F,4,0)","v":"PADARIA TRADICIONAL"},20,"2023-02-14"]
[122,{"$f":"IF(A26=\"\",\"\",IFERROR(VLOOKUP(A26,CADASTRO!C:D,2,FALSE),\"Produto Não Cadastrado\"))","v":"PÃO BENGALA 10 HORAS"},{"$f":"IFERROR(VLOOKUP(A26,CADASTRO!C:F,3,0),\"\")","v":0},{"$f":"VLOOKUP(A26,CADASTRO!C:F,4,0)","v":"PADARIA TRADICIONAL"},5,"2023-02-14"]
[124,{"$f":"IF(A27=\"\",\"\",IFERROR(VLOOKUP(A27,CADASTRO!C:D,2,FALSE),\"Produto Não Cadastrado\"))","v":"PÃO BRIOCHE HAMBÚRGUER"},{"$f":"IFERROR(VLOOKUP(A27,CADASTRO!C:F,3,0),\"\")","v":0},{"$f":"VLOOKUP(A27,CADASTRO!C:F,4,0)","v":"PADARIA TRADICIONAL"},15,"2023-02-14"]
[132,{"$f":"IF(A28=\"\",\"\",IFERROR(VLOOKUP(A28,CADASTRO!C:D,2,FALSE),\"Produto Não Cadastrado\"))","v":"PÃO CUCA GOIABADA"},{"$f":"IFERROR(VLOOKUP(A28,CADASTRO!C:F,3,0),\"\")","v":0},{"$f":"VLOOKUP(A28,CADASTRO!C:F,4,0)","v":"PADARIA TRADICIONAL"},6,"2023-02-14"]
[135,{"$f":"IF(A29=\"\",\"\",IFERROR(VLOOKUP(A29,CADASTRO!C:D,2,FALSE),\"Produto Não Cadastrado\"))","v":"PÃO DE BATATA FILÃO"},{"$f":"IFERROR(VLOOKUP(A29,CADASTRO!C:F,3,0),\"\")","v":0},{"$f":"VLOOKUP(A29,CADASTRO!C:F,4,0)","v":"PADARIA TRADICIONAL"},48,"2023-02-14"]
[146,{"$f":"IF(A30=\"\",\"\",IFERROR(VLOOKUP(A30,CADASTRO!C:D,2,FALSE),\"Produto Não Cadastrado\"))","v":"PÃO DOCE LIEVITO"},{"$f":"IFERROR(VLOOKUP(A30,CADASTRO!C:F,3,0),\"\")","v":0},{"$f":"VLOOKUP(A30,CADASTRO!C:F,4,0)","v":"PADARIA TRADICIONAL"},6,"2023-02-14"]
[153,{"$f":"IF(A31=\"\",\"\",IFERROR(VLOOKUP(A31,CADASTRO!C:D,2,FALSE),\"Produto Não Cadastrado\"))","v":"PÃO FORMA BATATA A25"},{"$f":"IFERROR(VLOOKUP(A31,CADASTRO!C:F,3,0),\"\")","v":0},{"$f":"VLOOKUP(A31,CADASTRO!C:F,4,0)","v":"PADARIA TRADICIONAL"},6,"2023-02-14"]
[154,{"$f":"IF(A32=\"\",\"\",IFERROR(VLOOKUP(A32,CADASTRO!C:D,2,FALSE),\"Produto Não Cadastrado\"))","v":"PÃO FORMA BRIOCHE A25"},{"$f":"IFERROR(VLOOKUP(A32,CADASTRO!C:F,3,0),\"\")","v":0},{"$f":"VLOOKUP(A32,CADASTRO!C:F,4,0)","v":"PADARIA TRADICIONAL"},6,"2023-02-14"]
[155,{"$f":"IF(A33=\"\",\"\",IFERROR(VLOOKUP(A33,CADASTRO!C:D,2,FALSE),\"Produto Não Cadastrado\"))","v":"PÃO FORMA INTEGRAL 1000"},{"$f":"IFERROR(VLOOKUP(A33,CADASTRO!C:F,3,0),\"\")","v":0},{"$f":"VLOOKUP(A33,CADASTRO!C:F,4,0)","v":"PADARIA TRADICIONAL"},8,"2023-02-14"]
[156,{"$f":"IF(A34=\"\",\"\",IFERROR(VLOOKUP(A34,CADASTRO!C:D,2,FALSE),\"Produto Não Cadastrado\"))","v":"PÃO FORMA INTEGRAL 700"},{"$f":"IFERROR(VLOOKUP(A34,CADASTRO!C:F,3,0),\"\")","v":0},{"$f":"VLOOKUP(A34,CADASTRO!C:F,4,0)","v":"PADARIA TRADICIONAL"},5,"2023-02-14"]
[157,{"$f":"IF(A35=\"\",\"\",IFERROR(VLOOKUP(A35,CADASTRO!C:D,2,FALSE),\"Produto Não Cadastrado\"))","v":"PÃO FORMA LEITE A25"},{"$f":"IFERROR(VLOOKUP(A35,CADASTRO!C:F,3,0),\"\")","v":0},{"$f":"VLOOKUP(A35,CADASTRO!C:F,4,0)","v":"PADARIA TRADICIONAL"},6,"2023-02-14"]
[159,{"$f":"IF(A36=\"\",\"\",IFERROR(VLOOKUP(A36,CADASTRO!C:D,2,FALSE),\"Produto Não Cadastrado\"))","v":"PÃO FORMA TRADICIONAL 1000"},{"$f":"IFERROR(VLOOKUP(A36,CADASTRO!C:F,3,0),\"\")","v":0},{"$f":"VLOOKUP(A36,CADASTRO!C:F,4,0)","v":"PADARIA TRADICIONAL"},3,"2023-02-14"]
[160,{"$f":"IF(A37=\"\",\"\",IFERROR(VLOOKUP(A37,CADASTRO!C:D,2,FALSE),\"Produto Não Cadastrado\"))","v":"PÃO FORMA TRADICIONAL 700"},{"$f":"IFERROR(VLOOKUP(A37,CADASTRO!C:F,3,0),\"\")","v":0},{"$f":"VLOOKUP(A37,CADASTRO!C:F,4,0)","v":"PADARIA TRADICIONAL"},5,"2023-02-14"]
[161,{"$f":"IF(A38=\"\",\"\",IFERROR(VLOOKUP(A38,CADASTRO!C:D,2,FALSE),\"Produto Não Cadastrado\"))","v":"PÃO FRANCÊS 10H"},{"$f":"IFERROR(VLOOKUP(A38,CADASTRO!C:F,3,0),\"\")","v":0},{"$f":"VLOOKUP(A38,CADASTRO!C:F,4,0)","v":"PADARIA TRADICIONAL"},20,"2023-02-14"]
[163,{"$f":"IF(A39=\"\",\"\",IFERROR(VLOOKUP(A39,CADASTRO!C:D,2,FALSE),\"Produto Não Cadastrado\"))","v":"PÃO FRANCÊS 5H"},{"$f":"IFERROR(VLOOKUP(A39,CADASTRO!C:F,3,0),\"\")","v":0},{"$f":"VLOOKUP(A39,CADASTRO!C:F,4,0)","v":"PADARIA TRADICIONAL"},30,"2023-02-14"]
[169,{"$f":"IF(A40=\"\",\"\",IFERROR(VLOOKUP(A40,CADASTRO!C:D,2,FALSE),\"Produto Não Cadastrado\"))","v":"PÃO SEMI ITALIANO"},{"$f":"IFERROR(VLOOKUP(A40,CADASTRO!C:F,3,0),\"\")","v":0},{"$f":"VLOOKUP(A40,CADASTRO!C:F,4,0)","v":"PADARIA TRADICIONAL"},15,"2023-02-14"]
[170,{"$f":"IF(A41=\"\",\"\",IFERROR(VLOOKUP(A41,CADASTRO!C:D,2,FALSE),\"Produto Não Cadastrado\"))","v":"PÃO VIENNOIS"},{"$f":"IFERROR(VLOOKUP(A41,CADASTRO!C:F,3,0),\"\")","v":0},{"$f":"VLOOKUP(A41,CADASTRO!C:F,4,0)","v":"PADARIA TRADICIONAL"},15,"2023-02-14"]
[244,{"$f":"IF(A42=\"\",\"\",IFERROR(VLOOKUP(A42,CADASTRO!C:D,2,FALSE),\"Produto Não Cadastrado\"))","v":"ROSQUINHA DE LEITE (PCT C/ 32UND)"},{"$f":"IFERROR(VLOOKUP(A42,CADASTRO!C:F,3,0),\"\")","v":0},{"$f":"VLOOKUP(A42,CADASTRO!C:F,4,0)","v":"PADARIA TRADICIONAL"},2,"2023-02-14"]
[247,{"$f":"IF(A43=\"\",\"\",IFERROR(VLOOKUP(A43,CADASTRO!C:D,2,FALSE),\"Produto Não Cadastrado\"))","v":"SONHO"},{"$f":"IFERROR(VLOOKUP(A43,CADASTRO!C:F,3,0),\"\")","v":0},{"$f":"VLOOKUP(A43,CADASTRO!C:F,4,0)","v":"PADARIA TRADICIONAL"},2,"2023-02-14"]
[273,{"$f":"IF(A44=\"\",\"\",IFERROR(VLOOKUP(A44,CADASTRO!C:D,2,FALSE),\"Produto Não Cadastrado\"))","v":"PÃO BENGALA 5 HORAS"},{"$f":"IFERROR(VLOOKUP(A44,CADASTRO!C:F,3,0),\"\")","v":0},{"$f":"VLOOKUP(A44,CADASTRO!C:F,4,0)","v":"PADARIA TRADICIONAL"},5,"2023-02-14"]
[223,{"$f":"IF(A45=\"\",\"\",IFERROR(VLOOKUP(A45,CADASTRO!C:D,2,FALSE),\"Produto Não Cadastrado\"))","v":"QUICHE ALHO PORO"},{"$f":"IFERROR(VLOOKUP(A45,CADASTRO!C:F,3,0),\"\")","v":0},{"$f":"VLOOKUP(A45,CADASTRO!C:F,4,0)","v":"QUITUTERIA"},5,"2023-02-14"]
[228,{"$f":"IF(A46=\"\",\"\",IFERROR(VLOOKUP(A46,CADASTRO!C:D,2,FALSE),\"Produto Não Cadastrado\"))","v":"QUICHE MARGUERITA"},{"$f":"IFERROR(VLOOKUP(A46,CADASTRO!C:F,3,0),\"\")","v":0},{"$f":"VLOOKUP(A46,CADASTRO!C:F,4,0)","v":"QUITUTERIA"},5,"2023-02-14"]
[26,{"$f":"IF(A47=\"\",\"\",IFERROR(VLOOKUP(A47,CADASTRO!C:D,2,FALSE),\"Produto Não Cadastrado\"))","v":"CARRET"},{"$f":"IFERROR(VLOOKUP(A47,CADASTRO!C:F,3,0),\"\")","v":0},{"$f":"VLOOKUP(A47,CADASTRO!C:F,4,0)","v":"FOLHATERIA"},15,"2023-02-15"]
[28,{"$f":"IF(A48=\"\",\"\",IFERROR(VLOOKUP(A48,CADASTRO!C:D,2,FALSE),\"Produto Não Cadastrado\"))","v":"CATARINA DE BACALHAU "},{"$f":"IFERROR(VLOOKUP(A48,CADASTRO!C:F,3,0),\"\")","v":0},{"$f":"VLOOKUP(A48,CADASTRO!C:F,4,0)","v":"FOLHATERIA"},3,"2023-02-15"]
[29,{"$f":"IF(A49=\"\",\"\",IFERROR(VLOOKUP(A49,CADASTRO!C:D,2,FALSE),\"Produto Não Cadastrado\"))","v":"CATARINA DE FRANGO"},{"$f":"IFERROR(VLOOKUP(A49,CADASTRO!C:F,3,0),\"\")","v":0},{"$f":"VLOOKUP(A49,CADASTRO!C:F,4,0)","v":"FOLHATERIA"},3,"2023-02-15"]
[44,{"$f":"IF(A50=\"\",\"\",IFERROR(VLOOKUP(A50,CADASTRO!C:D,2,FALSE),\"Produto Não Cadastrado\"))","v":"DANISH CAPRESE"},{"$f":"IFERROR(VLOOKUP(A50,CADASTRO!C:F,3,0),\"\")","v":0},{"$f":"VLOOKUP(A50,CADASTRO!C:F,4,0)","v":"FOLHATERIA"},11,"2023-02-15"]
[66,{"$f":"IF(A51=\"\",\"\",IFERROR(VLOOKUP(A51,CADASTRO!C:D,2,FALSE),\"Produto Não Cadastrado\"))","v":"LASANHA FOLHADA MISTA"},{"$f":"IFERROR(VLOOKUP(A51,CADASTRO!C:F,3,0),\"\")","v":0},{"$f":"VLOOKUP(A51,CADASTRO!C:F,4,0)","v":"FOLHATERIA"},1,"2023-02-15"]
[81,{"$f":"IF(A52=\"\",\"\",IFERROR(VLOOKUP(A52,CADASTRO!C:D,2,FALSE),\"Produto Não Cadastrado\"))","v":"MINI FOLHADO DE QUEIJO"},{"$f":"IFERROR(VLOOKUP(A52,CADASTRO!C:F,3,0),\"\")","v":0},{"$f":"VLOOKUP(A52,CADASTRO!C:F,4,0)","v":"FOLHATERIA"},3.85,"2023-02-15"]
[84,{"$f":"IF(A53=\"\",\"\",IFERROR(VLOOKUP(A53,CADASTRO!C:D,2,FALSE),\"Produto Não Cadastrado\"))","v":"MINI FOLHADO MISTO"},{"$f":"IFERROR(VLOOKUP(A53,CADASTRO!C:F,3,0),\"\")","v":0},{"$f":"VLOOKUP(A53,CADASTRO!C:F,4,0)","v":"FOLHATERIA"},7.58,"2023-02-15"]
[93,{"$f":"IF(A54=\"\",\"\",IFERROR(VLOOKUP(A54,CADASTRO!C:D,2,FALSE),\"Produto Não Cadastrado\"))","v":"MINI PASTEL FOLHADO"},{"$f":"IFERROR(VLOOKUP(A54,CADASTRO!C:F,3,0),\"\")","v":0},{"$f":"VLOOKUP(A54,CADASTRO!C:F,4,0)","v":"FOLHATERIA"},3.22,"2023-02-15"]
[94,{"$f":"IF(A55=\"\",\"\",IFERROR(VLOOKUP(A55,CADASTRO!C:D,2,FALSE),\"Produto Não Cadastrado\"))","v":"MINI TRANÇA BACALHAU"},{"$f":"IFERROR(VLOOKUP(A55,CADASTRO!C:F,3,0),\"\")","v":0},{"$f":"VLOOKUP(A55,CADASTRO!C:F,4,0)","v":"FOLHATERIA"},2,"2023-02-15"]
[97,{"$f":"IF(A56=\"\",\"\",IFERROR(VLOOKUP(A56,CADASTRO!C:D,2,FALSE),\"Produto Não Cadastrado\"))","v":"MINI TRANÇA FRANGO"},{"$f":"IFERROR(VLOOKUP(A56,CADASTRO!C:F,3,0),\"\")","v":0},{"$f":"VLOOKUP(A56,CADASTRO!C:F,4,0)","v":"FOLHATERIA"},2,"2023-02-15"]
[104,{"$f":"IF(A57=\"\",\"\",IFERROR(VLOOKUP(A57,CADASTRO!C:D,2,FALSE),\"Produto Não Cadastrado\"))","v":"MINI TRANÇA SALAME"},{"$f":"IFERROR(VLOOKUP(A57,CADASTRO!C:F,3,0),\"\")","v":0},{"$f":"VLOOKUP(A57,CADASTRO!C:F,4,0)","v":"FOLHATERIA"},2,"2023-02-15"]
[173,{"$f":"IF(A58=\"\",\"\",IFERROR(VLOOKUP(A58,CADASTRO!C:D,2,FALSE),\"Produto Não Cadastrado\"))","v":"PASTEL FOLHADO BACALHAU "},{"$f":"IFERROR(VLOOKUP(A58,CADASTRO!C:F,3,0),\"\")","v":0},{"$f":"VLOOKUP(A58,CADASTRO!C:F,4,0)","v":"FOLHATERIA"},15,"2023-02-15"]
[174,{"$f":"IF(A59=\"\",\"\",IFERROR(VLOOKUP(A59,CADASTRO!C:D,2,FALSE),\"Produto Não Cadastrado\"))","v":"PASTEL FOLHADO FRANGO "},{"$f":"IFERROR(VLOOKUP(A59,CADASTRO!C:F,3,0),\"\")","v":0},{"$f":"VLOOKUP(A59,CADASTRO!C:F,4,0)","v":"FOLHATERIA"},15,"2023-02-15"]
[263,{"$f":"IF(A60=\"\",\"\",IFERROR(VLOOKUP(A60,CADASTRO!C:D,2,FALSE),\"Produto Não Cadastrado\"))","v":"TRANÇA FOLHADA BACALHAU"},{"$f":"IFERROR(VLOOKUP(A60,CADASTRO!C:F,3,0),\"\")","v":0},{"$f":"VLOOKUP(A60,CADASTRO!C:F,4,0)","v":"FOLHATERIA"},3,"2023-02-15"]
[264,{"$f":"IF(A61=\"\",\"\",IFERROR(VLOOKUP(A61,CADASTRO!C:D,2,FALSE),\"Produto Não Cadastrado\"))","v":"TRANÇA FOLHADA CALABRESA"},{"$f":"IFERROR(VLOOKUP(A61,CADASTRO!C:F,3,0),\"\")","v":0},{"$f":"VLOOKUP(A61,CADASTRO!C:F,4,0)","v":"FOLHATERIA"},2,"2023-02-15"]
[266,{"$f":"IF(A62=\"\",\"\",IFERROR(VLOOKUP(A62,CADASTRO!C:D,2,FALSE),\"Produto Não Cadastrado\"))","v":"TRANÇA FOLHADA FRANGO/JAMBU"},{"$f":"IFERROR(VLOOKUP(A62,CADASTRO!C:F,3,0),\"\")","v":0},{"$f":"VLOOKUP(A62,CADASTRO!C:F,4,0)","v":"FOLHATERIA"},2,"2023-02-15"]
[268,{"$f":"IF(A63=\"\",\"\",IFERROR(VLOOKUP(A63,CADASTRO!C:D,2,FALSE),\"Produto Não Cadastrado\"))","v":"TRANÇA FOLHADA MORTADELA DEFUMADA"},{"$f":"IFERROR(VLOOKUP(A63,CADASTRO!C:F,3,0),\"\")","v":0},{"$f":"VLOOKUP(A63,CADASTRO!C:F,4,0)","v":"FOLHATERIA"},2,"2023-02-15"]
[271,{"$f":"IF(A64=\"\",\"\",IFERROR(VLOOKUP(A64,CADASTRO!C:D,2,FALSE),\"Produto Não Cadastrado\"))","v":"TRANÇA FOLHADA PERU/JAMBU"},{"$f":"IFERROR(VLOOKUP(A64,CADASTRO!C:F,3,0),\"\")","v":0},{"$f":"VLOOKUP(A64,CADASTRO!C:F,4,0)","v":"FOLHATERIA"},2,"2023-02-15"]
[272,{"$f":"IF(A65=\"\",\"\",IFERROR(VLOOKUP(A65,CADASTRO!C:D,2,FALSE),\"Produto Não Cadastrado\"))","v":"TRANÇA FOLHADA SALAME"},{"$f":"IFERROR(VLOOKUP(A65,CADASTRO!C:F,3,0),\"\")","v":0},{"$f":"VLOOKUP(A65,CADASTRO!C:F,4,0)","v":"FOLHATERIA"},2,"2023-02-15"]
[14,{"$f":"IF(A66=\"\",\"\",IFERROR(VLOOKUP(A66,CADASTRO!C:D,2,FALSE),\"Produto Não Cadastrado\"))","v":"BISCOITO COCO"},{"$f":"IFERROR(VLOOKUP(A66,CADASTRO!C:F,3,0),\"\")","v":0},{"$f":"VLOOKUP(A66,CADASTRO!C:F,4,0)","v":"PADARIA TRADICIONAL"},2,"2023-02-15"]
[17,{"$f":"IF(A67=\"\",\"\",IFERROR(VLOOKUP(A67,CADASTRO!C:D,2,FALSE),\"Produto Não Cadastrado\"))","v":"BISCOITO MONTEIRO LOPES"},{"$f":"IFERROR(VLOOKUP(A67,CADASTRO!C:F,3,0),\"\")","v":0},{"$f":"VLOOKUP(A67,CADASTRO!C:F,4,0)","v":"PADARIA TRADICIONAL"},3,"2023-02-15"]
[41,{"$f":"IF(A68=\"\",\"\",IFERROR(VLOOKUP(A68,CADASTRO!C:D,2,FALSE),\"Produto Não Cadastrado\"))","v":"CROISSANT CONGELADO "},{"$f":"IFERROR(VLOOKUP(A68,CADASTRO!C:F,3,0),\"\")","v":0},{"$f":"VLOOKUP(A68,CADASTRO!C:F,4,0)","v":"PADARIA TRADICIONAL"},360,"2023-02-15"]
[49,{"$f":"IF(A69=\"\",\"\",IFERROR(VLOOKUP(A69,CADASTRO!C:D,2,FALSE),\"Produto Não Cadastrado\"))","v":"DONNUTS"},{"$f":"IFERROR(VLOOKUP(A69,CADASTRO!C:F,3,0),\"\")","v":0},{"$f":"VLOOKUP(A69,CADASTRO!C:F,4,0)","v":"PADARIA TRADICIONAL"},18,"2023-02-15"]
[50,{"$f":"IF(A70=\"\",\"\",IFERROR(VLOOKUP(A70,CADASTRO!C:D,2,FALSE),\"Produto Não Cadastrado\"))","v":"EMPADA BACALHAU"},{"$f":"IFERROR(VLOOKUP(A70,CADASTRO!C:F,3,0),\"\")","v":0},{"$f":"VLOOKUP(A70,CADASTRO!C:F,4,0)","v":"PADARIA TRADICIONAL"},5,"2023-02-15"]
[51,{"$f":"IF(A71=\"\",\"\",IFERROR(VLOOKUP(A71,CADASTRO!C:D,2,FALSE),\"Produto Não Cadastrado\"))","v":"EMPADA FRANGO"},{"$f":"IFERROR(VLOOKUP(A71,CADASTRO!C:F,3,0),\"\")","v":0},{"$f":"VLOOKUP(A71,CADASTRO!C:F,4,0)","v":"PADARIA TRADICIONAL"},6,"2023-02-15"]
[71,{"$f":"IF(A72=\"\",\"\",IFERROR(VLOOKUP(A72,CADASTRO!C:D,2,FALSE),\"Produto Não Cadastrado\"))","v":"MASSA MINI PIZZA"},{"$f":"IFERROR(VLOOKUP(A72,CADASTRO!C:F,3,0),\"\")","v":0},{"$f":"VLOOKUP(A72,CADASTRO!C:F,4,0)","v":"PADARIA TRADICIONAL"},1,"2023-02-15"]
[89,{"$f":"IF(A73=\"\",\"\",IFERROR(VLOOKUP(A73,CADASTRO!C:D,2,FALSE),\"Produto Não Cadastrado\"))","v":"MINI PÃO BATATA HAMBÚRGUER"},{"$f":"IFERROR(VLOOKUP(A73,CADASTRO!C:F,3,0),\"\")","v":0},{"$f":"VLOOKUP(A73,CADASTRO!C:F,4,0)","v":"PADARIA TRADICIONAL"},108,"2023-02-15"]
[91,{"$f":"IF(A74=\"\",\"\",IFERROR(VLOOKUP(A74,CADASTRO!C:D,2,FALSE),\"Produto Não Cadastrado\"))","v":"MINI PÃO BRIOCHE (PCT C/ 24UND)"},{"$f":"IFERROR(VLOOKUP(A74,CADASTRO!C:F,3,0),\"\")","v":0},{"$f":"VLOOKUP(A74,CADASTRO!C:F,4,0)","v":"PADARIA TRADICIONAL"},2,"2023-02-15"]
[92,{"$f":"IF(A75=\"\",\"\",IFERROR(VLOOKUP(A75,CADASTRO!C:D,2,FALSE),\"Produto Não Cadastrado\"))","v":"MINI PÃO DELÍCIA  (PCT C/ 24UND)"},{"$f":"IFERROR(VLOOKUP(A75,CADASTRO!C:F,3,0),\"\")","v":0},{"$f":"VLOOKUP(A75,CADASTRO!C:F,4,0)","v":"PADARIA TRADICIONAL"},3,"2023-02-15"]
[116,{"$f":"IF(A76=\"\",\"\",IFERROR(VLOOKUP(A76,CADASTRO!C:D,2,FALSE),\"Produto Não Cadastrado\"))","v":"PÃO BAGUETE 10 HORAS"},{"$f":"IFERROR(VLOOKUP(A76,CADASTRO!C:F,3,0),\"\")","v":0},{"$f":"VLOOKUP(A76,CADASTRO!C:F,4,0)","v":"PADARIA TRADICIONAL"},5,"2023-02-15"]
[121,{"$f":"IF(A77=\"\",\"\",IFERROR(VLOOKUP(A77,CADASTRO!C:D,2,FALSE),\"Produto Não Cadastrado\"))","v":"PÃO BAIÃO"},{"$f":"IFERROR(VLOOKUP(A77,CADASTRO!C:F,3,0),\"\")","v":0},{"$f":"VLOOKUP(A77,CADASTRO!C:F,4,0)","v":"PADARIA TRADICIONAL"},18,"2023-02-15"]
[122,{"$f":"IF(A78=\"\",\"\",IFERROR(VLOOKUP(A78,CADASTRO!C:D,2,FALSE),\"Produto Não Cadastrado\"))","v":"PÃO BENGALA 10 HORAS"},{"$f":"IFERROR(VLOOKUP(A78,CADASTRO!C:F,3,0),\"\")","v":0},{"$f":"VLOOKUP(A78,CADASTRO!C:F,4,0)","v":"PADARIA TRADICIONAL"},5,"2023-02-15"]
[123,{"$f":"IF(A79=\"\",\"\",IFERROR(VLOOKUP(A79,CADASTRO!C:D,2,FALSE),\"Produto Não Cadastrado\"))","v":"PÃO BRIOCHE DE FORMA  1000"},{"$f":"IFERROR(VLOOKUP(A79,CADASTRO!C:F,3,0),\"\")","v":0},{"$f":"VLOOKUP(A79,CADASTRO!C:F,4,0)","v":"PADARIA TRADICIONAL"},5,"2023-02-15"]
[135,{"$f":"IF(A80=\"\",\"\",IFERROR(VLOOKUP(A80,CADASTRO!C:D,2,FALSE),\"Produto Não Cadastrado\"))","v":"PÃO DE BATATA FILÃO"},{"$f":"IFERROR(VLOOKUP(A80,CADASTRO!C:F,3,0),\"\")","v":0},{"$f":"VLOOKUP(A80,CADASTRO!C:F,4,0)","v":"PADARIA TRADICIONAL"},48,"2023-02-15"]
[154,{"$f":"IF(A81=\"\",\"\",IFERROR(VLOOKUP(A81,CADASTRO!C:D,2,FALSE),\"Produto Não Cadastrado\"))","v":"PÃO FORMA BRIOCHE A25"},{"$f":"IFERROR(VLOOKUP(A81,CADASTRO!C:F,3,0),\"\")","v":0},{"$f":"VLOOKUP(A81,CADASTRO!C:F,4,0)","v":"PADARIA TRADICIONAL"},15,"2023-02-15"]
[155,{"$f":"IF(A82=\"\",\"\",IFERROR(VLOOKUP(A82,CADASTRO!C:D,2,FALSE),\"Produto Não Cadastrado\"))","v":"PÃO FORMA INTEGRAL 1000"},{"$f":"IFERROR(VLOOKUP(A82,CADASTRO!C:F,3,0),\"\")","v":0},{"$f":"VLOOKUP(A82,CADASTRO!C:F,4,0)","v":"PADARIA TRADICIONAL"},8,"2023-02-15"]
[156,{"$f":"IF(A83=\"\",\"\",IFERROR(VLOOKUP(A83,CADASTRO!C:D,2,FALSE),\"Produto Não Cadastrado\"))","v":"PÃO FORMA INTEGRAL 700"},{"$f":"IFERROR(VLOOKUP(A83,CADASTRO!C:F,3,0),\"\")","v":0},{"$f":"VLOOKUP(A83,CADASTRO!C:F,4,0)","v":"PADARIA TRADICIONAL"},5,"2023-02-15"]
[159,{"$f":"IF(A84=\"\",\"\",IFERROR(VLOOKUP(A84,CADASTRO!C:D,2,FALSE),\"Produto Não Cadastrado\"))","v":"PÃO FORMA TRADICIONAL 1000"},{"$f":"IFERROR(VLOOKUP(A84,CADASTRO!C:F,3,0),\"\")","v":0},{"$f":"VLOOKUP(A84,CADASTRO!C:F,4,0)","v":"PADARIA TRADICIONAL"},8,"2023-02-15"]
[160,{"$f":"IF(A85=\"\",\"\",IFERROR(VLOOKUP(A85,CADASTRO!C:D,2,FALSE),\"Produto Não Cadastrado\"))","v":"PÃO FORMA TRADICIONAL 700"},{"$f":"IFERROR(VLOOKUP(A85,CADASTRO!C:F,3,0),\"\")","v":0},{"$f":"VLOOKUP(A85,CADASTRO!C:F,4,0)","v":"PADARIA TRADICIONAL"},5,"2023-02-15"]
[161,{"$f":"IF(A86=\"\",\"\",IFERROR(VLOOKUP(A86,CADASTRO!C:D,2,FALSE),\"Produto Não Cadastrado\"))","v":"PÃO FRANCÊS 10H"},{"$f":"IFERROR(VLOOKUP(A86,CADASTRO!C:F,3,0),\"\")","v":0},{"$f":"VLOOKUP(A86,CADASTRO!C:F,4,0)","v":"PADARIA TRADICIONAL"},35,"2023-02-15"]
[163,{"$f":"IF(A87=\"\",\"\",IFERROR(VLOOKUP(A87,CADASTRO!C:D,2,FALSE),\"Produto Não Cadastrado\"))","v":"PÃO FRANCÊS 5H"},{"$f":"IFERROR(VLOOKUP(A87,CADASTRO!C:F,3,0),\"\")","v":0},{"$f":"VLOOKUP(A87,CADASTRO!C:F,4,0)","v":"PADARIA TRADICIONAL"},30,"2023-02-15"]
[169,{"$f":"IF(A88=\"\",\"\",IFERROR(VLOOKUP(A88,CADASTRO!C:D,2,FALSE),\"Produto Não Cadastrado\"))","v":"PÃO SEMI ITALIANO"},{"$f":"IFERROR(VLOOKUP(A88,CADASTRO!C:F,3,0),\"\")","v":0},{"$f":"VLOOKUP(A88,CADASTRO!C:F,4,0)","v":"PADARIA TRADICIONAL"},15,"2023-02-15"]
[170,{"$f":"IF(A89=\"\",\"\",IFERROR(VLOOKUP(A89,CADASTRO!C:D,2,FALSE),\"Produto Não Cadastrado\"))","v":"PÃO VIENNOIS"},{"$f":"IFERROR(VLOOKUP(A89,CADASTRO!C:F,3,0),\"\")","v":0},{"$f":"VLOOKUP(A89,CADASTRO!C:F,4,0)","v":"PADARIA TRADICIONAL"},15,"2023-02-15"]
[181,{"$f":"IF(A90=\"\",\"\",IFERROR(VLOOKUP(A90,CADASTRO!C:D,2,FALSE),\"Produto Não Cadastrado\"))","v":"PIZZA INTEGRAL (MASSA)"},{"$f":"IFERROR(VLOOKUP(A90,CADASTRO!C:F,3,0),\"\")","v":0},{"$f":"VLOOKUP(A90,CADASTRO!C:F,4,0)","v":"PADARIA TRADICIONAL"},2,"2023-02-15"]
[244,{"$f":"IF(A91=\"\",\"\",IFERROR(VLOOKUP(A91,CADASTRO!C:D,2,FALSE),\"Produto Não Cadastrado\"))","v":"ROSQUINHA DE LEITE (PCT C/ 32UND)"},{"$f":"IFERROR(VLOOKUP(A91,CADASTRO!C:F,3,0),\"\")","v":0},{"$f":"VLOOKUP(A91,CADASTRO!C:F,4,0)","v":"PADARIA TRADICIONAL"},1,"2023-02-15"]
[247,{"$f":"IF(A92=\"\",\"\",IFERROR(VLOOKUP(A92,CADASTRO!C:D,2,FALSE),\"Produto Não Cadastrado\"))","v":"SONHO"},{"$f":"IFERROR(VLOOKUP(A92,CADASTRO!C:F,3,0),\"\")","v":0},{"$f":"VLOOKUP(A92,CADASTRO!C:F,4,0)","v":"PADARIA TRADICIONAL"},4,"2023-02-15"]
[273,{"$f":"IF(A93=\"\",\"\",IFERROR(VLOOKUP(A93,CADASTRO!C:D,2,FALSE),\"Produto Não Cadastrado\"))","v":"PÃO BENGALA 5 HORAS"},{"$f":"IFERROR(VLOOKUP(A93,CADASTRO!C:F,3,0),\"\")","v":0},{"$f":"VLOOKUP(A93,CADASTRO!C:F,4,0)","v":"PADARIA TRADICIONAL"},5,"2023-02-15"]
[60,{"$f":"IF(A94=\"\",\"\",IFERROR(VLOOKUP(A94,CADASTRO!C:D,2,FALSE),\"Produto Não Cadastrado\"))","v":"FOCACCIA RUSTICA  CALABRESA (MASSA)"},{"$f":"IFERROR(VLOOKUP(A94,CADASTRO!C:F,3,0),\"\")","v":0},{"$f":"VLOOKUP(A94,CADASTRO!C:F,4,0)","v":"PADARIA RÚSTICA"},2,"2023-02-15"]
[126,{"$f":"IF(A95=\"\",\"\",IFERROR(VLOOKUP(A95,CADASTRO!C:D,2,FALSE),\"Produto Não Cadastrado\"))","v":"PÃO CAMPONÊS"},{"$f":"IFERROR(VLOOKUP(A95,CADASTRO!C:F,3,0),\"\")","v":0},{"$f":"VLOOKUP(A95,CADASTRO!C:F,4,0)","v":"PADARIA RÚSTICA"},20,"2023-02-15"]
[223,{"$f":"IF(A96=\"\",\"\",IFERROR(VLOOKUP(A96,CADASTRO!C:D,2,FALSE),\"Produto Não Cadastrado\"))","v":"QUICHE ALHO PORO"},{"$f":"IFERROR(VLOOKUP(A96,CADASTRO!C:F,3,0),\"\")","v":0},{"$f":"VLOOKUP(A96,CADASTRO!C:F,4,0)","v":"QUITUTERIA"},5,"2023-02-15"]
[224,{"$f":"IF(A97=\"\",\"\",IFERROR(VLOOKUP(A97,CADASTRO!C:D,2,FALSE),\"Produto Não Cadastrado\"))","v":"QUICHE BACALHAU"},{"$f":"IFERROR(VLOOKUP(A97,CADASTRO!C:F,3,0),\"\")","v":0},{"$f":"VLOOKUP(A97,CADASTRO!C:F,4,0)","v":"QUITUTERIA"},11,"2023-02-15"]
[225,{"$f":"IF(A98=\"\",\"\",IFERROR(VLOOKUP(A98,CADASTRO!C:D,2,FALSE),\"Produto Não Cadastrado\"))","v":"QUICHE FRANGO"},{"$f":"IFERROR(VLOOKUP(A98,CADASTRO!C:F,3,0),\"\")","v":0},{"$f":"VLOOKUP(A98,CADASTRO!C:F,4,0)","v":"QUITUTERIA"},6,"2023-02-15"]
[228,{"$f":"IF(A99=\"\",\"\",IFERROR(VLOOKUP(A99,CADASTRO!C:D,2,FALSE),\"Produto Não Cadastrado\"))","v":"QUICHE MARGUERITA"},{"$f":"IFERROR(VLOOKUP(A99,CADASTRO!C:F,3,0),\"\")","v":0},{"$f":"VLOOKUP(A99,CADASTRO!C:F,4,0)","v":"QUITUTERIA"},5,"2023-02-15"]
[229,{"$f":"IF(A100=\"\",\"\",IFERROR(VLOOKUP(A100,CADASTRO!C:D,2,FALSE),\"Produto Não Cadastrado\"))","v":"QUICHE QUEIJO CUIA"},{"$f":"IFERROR(VLOOKUP(A100,CADASTRO!C:F,3,0),\"\")","v":0},{"$f":"VLOOKUP(A100,CADASTRO!C:F,4,0)","v":"QUITUTERIA"},5,"2023-02-15"]
[230,{"$f":"IF(A101=\"\",\"\",IFERROR(VLOOKUP(A101,CADASTRO!C:D,2,FALSE),\"Produto Não Cadastrado\"))","v":"QUICHE QUEIJO CUIA/JAMBU"},{"$f":"IFERROR(VLOOKUP(A101,CADASTRO!C:F,3,0),\"\")","v":0},{"$f":"VLOOKUP(A101,CADASTRO!C:F,4,0)","v":"QUITUTERIA"},5,"2023-02-15"]
[231,{"$f":"IF(A102=\"\",\"\",IFERROR(VLOOKUP(A102,CADASTRO!C:D,2,FALSE),\"Produto Não Cadastrado\"))","v":"QUICHE TOMATE SECO"},{"$f":"IFERROR(VLOOKUP(A102,CADASTRO!C:F,3,0),\"\")","v":0},{"$f":"VLOOKUP(A102,CADASTRO!C:F,4,0)","v":"QUITUTERIA"},5,"2023-02-15"]
[61,{"$f":"IF(A103=\"\",\"\",IFERROR(VLOOKUP(A103,CADASTRO!C:D,2,FALSE),\"Produto Não Cadastrado\"))","v":"FOCACCIA TABULEIRO"},{"$f":"IFERROR(VLOOKUP(A103,CADASTRO!C:F,3,0),\"\")","v":0},{"$f":"VLOOKUP(A103,CADASTRO!C:F,4,0)","v":"PADARIA RÚSTICA"},2,"2023-02-15"]
[88,{"$f":"IF(A104=\"\",\"\",IFERROR(VLOOKUP(A104,CADASTRO!C:D,2,FALSE),\"Produto Não Cadastrado\"))","v":"MINI PÃO BATATA (ERVAS,PARMESÃO)"},{"$f":"IFERROR(VLOOKUP(A104,CADASTRO!C:F,3,0),\"\")","v":0},{"$f":"VLOOKUP(A104,CADASTRO!C:F,4,0)","v":"PADARIA TRADICIONAL"},288,"2023-02-15"]
[26,{"$f":"IF(A105=\"\",\"\",IFERROR(VLOOKUP(A105,CADASTRO!C:D,2,FALSE),\"Produto Não Cadastrado\"))","v":"CARRET"},{"$f":"IFERROR(VLOOKUP(A105,CADASTRO!C:F,3,0),\"\")","v":0},{"$f":"VLOOKUP(A105,CADASTRO!C:F,4,0)","v":"FOLHATERIA"},23,"2023-02-16"]
[28,{"$f":"IF(A106=\"\",\"\",IFERROR(VLOOKUP(A106,CADASTRO!C:D,2,FALSE),\"Produto Não Cadastrado\"))","v":"CATARINA DE BACALHAU "},{"$f":"IFERROR(VLOOKUP(A106,CADASTRO!C:F,3,0),\"\")","v":0},{"$f":"VLOOKUP(A106,CADASTRO!C:F,4,0)","v":"FOLHATERIA"},2,"2023-02-16"]
[29,{"$f":"IF(A107=\"\",\"\",IFERROR(VLOOKUP(A107,CADASTRO!C:D,2,FALSE),\"Produto Não Cadastrado\"))","v":"CATARINA DE FRANGO"},{"$f":"IFERROR(VLOOKUP(A107,CADASTRO!C:F,3,0),\"\")","v":0},{"$f":"VLOOKUP(A107,CADASTRO!C:F,4,0)","v":"FOLHATERIA"},2,"2023-02-16"]
[66,{"$f":"IF(A108=\"\",\"\",IFERROR(VLOOKUP(A108,CADASTRO!C:D,2,FALSE),\"Produto Não Cadastrado\"))","v":"LASANHA FOLHADA MISTA"},{"$f":"IFERROR(VLOOKUP(A108,CADASTRO!C:F,3,0),\"\")","v":0},{"$f":"VLOOKUP(A108,CADASTRO!C:F,4,0)","v":"FOLHATERIA"},1,"2023-02-16"]
[78,{"$f":"IF(A109=\"\",\"\",IFERROR(VLOOKUP(A109,CADASTRO!C:D,2,FALSE),\"Produto Não Cadastrado\"))","v":"MINI FOLHADO BACALHAU"},{"$f":"IFERROR(VLOOKUP(A109,CADASTRO!C:F,3,0),\"\")","v":0},{"$f":"VLOOKUP(A109,CADASTRO!C:F,4,0)","v":"FOLHATERIA"},3.83,"2023-02-16"]
[80,{"$f":"IF(A110=\"\",\"\",IFERROR(VLOOKUP(A110,CADASTRO!C:D,2,FALSE),\"Produto Não Cadastrado\"))","v":"MINI FOLHADO CUPUAÇU"},{"$f":"IFERROR(VLOOKUP(A110,CADASTRO!C:F,3,0),\"\")","v":0},{"$f":"VLOOKUP(A110,CADASTRO!C:F,4,0)","v":"FOLHATERIA"},3.84,"2023-02-16"]
[81,{"$f":"IF(A111=\"\",\"\",IFERROR(VLOOKUP(A111,CADASTRO!C:D,2,FALSE),\"Produto Não Cadastrado\"))","v":"MINI FOLHADO DE QUEIJO"},{"$f":"IFERROR(VLOOKUP(A111,CADASTRO!C:F,3,0),\"\")","v":0},{"$f":"VLOOKUP(A111,CADASTRO!C:F,4,0)","v":"FOLHATERIA"},3.8,"2023-02-16"]
[82,{"$f":"IF(A112=\"\",\"\",IFERROR(VLOOKUP(A112,CADASTRO!C:D,2,FALSE),\"Produto Não Cadastrado\"))","v":"MINI FOLHADO FRANGO"},{"$f":"IFERROR(VLOOKUP(A112,CADASTRO!C:F,3,0),\"\")","v":0},{"$f":"VLOOKUP(A112,CADASTRO!C:F,4,0)","v":"FOLHATERIA"},7.43,"2023-02-16"]
[94,{"$f":"IF(A113=\"\",\"\",IFERROR(VLOOKUP(A113,CADASTRO!C:D,2,FALSE),\"Produto Não Cadastrado\"))","v":"MINI TRANÇA BACALHAU"},{"$f":"IFERROR(VLOOKUP(A113,CADASTRO!C:F,3,0),\"\")","v":0},{"$f":"VLOOKUP(A113,CADASTRO!C:F,4,0)","v":"FOLHATERIA"},2,"2023-02-16"]
[95,{"$f":"IF(A114=\"\",\"\",IFERROR(VLOOKUP(A114,CADASTRO!C:D,2,FALSE),\"Produto Não Cadastrado\"))","v":"MINI TRANÇA CALABRESA"},{"$f":"IFERROR(VLOOKUP(A114,CADASTRO!C:F,3,0),\"\")","v":0},{"$f":"VLOOKUP(A114,CADASTRO!C:F,4,0)","v":"FOLHATERIA"},2,"2023-02-16"]
[97,{"$f":"IF(A115=\"\",\"\",IFERROR(VLOOKUP(A115,CADASTRO!C:D,2,FALSE),\"Produto Não Cadastrado\"))","v":"MINI TRANÇA FRANGO"},{"$f":"IFERROR(VLOOKUP(A115,CADASTRO!C:F,3,0),\"\")","v":0},{"$f":"VLOOKUP(A115,CADASTRO!C:F,4,0)","v":"FOLHATERIA"},2,"2023-02-16"]
[98,{"$f":"IF(A116=\"\",\"\",IFERROR(VLOOKUP(A116,CADASTRO!C:D,2,FALSE),\"Produto Não Cadastrado\"))","v":"MINI TRANÇA MISTA"},{"$f":"IFERROR(VLOOKUP(A116,CADASTRO!C:F,3,0),\"\")","v":0},{"$f":"VLOOKUP(A116,CADASTRO!C:F,4,0)","v":"FOLHATERIA"},2,"2023-02-16"]
[104,{"$f":"IF(A117=\"\",\"\",IFERROR(VLOOKUP(A117,CADASTRO!C:D,2,FALSE),\"Produto Não Cadastrado\"))","v":"MINI TRANÇA SALAME"},{"$f":"IFERROR(VLOOKUP(A117,CADASTRO!C:F,3,0),\"\")","v":0},{"$f":"VLOOKUP(A117,CADASTRO!C:F,4,0)","v":"FOLHATERIA"},2,"2023-02-16"]
[172,{"$f":"IF(A118=\"\",\"\",IFERROR(VLOOKUP(A118,CADASTRO!C:D,2,FALSE),\"Produto Não Cadastrado\"))","v":"PASTEL DE BELÉM (MASSA)"},{"$f":"IFERROR(VLOOKUP(A118,CADASTRO!C:F,3,0),\"\")","v":0},{"$f":"VLOOKUP(A118,CADASTRO!C:F,4,0)","v":"FOLHATERIA"},2,"2023-02-16"]
[173,{"$f":"IF(A119=\"\",\"\",IFERROR(VLOOKUP(A119,CADASTRO!C:D,2,FALSE),\"Produto Não Cadastrado\"))","v":"PASTEL FOLHADO BACALHAU "},{"$f":"IFERROR(VLOOKUP(A119,CADASTRO!C:F,3,0),\"\")","v":0},{"$f":"VLOOKUP(A119,CADASTRO!C:F,4,0)","v":"FOLHATERIA"},12,"2023-02-16"]
[175,{"$f":"IF(A120=\"\",\"\",IFERROR(VLOOKUP(A120,CADASTRO!C:D,2,FALSE),\"Produto Não Cadastrado\"))","v":"PASTEL FOLHADO MISTO "},{"$f":"IFERROR(VLOOKUP(A120,CADASTRO!C:F,3,0),\"\")","v":0},{"$f":"VLOOKUP(A120,CADASTRO!C:F,4,0)","v":"FOLHATERIA"},30,"2023-02-16"]
[176,{"$f":"IF(A121=\"\",\"\",IFERROR(VLOOKUP(A121,CADASTRO!C:D,2,FALSE),\"Produto Não Cadastrado\"))","v":"PASTEL FOLHADO QUEIJO "},{"$f":"IFERROR(VLOOKUP(A121,CADASTRO!C:F,3,0),\"\")","v":0},{"$f":"VLOOKUP(A121,CADASTRO!C:F,4,0)","v":"FOLHATERIA"},30,"2023-02-16"]
[180,{"$f":"IF(A122=\"\",\"\",IFERROR(VLOOKUP(A122,CADASTRO!C:D,2,FALSE),\"Produto Não Cadastrado\"))","v":"PIZZA FOLHADA MIX FRIOS "},{"$f":"IFERROR(VLOOKUP(A122,CADASTRO!C:F,3,0),\"\")","v":0},{"$f":"VLOOKUP(A122,CADASTRO!C:F,4,0)","v":"FOLHATERIA"},5,"2023-02-16"]
[263,{"$f":"IF(A123=\"\",\"\",IFERROR(VLOOKUP(A123,CADASTRO!C:D,2,FALSE),\"Produto Não Cadastrado\"))","v":"TRANÇA FOLHADA BACALHAU"},{"$f":"IFERROR(VLOOKUP(A123,CADASTRO!C:F,3,0),\"\")","v":0},{"$f":"VLOOKUP(A123,CADASTRO!C:F,4,0)","v":"FOLHATERIA"},3,"2023-02-16"]
[264,{"$f":"IF(A124=\"\",\"\",IFERROR(VLOOKUP(A124,CADASTRO!C:D,2,FALSE),\"Produto Não Cadastrado\"))","v":"TRANÇA FOLHADA CALABRESA"},{"$f":"IFERROR(VLOOKUP(A124,CADASTRO!C:F,3,0),\"\")","v":0},{"$f":"VLOOKUP(A124,CADASTRO!C:F,4,0)","v":"FOLHATERIA"},3,"2023-02-16"]
[266,{"$f":"IF(A125=\"\",\"\",IFERROR(VLOOKUP(A125,CADASTRO!C:D,2,FALSE),\"Produto Não Cadastrado\"))","v":"TRANÇA FOLHADA FRANGO/JAMBU"},{"$f":"IFERROR(VLOOKUP(A125,CADASTRO!C:F,3,0),\"\")","v":0},{"$f":"VLOOKUP(A125,CADASTRO!C:F,4,0)","v":"FOLHATERIA"},1,"2023-02-16"]
[267,{"$f":"IF(A126=\"\",\"\",IFERROR(VLOOKUP(A126,CADASTRO!C:D,2,FALSE),\"Produto Não Cadastrado\"))","v":"TRANÇA FOLHADA MISTA"},{"$f":"IFERROR(VLOOKUP(A126,CADASTRO!C:F,3,0),\"\")","v":0},{"$f":"VLOOKUP(A126,CADASTRO!C:F,4,0)","v":"FOLHATERIA"},4,"2023-02-16"]
[268,{"$f":"IF(A127=\"\",\"\",IFERROR(VLOOKUP(A127,CADASTRO!C:D,2,FALSE),\"Produto Não Cadastrado\"))","v":"TRANÇA FOLHADA MORTADELA DEFUMADA"},{"$f":"IFERROR(VLOOKUP(A127,CADASTRO!C:F,3,0),\"\")","v":0},{"$f":"VLOOKUP(A127,CADASTRO!C:F,4,0)","v":"FOLHATERIA"},2,"2023-02-16"]
[271,{"$f":"IF(A128=\"\",\"\",IFERROR(VLOOKUP(A128,CADASTRO!C:D,2,FALSE),\"Produto Não Cadastrado\"))","v":"TRANÇA FOLHADA PERU/JAMBU"},{"$f":"IFERROR(VLOOKUP(A128,CADASTRO!C:F,3,0),\"\")","v":0},{"$f":"VLOOKUP(A128,CADASTRO!C:F,4,0)","v":"FOLHATERIA"},2,"2023-02-16"]
[272,{"$f":"IF(A129=\"\",\"\",IFERROR(VLOOKUP(A129,CADASTRO!C:D,2,FALSE),\"Produto Não Cadastrado\"))","v":"TRANÇA FOLHADA SALAME"},{"$f":"IFERROR(VLOOKUP(A129,CADASTRO!C:F,3,0),\"\")","v":0},{"$f":"VLOOKUP(A129,CADASTRO!C:F,4,0)","v":"FOLHATERIA"},3,"2023-02-16"]
[8,{"$f":"IF(A130=\"\",\"\",IFERROR(VLOOKUP(A130,CADASTRO!C:D,2,FALSE),\"Produto Não Cadastrado\"))","v":"BAGUETE INTEGRAL (PCT C/ 45 UND = 3 KG)"},{"$f":"IFERROR(VLOOKUP(A130,CADASTRO!C:F,3,0),\"\")","v":0},{"$f":"VLOOKUP(A130,CADASTRO!C:F,4,0)","v":"PADARIA TRADICIONAL"},2,"2023-02-16"]
[17,{"$f":"IF(A131=\"\",\"\",IFERROR(VLOOKUP(A131,CADASTRO!C:D,2,FALSE),\"Produto Não Cadastrado\"))","v":"BISCOITO MONTEIRO LOPES"},{"$f":"IFERROR(VLOOKUP(A131,CADASTRO!C:F,3,0),\"\")","v":0},{"$f":"VLOOKUP(A131,CADASTRO!C:F,4,0)","v":"PADARIA TRADICIONAL"},5,"2023-02-16"]
[39,{"$f":"IF(A132=\"\",\"\",IFERROR(VLOOKUP(A132,CADASTRO!C:D,2,FALSE),\"Produto Não Cadastrado\"))","v":"CROISSANT AMÊNDOAS"},{"$f":"IFERROR(VLOOKUP(A132,CADASTRO!C:F,3,0),\"\")","v":0},{"$f":"VLOOKUP(A132,CADASTRO!C:F,4,0)","v":"PADARIA TRADICIONAL"},24,"2023-02-16"]
[41,{"$f":"IF(A133=\"\",\"\",IFERROR(VLOOKUP(A133,CADASTRO!C:D,2,FALSE),\"Produto Não Cadastrado\"))","v":"CROISSANT CONGELADO "},{"$f":"IFERROR(VLOOKUP(A133,CADASTRO!C:F,3,0),\"\")","v":0},{"$f":"VLOOKUP(A133,CADASTRO!C:F,4,0)","v":"PADARIA TRADICIONAL"},400,"2023-02-16"]
[49,{"$f":"IF(A134=\"\",\"\",IFERROR(VLOOKUP(A134,CADASTRO!C:D,2,FALSE),\"Produto Não Cadastrado\"))","v":"DONNUTS"},{"$f":"IFERROR(VLOOKUP(A134,CADASTRO!C:F,3,0),\"\")","v":0},{"$f":"VLOOKUP(A134,CADASTRO!C:F,4,0)","v":"PADARIA TRADICIONAL"},6,"2023-02-16"]
[50,{"$f":"IF(A135=\"\",\"\",IFERROR(VLOOKUP(A135,CADASTRO!C:D,2,FALSE),\"Produto Não Cadastrado\"))","v":"EMPADA BACALHAU"},{"$f":"IFERROR(VLOOKUP(A135,CADASTRO!C:F,3,0),\"\")","v":0},{"$f":"VLOOKUP(A135,CADASTRO!C:F,4,0)","v":"PADARIA TRADICIONAL"},6,"2023-02-16"]
[51,{"$f":"IF(A136=\"\",\"\",IFERROR(VLOOKUP(A136,CADASTRO!C:D,2,FALSE),\"Produto Não Cadastrado\"))","v":"EMPADA FRANGO"},{"$f":"IFERROR(VLOOKUP(A136,CADASTRO!C:F,3,0),\"\")","v":0},{"$f":"VLOOKUP(A136,CADASTRO!C:F,4,0)","v":"PADARIA TRADICIONAL"},6,"2023-02-16"]
[52,{"$f":"IF(A137=\"\",\"\",IFERROR(VLOOKUP(A137,CADASTRO!C:D,2,FALSE),\"Produto Não Cadastrado\"))","v":"EMPADA FRANGO/PALMITO"},{"$f":"IFERROR(VLOOKUP(A137,CADASTRO!C:F,3,0),\"\")","v":0},{"$f":"VLOOKUP(A137,CADASTRO!C:F,4,0)","v":"PADARIA TRADICIONAL"},6,"2023-02-16"]
[71,{"$f":"IF(A138=\"\",\"\",IFERROR(VLOOKUP(A138,CADASTRO!C:D,2,FALSE),\"Produto Não Cadastrado\"))","v":"MASSA MINI PIZZA"},{"$f":"IFERROR(VLOOKUP(A138,CADASTRO!C:F,3,0),\"\")","v":0},{"$f":"VLOOKUP(A138,CADASTRO!C:F,4,0)","v":"PADARIA TRADICIONAL"},1,"2023-02-16"]
[88,{"$f":"IF(A139=\"\",\"\",IFERROR(VLOOKUP(A139,CADASTRO!C:D,2,FALSE),\"Produto Não Cadastrado\"))","v":"MINI PÃO BATATA (ERVAS,PARMESÃO)"},{"$f":"IFERROR(VLOOKUP(A139,CADASTRO!C:F,3,0),\"\")","v":0},{"$f":"VLOOKUP(A139,CADASTRO!C:F,4,0)","v":"PADARIA TRADICIONAL"},288,"2023-02-16"]
[89,{"$f":"IF(A140=\"\",\"\",IFERROR(VLOOKUP(A140,CADASTRO!C:D,2,FALSE),\"Produto Não Cadastrado\"))","v":"MINI PÃO BATATA HAMBÚRGUER"},{"$f":"IFERROR(VLOOKUP(A140,CADASTRO!C:F,3,0),\"\")","v":0},{"$f":"VLOOKUP(A140,CADASTRO!C:F,4,0)","v":"PADARIA TRADICIONAL"},54,"2023-02-16"]
[91,{"$f":"IF(A141=\"\",\"\",IFERROR(VLOOKUP(A141,CADASTRO!C:D,2,FALSE),\"Produto Não Cadastrado\"))","v":"MINI PÃO BRIOCHE (PCT C/ 24UND)"},{"$f":"IFERROR(VLOOKUP(A141,CADASTRO!C:F,3,0),\"\")","v":0},{"$f":"VLOOKUP(A141,CADASTRO!C:F,4,0)","v":"PADARIA TRADICIONAL"},1,"2023-02-16"]
[92,{"$f":"IF(A142=\"\",\"\",IFERROR(VLOOKUP(A142,CADASTRO!C:D,2,FALSE),\"Produto Não Cadastrado\"))","v":"MINI PÃO DELÍCIA  (PCT C/ 24UND)"},{"$f":"IFERROR(VLOOKUP(A142,CADASTRO!C:F,3,0),\"\")","v":0},{"$f":"VLOOKUP(A142,CADASTRO!C:F,4,0)","v":"PADARIA TRADICIONAL"},3,"2023-02-16"]
[121,{"$f":"IF(A143=\"\",\"\",IFERROR(VLOOKUP(A143,CADASTRO!C:D,2,FALSE),\"Produto Não Cadastrado\"))","v":"PÃO BAIÃO"},{"$f":"IFERROR(VLOOKUP(A143,CADASTRO!C:F,3,0),\"\")","v":0},{"$f":"VLOOKUP(A143,CADASTRO!C:F,4,0)","v":"PADARIA TRADICIONAL"},21,"2023-02-16"]
[122,{"$f":"IF(A144=\"\",\"\",IFERROR(VLOOKUP(A144,CADASTRO!C:D,2,FALSE),\"Produto Não Cadastrado\"))","v":"PÃO BENGALA 10 HORAS"},{"$f":"IFERROR(VLOOKUP(A144,CADASTRO!C:F,3,0),\"\")","v":0},{"$f":"VLOOKUP(A144,CADASTRO!C:F,4,0)","v":"PADARIA TRADICIONAL"},5,"2023-02-16"]
[123,{"$f":"IF(A145=\"\",\"\",IFERROR(VLOOKUP(A145,CADASTRO!C:D,2,FALSE),\"Produto Não Cadastrado\"))","v":"PÃO BRIOCHE DE FORMA  1000"},{"$f":"IFERROR(VLOOKUP(A145,CADASTRO!C:F,3,0),\"\")","v":0},{"$f":"VLOOKUP(A145,CADASTRO!C:F,4,0)","v":"PADARIA TRADICIONAL"},5,"2023-02-16"]
[135,{"$f":"IF(A146=\"\",\"\",IFERROR(VLOOKUP(A146,CADASTRO!C:D,2,FALSE),\"Produto Não Cadastrado\"))","v":"PÃO DE BATATA FILÃO"},{"$f":"IFERROR(VLOOKUP(A146,CADASTRO!C:F,3,0),\"\")","v":0},{"$f":"VLOOKUP(A146,CADASTRO!C:F,4,0)","v":"PADARIA TRADICIONAL"},48,"2023-02-16"]
[153,{"$f":"IF(A147=\"\",\"\",IFERROR(VLOOKUP(A147,CADASTRO!C:D,2,FALSE),\"Produto Não Cadastrado\"))","v":"PÃO FORMA BATATA A25"},{"$f":"IFERROR(VLOOKUP(A147,CADASTRO!C:F,3,0),\"\")","v":0},{"$f":"VLOOKUP(A147,CADASTRO!C:F,4,0)","v":"PADARIA TRADICIONAL"},48,"2023-02-16"]
[154,{"$f":"IF(A148=\"\",\"\",IFERROR(VLOOKUP(A148,CADASTRO!C:D,2,FALSE),\"Produto Não Cadastrado\"))","v":"PÃO FORMA BRIOCHE A25"},{"$f":"IFERROR(VLOOKUP(A148,CADASTRO!C:F,3,0),\"\")","v":0},{"$f":"VLOOKUP(A148,CADASTRO!C:F,4,0)","v":"PADARIA TRADICIONAL"},15,"2023-02-16"]
[155,{"$f":"IF(A149=\"\",\"\",IFERROR(VLOOKUP(A149,CADASTRO!C:D,2,FALSE),\"Produto Não Cadastrado\"))","v":"PÃO FORMA INTEGRAL 1000"},{"$f":"IFERROR(VLOOKUP(A149,CADASTRO!C:F,3,0),\"\")","v":0},{"$f":"VLOOKUP(A149,CADASTRO!C:F,4,0)","v":"PADARIA TRADICIONAL"},15,"2023-02-16"]
[156,{"$f":"IF(A150=\"\",\"\",IFERROR(VLOOKUP(A150,CADASTRO!C:D,2,FALSE),\"Produto Não Cadastrado\"))","v":"PÃO FORMA INTEGRAL 700"},{"$f":"IFERROR(VLOOKUP(A150,CADASTRO!C:F,3,0),\"\")","v":0},{"$f":"VLOOKUP(A150,CADASTRO!C:F,4,0)","v":"PADARIA TRADICIONAL"},8,"2023-02-16"]
[157,{"$f":"IF(A151=\"\",\"\",IFERROR(VLOOKUP(A151,CADASTRO!C:D,2,FALSE),\"Produto Não Cadastrado\"))","v":"PÃO FORMA LEITE A25"},{"$f":"IFERROR(VLOOKUP(A151,CADASTRO!C:F,3,0),\"\")","v":0},{"$f":"VLOOKUP(A151,CADASTRO!C:F,4,0)","v":"PADARIA TRADICIONAL"},5,"2023-02-16"]
[158,{"$f":"IF(A152=\"\",\"\",IFERROR(VLOOKUP(A152,CADASTRO!C:D,2,FALSE),\"Produto Não Cadastrado\"))","v":"PÃO FORMA MILHO A25"},{"$f":"IFERROR(VLOOKUP(A152,CADASTRO!C:F,3,0),\"\")","v":0},{"$f":"VLOOKUP(A152,CADASTRO!C:F,4,0)","v":"PADARIA TRADICIONAL"},15,"2023-02-16"]
[159,{"$f":"IF(A153=\"\",\"\",IFERROR(VLOOKUP(A153,CADASTRO!C:D,2,FALSE),\"Produto Não Cadastrado\"))","v":"PÃO FORMA TRADICIONAL 1000"},{"$f":"IFERROR(VLOOKUP(A153,CADASTRO!C:F,3,0),\"\")","v":0},{"$f":"VLOOKUP(A153,CADASTRO!C:F,4,0)","v":"PADARIA TRADICIONAL"},8,"2023-02-16"]
[160,{"$f":"IF(A154=\"\",\"\",IFERROR(VLOOKUP(A154,CADASTRO!C:D,2,FALSE),\"Produto Não Cadastrado\"))","v":"PÃO FORMA TRADICIONAL 700"},{"$f":"IFERROR(VLOOKUP(A154,CADASTRO!C:F,3,0),\"\")","v":0},{"$f":"VLOOKUP(A154,CADASTRO!C:F,4,0)","v":"PADARIA TRADICIONAL"},5,"2023-02-16"]
[167,{"$f":"IF(A155=\"\",\"\",IFERROR(VLOOKUP(A155,CADASTRO!C:D,2,FALSE),\"Produto Não Cadastrado\"))","v":"PÃO QUEIJO CALABRESA"},{"$f":"IFERROR(VLOOKUP(A155,CADASTRO!C:F,3,0),\"\")","v":0},{"$f":"VLOOKUP(A155,CADASTRO!C:F,4,0)","v":"PADARIA TRADICIONAL"},15,"2023-02-16"]
[170,{"$f":"IF(A156=\"\",\"\",IFERROR(VLOOKUP(A156,CADASTRO!C:D,2,FALSE),\"Produto Não Cadastrado\"))","v":"PÃO VIENNOIS"},{"$f":"IFERROR(VLOOKUP(A156,CADASTRO!C:F,3,0),\"\")","v":0},{"$f":"VLOOKUP(A156,CADASTRO!C:F,4,0)","v":"PADARIA TRADICIONAL"},15,"2023-02-16"]
[244,{"$f":"IF(A157=\"\",\"\",IFERROR(VLOOKUP(A157,CADASTRO!C:D,2,FALSE),\"Produto Não Cadastrado\"))","v":"ROSQUINHA DE LEITE (PCT C/ 32UND)"},{"$f":"IFERROR(VLOOKUP(A157,CADASTRO!C:F,3,0),\"\")","v":0},{"$f":"VLOOKUP(A157,CADASTRO!C:F,4,0)","v":"PADARIA TRADICIONAL"},3,"2023-02-16"]
[247,{"$f":"IF(A158=\"\",\"\",IFERROR(VLOOKUP(A158,CADASTRO!C:D,2,FALSE),\"Produto Não Cadastrado\"))","v":"SONHO"},{"$f":"IFERROR(VLOOKUP(A158,CADASTRO!C:F,3,0),\"\")","v":0},{"$f":"VLOOKUP(A158,CADASTRO!C:F,4,0)","v":"PADARIA TRADICIONAL"},3,"2023-02-16"]
[273,{"$f":"IF(A159=\"\",\"\",IFERROR(VLOOKUP(A159,CADASTRO!C:D,2,FALSE),\"Produto Não Cadastrado\"))","v":"PÃO BENGALA 5 HORAS"},{"$f":"IFERROR(VLOOKUP(A159,CADASTRO!C:F,3,0),\"\")","v":0},{"$f":"VLOOKUP(A159,CADASTRO!C:F,4,0)","v":"PADARIA TRADICIONAL"},5,"2023-02-16"]
[222,{"$f":"IF(A160=\"\",\"\",IFERROR(VLOOKUP(A160,CADASTRO!C:D,2,FALSE),\"Produto Não Cadastrado\"))","v":"QUICHE 4 QUEIJOS"},{"$f":"IFERROR(VLOOKUP(A160,CADASTRO!C:F,3,0),\"\")","v":0},{"$f":"VLOOKUP(A160,CADASTRO!C:F,4,0)","v":"QUITUTERIA"},5,"2023-02-16"]
[223,{"$f":"IF(A161=\"\",\"\",IFERROR(VLOOKUP(A161,CADASTRO!C:D,2,FALSE),\"Produto Não Cadastrado\"))","v":"QUICHE ALHO PORO"},{"$f":"IFERROR(VLOOKUP(A161,CADASTRO!C:F,3,0),\"\")","v":0},{"$f":"VLOOKUP(A161,CADASTRO!C:F,4,0)","v":"QUITUTERIA"},5,"2023-02-16"]
[224,{"$f":"IF(A162=\"\",\"\",IFERROR(VLOOKUP(A162,CADASTRO!C:D,2,FALSE),\"Produto Não Cadastrado\"))","v":"QUICHE BACALHAU"},{"$f":"IFERROR(VLOOKUP(A162,CADASTRO!C:F,3,0),\"\")","v":0},{"$f":"VLOOKUP(A162,CADASTRO!C:F,4,0)","v":"QUITUTERIA"},5,"2023-02-16"]
[225,{"$f":"IF(A163=\"\",\"\",IFERROR(VLOOKUP(A163,CADASTRO!C:D,2,FALSE),\"Produto Não Cadastrado\"))","v":"QUICHE FRANGO"},{"$f":"IFERROR(VLOOKUP(A163,CADASTRO!C:F,3,0),\"\")","v":0},{"$f":"VLOOKUP(A163,CADASTRO!C:F,4,0)","v":"QUITUTERIA"},5,"2023-02-16"]
[227,{"$f":"IF(A164=\"\",\"\",IFERROR(VLOOKUP(A164,CADASTRO!C:D,2,FALSE),\"Produto Não Cadastrado\"))","v":"QUICHE MARAJOARA"},{"$f":"IFERROR(VLOOKUP(A164,CADASTRO!C:F,3,0),\"\")","v":0},{"$f":"VLOOKUP(A164,CADASTRO!C:F,4,0)","v":"QUITUTERIA"},5,"2023-02-16"]
[231,{"$f":"IF(A165=\"\",\"\",IFERROR(VLOOKUP(A165,CADASTRO!C:D,2,FALSE),\"Produto Não Cadastrado\"))","v":"QUICHE TOMATE SECO"},{"$f":"IFERROR(VLOOKUP(A165,CADASTRO!C:F,3,0),\"\")","v":0},{"$f":"VLOOKUP(A165,CADASTRO!C:F,4,0)","v":"QUITUTERIA"},5,"2023-02-16"]
[28,{"$f":"IF(A166=\"\",\"\",IFERROR(VLOOKUP(A166,CADASTRO!C:D,2,FALSE),\"Produto Não Cadastrado\"))","v":"CATARINA DE BACALHAU "},{"$f":"IFERROR(VLOOKUP(A166,CADASTRO!C:F,3,0),\"\")","v":0},{"$f":"VLOOKUP(A166,CADASTRO!C:F,4,0)","v":"FOLHATERIA"},1,"2023-02-16"]
[29,{"$f":"IF(A167=\"\",\"\",IFERROR(VLOOKUP(A167,CADASTRO!C:D,2,FALSE),\"Produto Não Cadastrado\"))","v":"CATARINA DE FRANGO"},{"$f":"IFERROR(VLOOKUP(A167,CADASTRO!C:F,3,0),\"\")","v":0},{"$f":"VLOOKUP(A167,CADASTRO!C:F,4,0)","v":"FOLHATERIA"},1,"2023-02-16"]
[93,{"$f":"IF(A168=\"\",\"\",IFERROR(VLOOKUP(A168,CADASTRO!C:D,2,FALSE),\"Produto Não Cadastrado\"))","v":"MINI PASTEL FOLHADO"},{"$f":"IFERROR(VLOOKUP(A168,CADASTRO!C:F,3,0),\"\")","v":0},{"$f":"VLOOKUP(A168,CADASTRO!C:F,4,0)","v":"FOLHATERIA"},3.39,"2023-02-16"]
[94,{"$f":"IF(A169=\"\",\"\",IFERROR(VLOOKUP(A169,CADASTRO!C:D,2,FALSE),\"Produto Não Cadastrado\"))","v":"MINI TRANÇA BACALHAU"},{"$f":"IFERROR(VLOOKUP(A169,CADASTRO!C:F,3,0),\"\")","v":0},{"$f":"VLOOKUP(A169,CADASTRO!C:F,4,0)","v":"FOLHATERIA"},2,"2023-02-16"]
[110,{"$f":"IF(A170=\"\",\"\",IFERROR(VLOOKUP(A170,CADASTRO!C:D,2,FALSE),\"Produto Não Cadastrado\"))","v":"PALITO CANELA"},{"$f":"IFERROR(VLOOKUP(A170,CADASTRO!C:F,3,0),\"\")","v":0},{"$f":"VLOOKUP(A170,CADASTRO!C:F,4,0)","v":"FOLHATERIA"},3.9,"2023-02-16"]
[111,{"$f":"IF(A171=\"\",\"\",IFERROR(VLOOKUP(A171,CADASTRO!C:D,2,FALSE),\"Produto Não Cadastrado\"))","v":"PALITO QUEIJO"},{"$f":"IFERROR(VLOOKUP(A171,CADASTRO!C:F,3,0),\"\")","v":0},{"$f":"VLOOKUP(A171,CADASTRO!C:F,4,0)","v":"FOLHATERIA"},3.9,"2023-02-16"]
[176,{"$f":"IF(A172=\"\",\"\",IFERROR(VLOOKUP(A172,CADASTRO!C:D,2,FALSE),\"Produto Não Cadastrado\"))","v":"PASTEL FOLHADO QUEIJO "},{"$f":"IFERROR(VLOOKUP(A172,CADASTRO!C:F,3,0),\"\")","v":0},{"$f":"VLOOKUP(A172,CADASTRO!C:F,4,0)","v":"FOLHATERIA"},15,"2023-02-16"]
[180,{"$f":"IF(A173=\"\",\"\",IFERROR(VLOOKUP(A173,CADASTRO!C:D,2,FALSE),\"Produto Não Cadastrado\"))","v":"PIZZA FOLHADA MIX FRIOS "},{"$f":"IFERROR(VLOOKUP(A173,CADASTRO!C:F,3,0),\"\")","v":0},{"$f":"VLOOKUP(A173,CADASTRO!C:F,4,0)","v":"FOLHATERIA"},20,"2023-02-16"]
[263,{"$f":"IF(A174=\"\",\"\",IFERROR(VLOOKUP(A174,CADASTRO!C:D,2,FALSE),\"Produto Não Cadastrado\"))","v":"TRANÇA FOLHADA BACALHAU"},{"$f":"IFERROR(VLOOKUP(A174,CADASTRO!C:F,3,0),\"\")","v":0},{"$f":"VLOOKUP(A174,CADASTRO!C:F,4,0)","v":"FOLHATERIA"},1,"2023-02-16"]
[264,{"$f":"IF(A175=\"\",\"\",IFERROR(VLOOKUP(A175,CADASTRO!C:D,2,FALSE),\"Produto Não Cadastrado\"))","v":"TRANÇA FOLHADA CALABRESA"},{"$f":"IFERROR(VLOOKUP(A175,CADASTRO!C:F,3,0),\"\")","v":0},{"$f":"VLOOKUP(A175,CADASTRO!C:F,4,0)","v":"FOLHATERIA"},3,"2023-02-16"]
[267,{"$f":"IF(A176=\"\",\"\",IFERROR(VLOOKUP(A176,CADASTRO!C:D,2,FALSE),\"Produto Não Cadastrado\"))","v":"TRANÇA FOLHADA MISTA"},{"$f":"IFERROR(VLOOKUP(A176,CADASTRO!C:F,3,0),\"\")","v":0},{"$f":"VLOOKUP(A176,CADASTRO!C:F,4,0)","v":"FOLHATERIA"},2,"2023-02-16"]
[271,{"$f":"IF(A177=\"\",\"\",IFERROR(VLOOKUP(A177,CADASTRO!C:D,2,FALSE),\"Produto Não Cadastrado\"))","v":"TRANÇA FOLHADA PERU/JAMBU"},{"$f":"IFERROR(VLOOKUP(A177,CADASTRO!C:F,3,0),\"\")","v":0},{"$f":"VLOOKUP(A177,CADASTRO!C:F,4,0)","v":"FOLHATERIA"},2,"2023-02-16"]
[272,{"$f":"IF(A178=\"\",\"\",IFERROR(VLOOKUP(A178,CADASTRO!C:D,2,FALSE),\"Produto Não Cadastrado\"))","v":"TRANÇA FOLHADA SALAME"},{"$f":"IFERROR(VLOOKUP(A178,CADASTRO!C:F,3,0),\"\")","v":0},{"$f":"VLOOKUP(A178,CADASTRO!C:F,4,0)","v":"FOLHATERIA"},3,"2023-02-16"]
[8,{"$f":"IF(A179=\"\",\"\",IFERROR(VLOOKUP(A179,CADASTRO!C:D,2,FALSE),\"Produto Não Cadastrado\"))","v":"BAGUETE INTEGRAL (PCT C/ 45 UND = 3 KG)"},{"$f":"IFERROR(VLOOKUP(A179,CADASTRO!C:F,3,0),\"\")","v":0},{"$f":"VLOOKUP(A179,CADASTRO!C:F,4,0)","v":"PADARIA TRADICIONAL"},1,"2023-02-18"]
[11,{"$f":"IF(A180=\"\",\"\",IFERROR(VLOOKUP(A180,CADASTRO!C:D,2,FALSE),\"Produto Não Cadastrado\"))","v":"BISCOITO ACEBOLADO"},{"$f":"IFERROR(VLOOKUP(A180,CADASTRO!C:F,3,0),\"\")","v":0},{"$f":"VLOOKUP(A180,CADASTRO!C:F,4,0)","v":"PADARIA TRADICIONAL"},1,"2023-02-18"]
[14,{"$f":"IF(A181=\"\",\"\",IFERROR(VLOOKUP(A181,CADASTRO!C:D,2,FALSE),\"Produto Não Cadastrado\"))","v":"BISCOITO COCO"},{"$f":"IFERROR(VLOOKUP(A181,CADASTRO!C:F,3,0),\"\")","v":0},{"$f":"VLOOKUP(A181,CADASTRO!C:F,4,0)","v":"PADARIA TRADICIONAL"},2,"2023-02-18"]
[17,{"$f":"IF(A182=\"\",\"\",IFERROR(VLOOKUP(A182,CADASTRO!C:D,2,FALSE),\"Produto Não Cadastrado\"))","v":"BISCOITO MONTEIRO LOPES"},{"$f":"IFERROR(VLOOKUP(A182,CADASTRO!C:F,3,0),\"\")","v":0},{"$f":"VLOOKUP(A182,CADASTRO!C:F,4,0)","v":"PADARIA TRADICIONAL"},5,"2023-02-18"]
[18,{"$f":"IF(A183=\"\",\"\",IFERROR(VLOOKUP(A183,CADASTRO!C:D,2,FALSE),\"Produto Não Cadastrado\"))","v":"BISCOITO OLHO DE BOI"},{"$f":"IFERROR(VLOOKUP(A183,CADASTRO!C:F,3,0),\"\")","v":0},{"$f":"VLOOKUP(A183,CADASTRO!C:F,4,0)","v":"PADARIA TRADICIONAL"},2,"2023-02-18"]
[19,{"$f":"IF(A184=\"\",\"\",IFERROR(VLOOKUP(A184,CADASTRO!C:D,2,FALSE),\"Produto Não Cadastrado\"))","v":"BISCOITO PAI D'ÉGUA"},{"$f":"IFERROR(VLOOKUP(A184,CADASTRO!C:F,3,0),\"\")","v":0},{"$f":"VLOOKUP(A184,CADASTRO!C:F,4,0)","v":"PADARIA TRADICIONAL"},2,"2023-02-18"]
[41,{"$f":"IF(A185=\"\",\"\",IFERROR(VLOOKUP(A185,CADASTRO!C:D,2,FALSE),\"Produto Não Cadastrado\"))","v":"CROISSANT CONGELADO "},{"$f":"IFERROR(VLOOKUP(A185,CADASTRO!C:F,3,0),\"\")","v":0},{"$f":"VLOOKUP(A185,CADASTRO!C:F,4,0)","v":"PADARIA TRADICIONAL"},500,"2023-02-18"]
[49,{"$f":"IF(A186=\"\",\"\",IFERROR(VLOOKUP(A186,CADASTRO!C:D,2,FALSE),\"Produto Não Cadastrado\"))","v":"DONNUTS"},{"$f":"IFERROR(VLOOKUP(A186,CADASTRO!C:F,3,0),\"\")","v":0},{"$f":"VLOOKUP(A186,CADASTRO!C:F,4,0)","v":"PADARIA TRADICIONAL"},14,"2023-02-18"]
[52,{"$f":"IF(A187=\"\",\"\",IFERROR(VLOOKUP(A187,CADASTRO!C:D,2,FALSE),\"Produto Não Cadastrado\"))","v":"EMPADA FRANGO/PALMITO"},{"$f":"IFERROR(VLOOKUP(A187,CADASTRO!C:F,3,0),\"\")","v":0},{"$f":"VLOOKUP(A187,CADASTRO!C:F,4,0)","v":"PADARIA TRADICIONAL"},6,"2023-02-18"]
[71,{"$f":"IF(A188=\"\",\"\",IFERROR(VLOOKUP(A188,CADASTRO!C:D,2,FALSE),\"Produto Não Cadastrado\"))","v":"MASSA MINI PIZZA"},{"$f":"IFERROR(VLOOKUP(A188,CADASTRO!C:F,3,0),\"\")","v":0},{"$f":"VLOOKUP(A188,CADASTRO!C:F,4,0)","v":"PADARIA TRADICIONAL"},1,"2023-02-18"]
[89,{"$f":"IF(A189=\"\",\"\",IFERROR(VLOOKUP(A189,CADASTRO!C:D,2,FALSE),\"Produto Não Cadastrado\"))","v":"MINI PÃO BATATA HAMBÚRGUER"},{"$f":"IFERROR(VLOOKUP(A189,CADASTRO!C:F,3,0),\"\")","v":0},{"$f":"VLOOKUP(A189,CADASTRO!C:F,4,0)","v":"PADARIA TRADICIONAL"},105,"2023-02-18"]
[91,{"$f":"IF(A190=\"\",\"\",IFERROR(VLOOKUP(A190,CADASTRO!C:D,2,FALSE),\"Produto Não Cadastrado\"))","v":"MINI PÃO BRIOCHE (PCT C/ 24UND)"},{"$f":"IFERROR(VLOOKUP(A190,CADASTRO!C:F,3,0),\"\")","v":0},{"$f":"VLOOKUP(A190,CADASTRO!C:F,4,0)","v":"PADARIA TRADICIONAL"},1,"2023-02-18"]
[92,{"$f":"IF(A191=\"\",\"\",IFERROR(VLOOKUP(A191,CADASTRO!C:D,2,FALSE),\"Produto Não Cadastrado\"))","v":"MINI PÃO DELÍCIA  (PCT C/ 24UND)"},{"$f":"IFERROR(VLOOKUP(A191,CADASTRO!C:F,3,0),\"\")","v":0},{"$f":"VLOOKUP(A191,CADASTRO!C:F,4,0)","v":"PADARIA TRADICIONAL"},4,"2023-02-18"]
[116,{"$f":"IF(A192=\"\",\"\",IFERROR(VLOOKUP(A192,CADASTRO!C:D,2,FALSE),\"Produto Não Cadastrado\"))","v":"PÃO BAGUETE 10 HORAS"},{"$f":"IFERROR(VLOOKUP(A192,CADASTRO!C:F,3,0),\"\")","v":0},{"$f":"VLOOKUP(A192,CADASTRO!C:F,4,0)","v":"PADARIA TRADICIONAL"},5,"2023-02-18"]
[88,{"$f":"IF(A193=\"\",\"\",IFERROR(VLOOKUP(A193,CADASTRO!C:D,2,FALSE),\"Produto Não Cadastrado\"))","v":"MINI PÃO BATATA (ERVAS,PARMESÃO)"},{"$f":"IFERROR(VLOOKUP(A193,CADASTRO!C:F,3,0),\"\")","v":0},{"$f":"VLOOKUP(A193,CADASTRO!C:F,4,0)","v":"PADARIA TRADICIONAL"},288,"2023-02-18"]
[121,{"$f":"IF(A194=\"\",\"\",IFERROR(VLOOKUP(A194,CADASTRO!C:D,2,FALSE),\"Produto Não Cadastrado\"))","v":"PÃO BAIÃO"},{"$f":"IFERROR(VLOOKUP(A194,CADASTRO!C:F,3,0),\"\")","v":0},{"$f":"VLOOKUP(A194,CADASTRO!C:F,4,0)","v":"PADARIA TRADICIONAL"},20,"2023-02-18"]
[122,{"$f":"IF(A195=\"\",\"\",IFERROR(VLOOKUP(A195,CADASTRO!C:D,2,FALSE),\"Produto Não Cadastrado\"))","v":"PÃO BENGALA 10 HORAS"},{"$f":"IFERROR(VLOOKUP(A195,CADASTRO!C:F,3,0),\"\")","v":0},{"$f":"VLOOKUP(A195,CADASTRO!C:F,4,0)","v":"PADARIA TRADICIONAL"},5,"2023-02-18"]
[135,{"$f":"IF(A196=\"\",\"\",IFERROR(VLOOKUP(A196,CADASTRO!C:D,2,FALSE),\"Produto Não Cadastrado\"))","v":"PÃO DE BATATA FILÃO"},{"$f":"IFERROR(VLOOKUP(A196,CADASTRO!C:F,3,0),\"\")","v":0},{"$f":"VLOOKUP(A196,CADASTRO!C:F,4,0)","v":"PADARIA TRADICIONAL"},48,"2023-02-18"]
[159,{"$f":"IF(A197=\"\",\"\",IFERROR(VLOOKUP(A197,CADASTRO!C:D,2,FALSE),\"Produto Não Cadastrado\"))","v":"PÃO FORMA TRADICIONAL 1000"},{"$f":"IFERROR(VLOOKUP(A197,CADASTRO!C:F,3,0),\"\")","v":0},{"$f":"VLOOKUP(A197,CADASTRO!C:F,4,0)","v":"PADARIA TRADICIONAL"},10,"2023-02-18"]
[161,{"$f":"IF(A198=\"\",\"\",IFERROR(VLOOKUP(A198,CADASTRO!C:D,2,FALSE),\"Produto Não Cadastrado\"))","v":"PÃO FRANCÊS 10H"},{"$f":"IFERROR(VLOOKUP(A198,CADASTRO!C:F,3,0),\"\")","v":0},{"$f":"VLOOKUP(A198,CADASTRO!C:F,4,0)","v":"PADARIA TRADICIONAL"},35,"2023-02-18"]
[163,{"$f":"IF(A199=\"\",\"\",IFERROR(VLOOKUP(A199,CADASTRO!C:D,2,FALSE),\"Produto Não Cadastrado\"))","v":"PÃO FRANCÊS 5H"},{"$f":"IFERROR(VLOOKUP(A199,CADASTRO!C:F,3,0),\"\")","v":0},{"$f":"VLOOKUP(A199,CADASTRO!C:F,4,0)","v":"PADARIA TRADICIONAL"},30,"2023-02-18"]
[169,{"$f":"IF(A200=\"\",\"\",IFERROR(VLOOKUP(A200,CADASTRO!C:D,2,FALSE),\"Produto Não Cadastrado\"))","v":"PÃO SEMI ITALIANO"},{"$f":"IFERROR(VLOOKUP(A200,CADASTRO!C:F,3,0),\"\")","v":0},{"$f":"VLOOKUP(A200,CADASTRO!C:F,4,0)","v":"PADARIA TRADICIONAL"},15,"2023-02-18"]
[181,{"$f":"IF(A201=\"\",\"\",IFERROR(VLOOKUP(A201,CADASTRO!C:D,2,FALSE),\"Produto Não Cadastrado\"))","v":"PIZZA INTEGRAL (MASSA)"},{"$f":"IFERROR(VLOOKUP(A201,CADASTRO!C:F,3,0),\"\")","v":0},{"$f":"VLOOKUP(A201,CADASTRO!C:F,4,0)","v":"PADARIA TRADICIONAL"},2,"2023-02-18"]
[244,{"$f":"IF(A202=\"\",\"\",IFERROR(VLOOKUP(A202,CADASTRO!C:D,2,FALSE),\"Produto Não Cadastrado\"))","v":"ROSQUINHA DE LEITE (PCT C/ 32UND)"},{"$f":"IFERROR(VLOOKUP(A202,CADASTRO!C:F,3,0),\"\")","v":0},{"$f":"VLOOKUP(A202,CADASTRO!C:F,4,0)","v":"PADARIA TRADICIONAL"},1,"2023-02-18"]
[273,{"$f":"IF(A203=\"\",\"\",IFERROR(VLOOKUP(A203,CADASTRO!C:D,2,FALSE),\"Produto Não Cadastrado\"))","v":"PÃO BENGALA 5 HORAS"},{"$f":"IFERROR(VLOOKUP(A203,CADASTRO!C:F,3,0),\"\")","v":0},{"$f":"VLOOKUP(A203,CADASTRO!C:F,4,0)","v":"PADARIA TRADICIONAL"},5,"2023-02-18"]
[60,{"$f":"IF(A204=\"\",\"\",IFERROR(VLOOKUP(A204,CADASTRO!C:D,2,FALSE),\"Produto Não Cadastrado\"))","v":"FOCACCIA RUSTICA  CALABRESA (MASSA)"},{"$f":"IFERROR(VLOOKUP(A204,CADASTRO!C:F,3,0),\"\")","v":0},{"$f":"VLOOKUP(A204,CADASTRO!C:F,4,0)","v":"PADARIA RÚSTICA"},1,"2023-02-18"]
[230,{"$f":"IF(A205=\"\",\"\",IFERROR(VLOOKUP(A205,CADASTRO!C:D,2,FALSE),\"Produto Não Cadastrado\"))","v":"QUICHE QUEIJO CUIA/JAMBU"},{"$f":"IFERROR(VLOOKUP(A205,CADASTRO!C:F,3,0),\"\")","v":0},{"$f":"VLOOKUP(A205,CADASTRO!C:F,4,0)","v":"QUITUTERIA"},5,"2023-02-18"]
[2,{"$f":"IF(A206=\"\",\"\",IFERROR(VLOOKUP(A206,CADASTRO!C:D,2,FALSE),\"Produto Não Cadastrado\"))","v":"FORMA DE EMPADA"},{"$f":"IFERROR(VLOOKUP(A206,CADASTRO!C:F,3,0),\"\")","v":"UND"},{"$f":"VLOOKUP(A206,CADASTRO!C:F,4,0)","v":"PADARIA TRADICIONAL"},205,"2023-02-20"]
[8,{"$f":"IF(A207=\"\",\"\",IFERROR(VLOOKUP(A207,CADASTRO!C:D,2,FALSE),\"Produto Não Cadastrado\"))","v":"BAGUETE INTEGRAL (PCT C/ 45 UND = 3 KG)"},{"$f":"IFERROR(VLOOKUP(A207,CADASTRO!C:F,3,0),\"\")","v":0},{"$f":"VLOOKUP(A207,CADASTRO!C:F,4,0)","v":"PADARIA TRADICIONAL"},1,"2023-02-20"]
[11,{"$f":"IF(A208=\"\",\"\",IFERROR(VLOOKUP(A208,CADASTRO!C:D,2,FALSE),\"Produto Não Cadastrado\"))","v":"BISCOITO ACEBOLADO"},{"$f":"IFERROR(VLOOKUP(A208,CADASTRO!C:F,3,0),\"\")","v":0},{"$f":"VLOOKUP(A208,CADASTRO!C:F,4,0)","v":"PADARIA TRADICIONAL"},6.55,"2023-02-20"]
[12,{"$f":"IF(A209=\"\",\"\",IFERROR(VLOOKUP(A209,CADASTRO!C:D,2,FALSE),\"Produto Não Cadastrado\"))","v":"BISCOITO CASTANHA"},{"$f":"IFERROR(VLOOKUP(A209,CADASTRO!C:F,3,0),\"\")","v":0},{"$f":"VLOOKUP(A209,CADASTRO!C:F,4,0)","v":"PADARIA TRADICIONAL"},5,"2023-02-20"]
[14,{"$f":"IF(A210=\"\",\"\",IFERROR(VLOOKUP(A210,CADASTRO!C:D,2,FALSE),\"Produto Não Cadastrado\"))","v":"BISCOITO COCO"},{"$f":"IFERROR(VLOOKUP(A210,CADASTRO!C:F,3,0),\"\")","v":0},{"$f":"VLOOKUP(A210,CADASTRO!C:F,4,0)","v":"PADARIA TRADICIONAL"},3.25,"2023-02-20"]
[17,{"$f":"IF(A211=\"\",\"\",IFERROR(VLOOKUP(A211,CADASTRO!C:D,2,FALSE),\"Produto Não Cadastrado\"))","v":"BISCOITO MONTEIRO LOPES"},{"$f":"IFERROR(VLOOKUP(A211,CADASTRO!C:F,3,0),\"\")","v":0},{"$f":"VLOOKUP(A211,CADASTRO!C:F,4,0)","v":"PADARIA TRADICIONAL"},9.73,"2023-02-20"]
[18,{"$f":"IF(A212=\"\",\"\",IFERROR(VLOOKUP(A212,CADASTRO!C:D,2,FALSE),\"Produto Não Cadastrado\"))","v":"BISCOITO OLHO DE BOI"},{"$f":"IFERROR(VLOOKUP(A212,CADASTRO!C:F,3,0),\"\")","v":0},{"$f":"VLOOKUP(A212,CADASTRO!C:F,4,0)","v":"PADARIA TRADICIONAL"},2,"2023-02-20"]
[19,{"$f":"IF(A213=\"\",\"\",IFERROR(VLOOKUP(A213,CADASTRO!C:D,2,FALSE),\"Produto Não Cadastrado\"))","v":"BISCOITO PAI D'ÉGUA"},{"$f":"IFERROR(VLOOKUP(A213,CADASTRO!C:F,3,0),\"\")","v":0},{"$f":"VLOOKUP(A213,CADASTRO!C:F,4,0)","v":"PADARIA TRADICIONAL"},2.35,"2023-02-20"]
[26,{"$f":"IF(A214=\"\",\"\",IFERROR(VLOOKUP(A214,CADASTRO!C:D,2,FALSE),\"Produto Não Cadastrado\"))","v":"CARRET"},{"$f":"IFERROR(VLOOKUP(A214,CADASTRO!C:F,3,0),\"\")","v":0},{"$f":"VLOOKUP(A214,CADASTRO!C:F,4,0)","v":"FOLHATERIA"},16,"2023-02-20"]
[28,{"$f":"IF(A215=\"\",\"\",IFERROR(VLOOKUP(A215,CADASTRO!C:D,2,FALSE),\"Produto Não Cadastrado\"))","v":"CATARINA DE BACALHAU "},{"$f":"IFERROR(VLOOKUP(A215,CADASTRO!C:F,3,0),\"\")","v":0},{"$f":"VLOOKUP(A215,CADASTRO!C:F,4,0)","v":"FOLHATERIA"},4,"2023-02-20"]
[29,{"$f":"IF(A216=\"\",\"\",IFERROR(VLOOKUP(A216,CADASTRO!C:D,2,FALSE),\"Produto Não Cadastrado\"))","v":"CATARINA DE FRANGO"},{"$f":"IFERROR(VLOOKUP(A216,CADASTRO!C:F,3,0),\"\")","v":0},{"$f":"VLOOKUP(A216,CADASTRO!C:F,4,0)","v":"FOLHATERIA"},4,"2023-02-20"]
[39,{"$f":"IF(A217=\"\",\"\",IFERROR(VLOOKUP(A217,CADASTRO!C:D,2,FALSE),\"Produto Não Cadastrado\"))","v":"CROISSANT AMÊNDOAS"},{"$f":"IFERROR(VLOOKUP(A217,CADASTRO!C:F,3,0),\"\")","v":0},{"$f":"VLOOKUP(A217,CADASTRO!C:F,4,0)","v":"PADARIA TRADICIONAL"},9,"2023-02-20"]
[41,{"$f":"IF(A218=\"\",\"\",IFERROR(VLOOKUP(A218,CADASTRO!C:D,2,FALSE),\"Produto Não Cadastrado\"))","v":"CROISSANT CONGELADO "},{"$f":"IFERROR(VLOOKUP(A218,CADASTRO!C:F,3,0),\"\")","v":0},{"$f":"VLOOKUP(A218,CADASTRO!C:F,4,0)","v":"PADARIA TRADICIONAL"},233,"2023-02-20"]
[44,{"$f":"IF(A219=\"\",\"\",IFERROR(VLOOKUP(A219,CADASTRO!C:D,2,FALSE),\"Produto Não Cadastrado\"))","v":"DANISH CAPRESE"},{"$f":"IFERROR(VLOOKUP(A219,CADASTRO!C:F,3,0),\"\")","v":0},{"$f":"VLOOKUP(A219,CADASTRO!C:F,4,0)","v":"FOLHATERIA"},10,"2023-02-20"]
[49,{"$f":"IF(A220=\"\",\"\",IFERROR(VLOOKUP(A220,CADASTRO!C:D,2,FALSE),\"Produto Não Cadastrado\"))","v":"DONNUTS"},{"$f":"IFERROR(VLOOKUP(A220,CADASTRO!C:F,3,0),\"\")","v":0},{"$f":"VLOOKUP(A220,CADASTRO!C:F,4,0)","v":"PADARIA TRADICIONAL"},22,"2023-02-20"]
[51,{"$f":"IF(A221=\"\",\"\",IFERROR(VLOOKUP(A221,CADASTRO!C:D,2,FALSE),\"Produto Não Cadastrado\"))","v":"EMPADA FRANGO"},{"$f":"IFERROR(VLOOKUP(A221,CADASTRO!C:F,3,0),\"\")","v":0},{"$f":"VLOOKUP(A221,CADASTRO!C:F,4,0)","v":"PADARIA TRADICIONAL"},11,"2023-02-20"]
[52,{"$f":"IF(A222=\"\",\"\",IFERROR(VLOOKUP(A222,CADASTRO!C:D,2,FALSE),\"Produto Não Cadastrado\"))","v":"EMPADA FRANGO/PALMITO"},{"$f":"IFERROR(VLOOKUP(A222,CADASTRO!C:F,3,0),\"\")","v":0},{"$f":"VLOOKUP(A222,CADASTRO!C:F,4,0)","v":"PADARIA TRADICIONAL"},6,"2023-02-20"]
[60,{"$f":"IF(A223=\"\",\"\",IFERROR(VLOOKUP(A223,CADASTRO!C:D,2,FALSE),\"Produto Não Cadastrado\"))","v":"FOCACCIA RUSTICA  CALABRESA (MASSA)"},{"$f":"IFERROR(VLOOKUP(A223,CADASTRO!C:F,3,0),\"\")","v":0},{"$f":"VLOOKUP(A223,CADASTRO!C:F,4,0)","v":"PADARIA RÚSTICA"},1,"2023-02-20"]
[71,{"$f":"IF(A224=\"\",\"\",IFERROR(VLOOKUP(A224,CADASTRO!C:D,2,FALSE),\"Produto Não Cadastrado\"))","v":"MASSA MINI PIZZA"},{"$f":"IFERROR(VLOOKUP(A224,CADASTRO!C:F,3,0),\"\")","v":0},{"$f":"VLOOKUP(A224,CADASTRO!C:F,4,0)","v":"PADARIA TRADICIONAL"},2,"2023-02-20"]
[78,{"$f":"IF(A225=\"\",\"\",IFERROR(VLOOKUP(A225,CADASTRO!C:D,2,FALSE),\"Produto Não Cadastrado\"))","v":"MINI FOLHADO BACALHAU"},{"$f":"IFERROR(VLOOKUP(A225,CADASTRO!C:F,3,0),\"\")","v":0},{"$f":"VLOOKUP(A225,CADASTRO!C:F,4,0)","v":"FOLHATERIA"},3.82,"2023-02-20"]
[79,{"$f":"IF(A226=\"\",\"\",IFERROR(VLOOKUP(A226,CADASTRO!C:D,2,FALSE),\"Produto Não Cadastrado\"))","v":"MINI FOLHADO CALABRESA"},{"$f":"IFERROR(VLOOKUP(A226,CADASTRO!C:F,3,0),\"\")","v":0},{"$f":"VLOOKUP(A226,CADASTRO!C:F,4,0)","v":"FOLHATERIA"},4.0999999999999996,"2023-02-20"]
[80,{"$f":"IF(A227=\"\",\"\",IFERROR(VLOOKUP(A227,CADASTRO!C:D,2,FALSE),\"Produto Não Cadastrado\"))","v":"MINI FOLHADO CUPUAÇU"},{"$f":"IFERROR(VLOOKUP(A227,CADASTRO!C:F,3,0),\"\")","v":0},{"$f":"VLOOKUP(A227,CADASTRO!C:F,4,0)","v":"FOLHATERIA"},3.86,"2023-02-20"]
[81,{"$f":"IF(A228=\"\",\"\",IFERROR(VLOOKUP(A228,CADASTRO!C:D,2,FALSE),\"Produto Não Cadastrado\"))","v":"MINI FOLHADO DE QUEIJO"},{"$f":"IFERROR(VLOOKUP(A228,CADASTRO!C:F,3,0),\"\")","v":0},{"$f":"VLOOKUP(A228,CADASTRO!C:F,4,0)","v":"FOLHATERIA"},10.78,"2023-02-20"]
[87,{"$f":"IF(A229=\"\",\"\",IFERROR(VLOOKUP(A229,CADASTRO!C:D,2,FALSE),\"Produto Não Cadastrado\"))","v":"MINI PAIN AU CHOCOLAT "},{"$f":"IFERROR(VLOOKUP(A229,CADASTRO!C:F,3,0),\"\")","v":0},{"$f":"VLOOKUP(A229,CADASTRO!C:F,4,0)","v":"FOLHATERIA"},7.13,"2023-02-20"]
[88,{"$f":"IF(A230=\"\",\"\",IFERROR(VLOOKUP(A230,CADASTRO!C:D,2,FALSE),\"Produto Não Cadastrado\"))","v":"MINI PÃO BATATA (ERVAS,PARMESÃO)"},{"$f":"IFERROR(VLOOKUP(A230,CADASTRO!C:F,3,0),\"\")","v":0},{"$f":"VLOOKUP(A230,CADASTRO!C:F,4,0)","v":"PADARIA TRADICIONAL"},254,"2023-02-20"]
[89,{"$f":"IF(A231=\"\",\"\",IFERROR(VLOOKUP(A231,CADASTRO!C:D,2,FALSE),\"Produto Não Cadastrado\"))","v":"MINI PÃO BATATA HAMBÚRGUER"},{"$f":"IFERROR(VLOOKUP(A231,CADASTRO!C:F,3,0),\"\")","v":0},{"$f":"VLOOKUP(A231,CADASTRO!C:F,4,0)","v":"PADARIA TRADICIONAL"},311,"2023-02-20"]
[91,{"$f":"IF(A232=\"\",\"\",IFERROR(VLOOKUP(A232,CADASTRO!C:D,2,FALSE),\"Produto Não Cadastrado\"))","v":"MINI PÃO BRIOCHE (PCT C/ 24UND)"},{"$f":"IFERROR(VLOOKUP(A232,CADASTRO!C:F,3,0),\"\")","v":0},{"$f":"VLOOKUP(A232,CADASTRO!C:F,4,0)","v":"PADARIA TRADICIONAL"},3,"2023-02-20"]
[92,{"$f":"IF(A233=\"\",\"\",IFERROR(VLOOKUP(A233,CADASTRO!C:D,2,FALSE),\"Produto Não Cadastrado\"))","v":"MINI PÃO DELÍCIA  (PCT C/ 24UND)"},{"$f":"IFERROR(VLOOKUP(A233,CADASTRO!C:F,3,0),\"\")","v":0},{"$f":"VLOOKUP(A233,CADASTRO!C:F,4,0)","v":"PADARIA TRADICIONAL"},3,"2023-02-20"]
[94,{"$f":"IF(A234=\"\",\"\",IFERROR(VLOOKUP(A234,CADASTRO!C:D,2,FALSE),\"Produto Não Cadastrado\"))","v":"MINI TRANÇA BACALHAU"},{"$f":"IFERROR(VLOOKUP(A234,CADASTRO!C:F,3,0),\"\")","v":0},{"$f":"VLOOKUP(A234,CADASTRO!C:F,4,0)","v":"FOLHATERIA"},3,"2023-02-20"]
[95,{"$f":"IF(A235=\"\",\"\",IFERROR(VLOOKUP(A235,CADASTRO!C:D,2,FALSE),\"Produto Não Cadastrado\"))","v":"MINI TRANÇA CALABRESA"},{"$f":"IFERROR(VLOOKUP(A235,CADASTRO!C:F,3,0),\"\")","v":0},{"$f":"VLOOKUP(A235,CADASTRO!C:F,4,0)","v":"FOLHATERIA"},4,"2023-02-20"]
[97,{"$f":"IF(A236=\"\",\"\",IFERROR(VLOOKUP(A236,CADASTRO!C:D,2,FALSE),\"Produto Não Cadastrado\"))","v":"MINI TRANÇA FRANGO"},{"$f":"IFERROR(VLOOKUP(A236,CADASTRO!C:F,3,0),\"\")","v":0},{"$f":"VLOOKUP(A236,CADASTRO!C:F,4,0)","v":"FOLHATERIA"},2,"2023-02-20"]
[98,{"$f":"IF(A237=\"\",\"\",IFERROR(VLOOKUP(A237,CADASTRO!C:D,2,FALSE),\"Produto Não Cadastrado\"))","v":"MINI TRANÇA MISTA"},{"$f":"IFERROR(VLOOKUP(A237,CADASTRO!C:F,3,0),\"\")","v":0},{"$f":"VLOOKUP(A237,CADASTRO!C:F,4,0)","v":"FOLHATERIA"},2,"2023-02-20"]
[104,{"$f":"IF(A238=\"\",\"\",IFERROR(VLOOKUP(A238,CADASTRO!C:D,2,FALSE),\"Produto Não Cadastrado\"))","v":"MINI TRANÇA SALAME"},{"$f":"IFERROR(VLOOKUP(A238,CADASTRO!C:F,3,0),\"\")","v":0},{"$f":"VLOOKUP(A238,CADASTRO!C:F,4,0)","v":"FOLHATERIA"},2,"2023-02-20"]
[110,{"$f":"IF(A239=\"\",\"\",IFERROR(VLOOKUP(A239,CADASTRO!C:D,2,FALSE),\"Produto Não Cadastrado\"))","v":"PALITO CANELA"},{"$f":"IFERROR(VLOOKUP(A239,CADASTRO!C:F,3,0),\"\")","v":0},{"$f":"VLOOKUP(A239,CADASTRO!C:F,4,0)","v":"FOLHATERIA"},3.8,"2023-02-20"]
[111,{"$f":"IF(A240=\"\",\"\",IFERROR(VLOOKUP(A240,CADASTRO!C:D,2,FALSE),\"Produto Não Cadastrado\"))","v":"PALITO QUEIJO"},{"$f":"IFERROR(VLOOKUP(A240,CADASTRO!C:F,3,0),\"\")","v":0},{"$f":"VLOOKUP(A240,CADASTRO!C:F,4,0)","v":"FOLHATERIA"},3.5,"2023-02-20"]
[121,{"$f":"IF(A241=\"\",\"\",IFERROR(VLOOKUP(A241,CADASTRO!C:D,2,FALSE),\"Produto Não Cadastrado\"))","v":"PÃO BAIÃO"},{"$f":"IFERROR(VLOOKUP(A241,CADASTRO!C:F,3,0),\"\")","v":0},{"$f":"VLOOKUP(A241,CADASTRO!C:F,4,0)","v":"PADARIA TRADICIONAL"},20,"2023-02-20"]
[132,{"$f":"IF(A242=\"\",\"\",IFERROR(VLOOKUP(A242,CADASTRO!C:D,2,FALSE),\"Produto Não Cadastrado\"))","v":"PÃO CUCA GOIABADA"},{"$f":"IFERROR(VLOOKUP(A242,CADASTRO!C:F,3,0),\"\")","v":0},{"$f":"VLOOKUP(A242,CADASTRO!C:F,4,0)","v":"PADARIA TRADICIONAL"},10,"2023-02-20"]
[135,{"$f":"IF(A243=\"\",\"\",IFERROR(VLOOKUP(A243,CADASTRO!C:D,2,FALSE),\"Produto Não Cadastrado\"))","v":"PÃO DE BATATA FILÃO"},{"$f":"IFERROR(VLOOKUP(A243,CADASTRO!C:F,3,0),\"\")","v":0},{"$f":"VLOOKUP(A243,CADASTRO!C:F,4,0)","v":"PADARIA TRADICIONAL"},56,"2023-02-20"]
[144,{"$f":"IF(A244=\"\",\"\",IFERROR(VLOOKUP(A244,CADASTRO!C:D,2,FALSE),\"Produto Não Cadastrado\"))","v":"PÃO DE ROSAS"},{"$f":"IFERROR(VLOOKUP(A244,CADASTRO!C:F,3,0),\"\")","v":0},{"$f":"VLOOKUP(A244,CADASTRO!C:F,4,0)","v":"FOLHATERIA"},21,"2023-02-20"]
[154,{"$f":"IF(A245=\"\",\"\",IFERROR(VLOOKUP(A245,CADASTRO!C:D,2,FALSE),\"Produto Não Cadastrado\"))","v":"PÃO FORMA BRIOCHE A25"},{"$f":"IFERROR(VLOOKUP(A245,CADASTRO!C:F,3,0),\"\")","v":0},{"$f":"VLOOKUP(A245,CADASTRO!C:F,4,0)","v":"PADARIA TRADICIONAL"},84,"2023-02-20"]
[157,{"$f":"IF(A246=\"\",\"\",IFERROR(VLOOKUP(A246,CADASTRO!C:D,2,FALSE),\"Produto Não Cadastrado\"))","v":"PÃO FORMA LEITE A25"},{"$f":"IFERROR(VLOOKUP(A246,CADASTRO!C:F,3,0),\"\")","v":0},{"$f":"VLOOKUP(A246,CADASTRO!C:F,4,0)","v":"PADARIA TRADICIONAL"},45,"2023-02-20"]
[158,{"$f":"IF(A247=\"\",\"\",IFERROR(VLOOKUP(A247,CADASTRO!C:D,2,FALSE),\"Produto Não Cadastrado\"))","v":"PÃO FORMA MILHO A25"},{"$f":"IFERROR(VLOOKUP(A247,CADASTRO!C:F,3,0),\"\")","v":0},{"$f":"VLOOKUP(A247,CADASTRO!C:F,4,0)","v":"PADARIA TRADICIONAL"},39,"2023-02-20"]
[159,{"$f":"IF(A248=\"\",\"\",IFERROR(VLOOKUP(A248,CADASTRO!C:D,2,FALSE),\"Produto Não Cadastrado\"))","v":"PÃO FORMA TRADICIONAL 1000"},{"$f":"IFERROR(VLOOKUP(A248,CADASTRO!C:F,3,0),\"\")","v":0},{"$f":"VLOOKUP(A248,CADASTRO!C:F,4,0)","v":"PADARIA TRADICIONAL"},2,"2023-02-20"]
[160,{"$f":"IF(A249=\"\",\"\",IFERROR(VLOOKUP(A249,CADASTRO!C:D,2,FALSE),\"Produto Não Cadastrado\"))","v":"PÃO FORMA TRADICIONAL 700"},{"$f":"IFERROR(VLOOKUP(A249,CADASTRO!C:F,3,0),\"\")","v":0},{"$f":"VLOOKUP(A249,CADASTRO!C:F,4,0)","v":"PADARIA TRADICIONAL"},1,"2023-02-20"]
[169,{"$f":"IF(A250=\"\",\"\",IFERROR(VLOOKUP(A250,CADASTRO!C:D,2,FALSE),\"Produto Não Cadastrado\"))","v":"PÃO SEMI ITALIANO"},{"$f":"IFERROR(VLOOKUP(A250,CADASTRO!C:F,3,0),\"\")","v":0},{"$f":"VLOOKUP(A250,CADASTRO!C:F,4,0)","v":"PADARIA TRADICIONAL"},36,"2023-02-20"]
[170,{"$f":"IF(A251=\"\",\"\",IFERROR(VLOOKUP(A251,CADASTRO!C:D,2,FALSE),\"Produto Não Cadastrado\"))","v":"PÃO VIENNOIS"},{"$f":"IFERROR(VLOOKUP(A251,CADASTRO!C:F,3,0),\"\")","v":0},{"$f":"VLOOKUP(A251,CADASTRO!C:F,4,0)","v":"PADARIA TRADICIONAL"},50,"2023-02-20"]
[172,{"$f":"IF(A252=\"\",\"\",IFERROR(VLOOKUP(A252,CADASTRO!C:D,2,FALSE),\"Produto Não Cadastrado\"))","v":"PASTEL DE BELÉM (MASSA)"},{"$f":"IFERROR(VLOOKUP(A252,CADASTRO!C:F,3,0),\"\")","v":0},{"$f":"VLOOKUP(A252,CADASTRO!C:F,4,0)","v":"FOLHATERIA"},4,"2023-02-20"]
[173,{"$f":"IF(A253=\"\",\"\",IFERROR(VLOOKUP(A253,CADASTRO!C:D,2,FALSE),\"Produto Não Cadastrado\"))","v":"PASTEL FOLHADO BACALHAU "},{"$f":"IFERROR(VLOOKUP(A253,CADASTRO!C:F,3,0),\"\")","v":0},{"$f":"VLOOKUP(A253,CADASTRO!C:F,4,0)","v":"FOLHATERIA"},15,"2023-02-20"]
[174,{"$f":"IF(A254=\"\",\"\",IFERROR(VLOOKUP(A254,CADASTRO!C:D,2,FALSE),\"Produto Não Cadastrado\"))","v":"PASTEL FOLHADO FRANGO "},{"$f":"IFERROR(VLOOKUP(A254,CADASTRO!C:F,3,0),\"\")","v":0},{"$f":"VLOOKUP(A254,CADASTRO!C:F,4,0)","v":"FOLHATERIA"},15,"2023-02-20"]
[84,{"$f":"IF(A255=\"\",\"\",IFERROR(VLOOKUP(A255,CADASTRO!C:D,2,FALSE),\"Produto Não Cadastrado\"))","v":"MINI FOLHADO MISTO"},{"$f":"IFERROR(VLOOKUP(A255,CADASTRO!C:F,3,0),\"\")","v":0},{"$f":"VLOOKUP(A255,CADASTRO!C:F,4,0)","v":"FOLHATERIA"},7.24,"2023-02-20"]
[175,{"$f":"IF(A256=\"\",\"\",IFERROR(VLOOKUP(A256,CADASTRO!C:D,2,FALSE),\"Produto Não Cadastrado\"))","v":"PASTEL FOLHADO MISTO "},{"$f":"IFERROR(VLOOKUP(A256,CADASTRO!C:F,3,0),\"\")","v":0},{"$f":"VLOOKUP(A256,CADASTRO!C:F,4,0)","v":"FOLHATERIA"},30,"2023-02-20"]
[176,{"$f":"IF(A257=\"\",\"\",IFERROR(VLOOKUP(A257,CADASTRO!C:D,2,FALSE),\"Produto Não Cadastrado\"))","v":"PASTEL FOLHADO QUEIJO "},{"$f":"IFERROR(VLOOKUP(A257,CADASTRO!C:F,3,0),\"\")","v":0},{"$f":"VLOOKUP(A257,CADASTRO!C:F,4,0)","v":"FOLHATERIA"},30,"2023-02-20"]
[180,{"$f":"IF(A258=\"\",\"\",IFERROR(VLOOKUP(A258,CADASTRO!C:D,2,FALSE),\"Produto Não Cadastrado\"))","v":"PIZZA FOLHADA MIX FRIOS "},{"$f":"IFERROR(VLOOKUP(A258,CADASTRO!C:F,3,0),\"\")","v":0},{"$f":"VLOOKUP(A258,CADASTRO!C:F,4,0)","v":"FOLHATERIA"},15,"2023-02-20"]
[181,{"$f":"IF(A259=\"\",\"\",IFERROR(VLOOKUP(A259,CADASTRO!C:D,2,FALSE),\"Produto Não Cadastrado\"))","v":"PIZZA INTEGRAL (MASSA)"},{"$f":"IFERROR(VLOOKUP(A259,CADASTRO!C:F,3,0),\"\")","v":0},{"$f":"VLOOKUP(A259,CADASTRO!C:F,4,0)","v":"PADARIA TRADICIONAL"},2,"2023-02-20"]
[222,{"$f":"IF(A260=\"\",\"\",IFERROR(VLOOKUP(A260,CADASTRO!C:D,2,FALSE),\"Produto Não Cadastrado\"))","v":"QUICHE 4 QUEIJOS"},{"$f":"IFERROR(VLOOKUP(A260,CADASTRO!C:F,3,0),\"\")","v":0},{"$f":"VLOOKUP(A260,CADASTRO!C:F,4,0)","v":"QUITUTERIA"},5,"2023-02-20"]
[228,{"$f":"IF(A261=\"\",\"\",IFERROR(VLOOKUP(A261,CADASTRO!C:D,2,FALSE),\"Produto Não Cadastrado\"))","v":"QUICHE MARGUERITA"},{"$f":"IFERROR(VLOOKUP(A261,CADASTRO!C:F,3,0),\"\")","v":0},{"$f":"VLOOKUP(A261,CADASTRO!C:F,4,0)","v":"QUITUTERIA"},5,"2023-02-20"]
[230,{"$f":"IF(A262=\"\",\"\",IFERROR(VLOOKUP(A262,CADASTRO!C:D,2,FALSE),\"Produto Não Cadastrado\"))","v":"QUICHE QUEIJO CUIA/JAMBU"},{"$f":"IFERROR(VLOOKUP(A262,CADASTRO!C:F,3,0),\"\")","v":0},{"$f":"VLOOKUP(A262,CADASTRO!C:F,4,0)","v":"QUITUTERIA"},14,"2023-02-20"]
[231,{"$f":"IF(A263=\"\",\"\",IFERROR(VLOOKUP(A263,CADASTRO!C:D,2,FALSE),\"Produto Não Cadastrado\"))","v":"QUICHE TOMATE SECO"},{"$f":"IFERROR(VLOOKUP(A263,CADASTRO!C:F,3,0),\"\")","v":0},{"$f":"VLOOKUP(A263,CADASTRO!C:F,4,0)","v":"QUITUTERIA"},5,"2023-02-20"]
[244,{"$f":"IF(A264=\"\",\"\",IFERROR(VLOOKUP(A264,CADASTRO!C:D,2,FALSE),\"Produto Não Cadastrado\"))","v":"ROSQUINHA DE LEITE (PCT C/ 32UND)"},{"$f":"IFERROR(VLOOKUP(A264,CADASTRO!C:F,3,0),\"\")","v":0},{"$f":"VLOOKUP(A264,CADASTRO!C:F,4,0)","v":"PADARIA TRADICIONAL"},2,"2023-02-20"]
[245,{"$f":"IF(A265=\"\",\"\",IFERROR(VLOOKUP(A265,CADASTRO!C:D,2,FALSE),\"Produto Não Cadastrado\"))","v":"SALGADO ITALIANO FRANGO"},{"$f":"IFERROR(VLOOKUP(A265,CADASTRO!C:F,3,0),\"\")","v":0},{"$f":"VLOOKUP(A265,CADASTRO!C:F,4,0)","v":"PADARIA TRADICIONAL"},19,"2023-02-20"]
[247,{"$f":"IF(A266=\"\",\"\",IFERROR(VLOOKUP(A266,CADASTRO!C:D,2,FALSE),\"Produto Não Cadastrado\"))","v":"SONHO"},{"$f":"IFERROR(VLOOKUP(A266,CADASTRO!C:F,3,0),\"\")","v":0},{"$f":"VLOOKUP(A266,CADASTRO!C:F,4,0)","v":"PADARIA TRADICIONAL"},8,"2023-02-20"]
[263,{"$f":"IF(A267=\"\",\"\",IFERROR(VLOOKUP(A267,CADASTRO!C:D,2,FALSE),\"Produto Não Cadastrado\"))","v":"TRANÇA FOLHADA BACALHAU"},{"$f":"IFERROR(VLOOKUP(A267,CADASTRO!C:F,3,0),\"\")","v":0},{"$f":"VLOOKUP(A267,CADASTRO!C:F,4,0)","v":"FOLHATERIA"},6,"2023-02-20"]
[264,{"$f":"IF(A268=\"\",\"\",IFERROR(VLOOKUP(A268,CADASTRO!C:D,2,FALSE),\"Produto Não Cadastrado\"))","v":"TRANÇA FOLHADA CALABRESA"},{"$f":"IFERROR(VLOOKUP(A268,CADASTRO!C:F,3,0),\"\")","v":0},{"$f":"VLOOKUP(A268,CADASTRO!C:F,4,0)","v":"FOLHATERIA"},5,"2023-02-20"]
[266,{"$f":"IF(A269=\"\",\"\",IFERROR(VLOOKUP(A269,CADASTRO!C:D,2,FALSE),\"Produto Não Cadastrado\"))","v":"TRANÇA FOLHADA FRANGO/JAMBU"},{"$f":"IFERROR(VLOOKUP(A269,CADASTRO!C:F,3,0),\"\")","v":0},{"$f":"VLOOKUP(A269,CADASTRO!C:F,4,0)","v":"FOLHATERIA"},5,"2023-02-20"]
[267,{"$f":"IF(A270=\"\",\"\",IFERROR(VLOOKUP(A270,CADASTRO!C:D,2,FALSE),\"Produto Não Cadastrado\"))","v":"TRANÇA FOLHADA MISTA"},{"$f":"IFERROR(VLOOKUP(A270,CADASTRO!C:F,3,0),\"\")","v":0},{"$f":"VLOOKUP(A270,CADASTRO!C:F,4,0)","v":"FOLHATERIA"},11,"2023-02-20"]
[268,{"$f":"IF(A271=\"\",\"\",IFERROR(VLOOKUP(A271,CADASTRO!C:D,2,FALSE),\"Produto Não Cadastrado\"))","v":"TRANÇA FOLHADA MORTADELA DEFUMADA"},{"$f":"IFERROR(VLOOKUP(A271,CADASTRO!C:F,3,0),\"\")","v":0},{"$f":"VLOOKUP(A271,CADASTRO!C:F,4,0)","v":"FOLHATERIA"},3,"2023-02-20"]
[271,{"$f":"IF(A272=\"\",\"\",IFERROR(VLOOKUP(A272,CADASTRO!C:D,2,FALSE),\"Produto Não Cadastrado\"))","v":"TRANÇA FOLHADA PERU/JAMBU"},{"$f":"IFERROR(VLOOKUP(A272,CADASTRO!C:F,3,0),\"\")","v":0},{"$f":"VLOOKUP(A272,CADASTRO!C:F,4,0)","v":"FOLHATERIA"},2,"2023-02-20"]
[272,{"$f":"IF(A273=\"\",\"\",IFERROR(VLOOKUP(A273,CADASTRO!C:D,2,FALSE),\"Produto Não Cadastrado\"))","v":"TRANÇA FOLHADA SALAME"},{"$f":"IFERROR(VLOOKUP(A273,CADASTRO!C:F,3,0),\"\")","v":0},{"$f":"VLOOKUP(A273,CADASTRO!C:F,4,0)","v":"FOLHATERIA"},1,"2023-02-20"]
[28,{"$f":"IF(A274=\"\",\"\",IFERROR(VLOOKUP(A274,CADASTRO!C:D,2,FALSE),\"Produto Não Cadastrado\"))","v":"CATARINA DE BACALHAU "},{"$f":"IFERROR(VLOOKUP(A274,CADASTRO!C:F,3,0),\"\")","v":0},{"$f":"VLOOKUP(A274,CADASTRO!C:F,4,0)","v":"FOLHATERIA"},3,"2023-02-22"]
[29,{"$f":"IF(A275=\"\",\"\",IFERROR(VLOOKUP(A275,CADASTRO!C:D,2,FALSE),\"Produto Não Cadastrado\"))","v":"CATARINA DE FRANGO"},{"$f":"IFERROR(VLOOKUP(A275,CADASTRO!C:F,3,0),\"\")","v":0},{"$f":"VLOOKUP(A275,CADASTRO!C:F,4,0)","v":"FOLHATERIA"},3,"2023-02-22"]
[44,{"$f":"IF(A276=\"\",\"\",IFERROR(VLOOKUP(A276,CADASTRO!C:D,2,FALSE),\"Produto Não Cadastrado\"))","v":"DANISH CAPRESE"},{"$f":"IFERROR(VLOOKUP(A276,CADASTRO!C:F,3,0),\"\")","v":0},{"$f":"VLOOKUP(A276,CADASTRO!C:F,4,0)","v":"FOLHATERIA"},5,"2023-02-22"]
[78,{"$f":"IF(A277=\"\",\"\",IFERROR(VLOOKUP(A277,CADASTRO!C:D,2,FALSE),\"Produto Não Cadastrado\"))","v":"MINI FOLHADO BACALHAU"},{"$f":"IFERROR(VLOOKUP(A277,CADASTRO!C:F,3,0),\"\")","v":0},{"$f":"VLOOKUP(A277,CADASTRO!C:F,4,0)","v":"FOLHATERIA"},7.33,"2023-02-22"]
[79,{"$f":"IF(A278=\"\",\"\",IFERROR(VLOOKUP(A278,CADASTRO!C:D,2,FALSE),\"Produto Não Cadastrado\"))","v":"MINI FOLHADO CALABRESA"},{"$f":"IFERROR(VLOOKUP(A278,CADASTRO!C:F,3,0),\"\")","v":0},{"$f":"VLOOKUP(A278,CADASTRO!C:F,4,0)","v":"FOLHATERIA"},3.08,"2023-02-22"]
[80,{"$f":"IF(A279=\"\",\"\",IFERROR(VLOOKUP(A279,CADASTRO!C:D,2,FALSE),\"Produto Não Cadastrado\"))","v":"MINI FOLHADO CUPUAÇU"},{"$f":"IFERROR(VLOOKUP(A279,CADASTRO!C:F,3,0),\"\")","v":0},{"$f":"VLOOKUP(A279,CADASTRO!C:F,4,0)","v":"FOLHATERIA"},7.6,"2023-02-22"]
[82,{"$f":"IF(A280=\"\",\"\",IFERROR(VLOOKUP(A280,CADASTRO!C:D,2,FALSE),\"Produto Não Cadastrado\"))","v":"MINI FOLHADO FRANGO"},{"$f":"IFERROR(VLOOKUP(A280,CADASTRO!C:F,3,0),\"\")","v":0},{"$f":"VLOOKUP(A280,CADASTRO!C:F,4,0)","v":"FOLHATERIA"},3.3,"2023-02-22"]
[83,{"$f":"IF(A281=\"\",\"\",IFERROR(VLOOKUP(A281,CADASTRO!C:D,2,FALSE),\"Produto Não Cadastrado\"))","v":"MINI FOLHADO GOIABADA"},{"$f":"IFERROR(VLOOKUP(A281,CADASTRO!C:F,3,0),\"\")","v":0},{"$f":"VLOOKUP(A281,CADASTRO!C:F,4,0)","v":"FOLHATERIA"},3.63,"2023-02-22"]
[93,{"$f":"IF(A282=\"\",\"\",IFERROR(VLOOKUP(A282,CADASTRO!C:D,2,FALSE),\"Produto Não Cadastrado\"))","v":"MINI PASTEL FOLHADO"},{"$f":"IFERROR(VLOOKUP(A282,CADASTRO!C:F,3,0),\"\")","v":0},{"$f":"VLOOKUP(A282,CADASTRO!C:F,4,0)","v":"FOLHATERIA"},3.38,"2023-02-22"]
[94,{"$f":"IF(A283=\"\",\"\",IFERROR(VLOOKUP(A283,CADASTRO!C:D,2,FALSE),\"Produto Não Cadastrado\"))","v":"MINI TRANÇA BACALHAU"},{"$f":"IFERROR(VLOOKUP(A283,CADASTRO!C:F,3,0),\"\")","v":0},{"$f":"VLOOKUP(A283,CADASTRO!C:F,4,0)","v":"FOLHATERIA"},2,"2023-02-22"]
[95,{"$f":"IF(A284=\"\",\"\",IFERROR(VLOOKUP(A284,CADASTRO!C:D,2,FALSE),\"Produto Não Cadastrado\"))","v":"MINI TRANÇA CALABRESA"},{"$f":"IFERROR(VLOOKUP(A284,CADASTRO!C:F,3,0),\"\")","v":0},{"$f":"VLOOKUP(A284,CADASTRO!C:F,4,0)","v":"FOLHATERIA"},2,"2023-02-22"]
[97,{"$f":"IF(A285=\"\",\"\",IFERROR(VLOOKUP(A285,CADASTRO!C:D,2,FALSE),\"Produto Não Cadastrado\"))","v":"MINI TRANÇA FRANGO"},{"$f":"IFERROR(VLOOKUP(A285,CADASTRO!C:F,3,0),\"\")","v":0},{"$f":"VLOOKUP(A285,CADASTRO!C:F,4,0)","v":"FOLHATERIA"},2,"2023-02-22"]
[98,{"$f":"IF(A286=\"\",\"\",IFERROR(VLOOKUP(A286,CADASTRO!C:D,2,FALSE),\"Produto Não Cadastrado\"))","v":"MINI TRANÇA MISTA"},{"$f":"IFERROR(VLOOKUP(A286,CADASTRO!C:F,3,0),\"\")","v":0},{"$f":"VLOOKUP(A286,CADASTRO!C:F,4,0)","v":"FOLHATERIA"},2,"2023-02-22"]
[104,{"$f":"IF(A287=\"\",\"\",IFERROR(VLOOKUP(A287,CADASTRO!C:D,2,FALSE),\"Produto Não Cadastrado\"))","v":"MINI TRANÇA SALAME"},{"$f":"IFERROR(VLOOKUP(A287,CADASTRO!C:F,3,0),\"\")","v":0},null,2,"2023-02-22"]
[108,{"$f":"IF(A288=\"\",\"\",IFERROR(VLOOKUP(A288,CADASTRO!C:D,2,FALSE),\"Produto Não Cadastrado\"))","v":"ORELINHA TRADICIONAL"},{"$f":"IFERROR(VLOOKUP(A288,CADASTRO!C:F,3,0),\"\")","v":0},null,4,"2023-02-22"]
[172,{"$f":"IF(A289=\"\",\"\",IFERROR(VLOOKUP(A289,CADASTRO!C:D,2,FALSE),\"Produto Não Cadastrado\"))","v":"PASTEL DE BELÉM (MASSA)"},{"$f":"IFERROR(VLOOKUP(A289,CADASTRO!C:F,3,0),\"\")","v":0},null,2,"2023-02-22"]
[175,{"$f":"IF(A290=\"\",\"\",IFERROR(VLOOKUP(A290,CADASTRO!C:D,2,FALSE),\"Produto Não Cadastrado\"))","v":"PASTEL FOLHADO MISTO "},{"$f":"IFERROR(VLOOKUP(A290,CADASTRO!C:F,3,0),\"\")","v":0},null,15,"2023-02-22"]
[176,{"$f":"IF(A291=\"\",\"\",IFERROR(VLOOKUP(A291,CADASTRO!C:D,2,FALSE),\"Produto Não Cadastrado\"))","v":"PASTEL FOLHADO QUEIJO "},{"$f":"IFERROR(VLOOKUP(A291,CADASTRO!C:F,3,0),\"\")","v":0},null,15,"2023-02-22"]
[264,{"$f":"IF(A292=\"\",\"\",IFERROR(VLOOKUP(A292,CADASTRO!C:D,2,FALSE),\"Produto Não Cadastrado\"))","v":"TRANÇA FOLHADA CALABRESA"},{"$f":"IFERROR(VLOOKUP(A292,CADASTRO!C:F,3,0),\"\")","v":0},null,4,"2023-02-22"]
[266,{"$f":"IF(A293=\"\",\"\",IFERROR(VLOOKUP(A293,CADASTRO!C:D,2,FALSE),\"Produto Não Cadastrado\"))","v":"TRANÇA FOLHADA FRANGO/JAMBU"},{"$f":"IFERROR(VLOOKUP(A293,CADASTRO!C:F,3,0),\"\")","v":0},null,1,"2023-02-22"]
[267,{"$f":"IF(A294=\"\",\"\",IFERROR(VLOOKUP(A294,CADASTRO!C:D,2,FALSE),\"Produto Não Cadastrado\"))","v":"TRANÇA FOLHADA MISTA"},{"$f":"IFERROR(VLOOKUP(A294,CADASTRO!C:F,3,0),\"\")","v":0},null,4,"2023-02-22"]
[268,{"$f":"IF(A295=\"\",\"\",IFERROR(VLOOKUP(A295,CADASTRO!C:D,2,FALSE),\"Produto Não Cadastrado\"))","v":"TRANÇA FOLHADA MORTADELA DEFUMADA"},{"$f":"IFERROR(VLOOKUP(A295,CADASTRO!C:F,3,0),\"\")","v":0},null,1,"2023-02-22"]
[269,{"$f":"IF(A296=\"\",\"\",IFERROR(VLOOKUP(A296,CADASTRO!C:D,2,FALSE),\"Produto Não Cadastrado\"))","v":"TRANÇA FOLHADA PEITO DEFUMADO"},{"$f":"IFERROR(VLOOKUP(A296,CADASTRO!C:F,3,0),\"\")","v":0},null,4,"2023-02-22"]
[270,{"$f":"IF(A297=\"\",\"\",IFERROR(VLOOKUP(A297,CADASTRO!C:D,2,FALSE),\"Produto Não Cadastrado\"))","v":"TRANÇA FOLHADA PERNIL"},{"$f":"IFERROR(VLOOKUP(A297,CADASTRO!C:F,3,0),\"\")","v":0},null,2,"2023-02-22"]
[8,{"$f":"IF(A298=\"\",\"\",IFERROR(VLOOKUP(A298,CADASTRO!C:D,2,FALSE),\"Produto Não Cadastrado\"))","v":"BAGUETE INTEGRAL (PCT C/ 45 UND = 3 KG)"},{"$f":"IFERROR(VLOOKUP(A298,CADASTRO!C:F,3,0),\"\")","v":0},null,1,"2023-02-22"]
[11,{"$f":"IF(A299=\"\",\"\",IFERROR(VLOOKUP(A299,CADASTRO!C:D,2,FALSE),\"Produto Não Cadastrado\"))","v":"BISCOITO ACEBOLADO"},{"$f":"IFERROR(VLOOKUP(A299,CADASTRO!C:F,3,0),\"\")","v":0},null,1,"2023-02-22"]
[14,{"$f":"IF(A300=\"\",\"\",IFERROR(VLOOKUP(A300,CADASTRO!C:D,2,FALSE),\"Produto Não Cadastrado\"))","v":"BISCOITO COCO"},{"$f":"IFERROR(VLOOKUP(A300,CADASTRO!C:F,3,0),\"\")","v":0},null,3,"2023-02-22"]
[16,{"$f":"IF(A301=\"\",\"\",IFERROR(VLOOKUP(A301,CADASTRO!C:D,2,FALSE),\"Produto Não Cadastrado\"))","v":"BISCOITO MAISENA"},{"$f":"IFERROR(VLOOKUP(A301,CADASTRO!C:F,3,0),\"\")","v":0},null,1,"2023-02-22"]
[49,{"$f":"IF(A302=\"\",\"\",IFERROR(VLOOKUP(A302,CADASTRO!C:D,2,FALSE),\"Produto Não Cadastrado\"))","v":"DONNUTS"},{"$f":"IFERROR(VLOOKUP(A302,CADASTRO!C:F,3,0),\"\")","v":0},null,10,"2023-02-22"]
[50,{"$f":"IF(A303=\"\",\"\",IFERROR(VLOOKUP(A303,CADASTRO!C:D,2,FALSE),\"Produto Não Cadastrado\"))","v":"EMPADA BACALHAU"},{"$f":"IFERROR(VLOOKUP(A303,CADASTRO!C:F,3,0),\"\")","v":0},null,15,"2023-02-22"]
[51,{"$f":"IF(A304=\"\",\"\",IFERROR(VLOOKUP(A304,CADASTRO!C:D,2,FALSE),\"Produto Não Cadastrado\"))","v":"EMPADA FRANGO"},{"$f":"IFERROR(VLOOKUP(A304,CADASTRO!C:F,3,0),\"\")","v":0},null,15,"2023-02-22"]
[52,{"$f":"IF(A305=\"\",\"\",IFERROR(VLOOKUP(A305,CADASTRO!C:D,2,FALSE),\"Produto Não Cadastrado\"))","v":"EMPADA FRANGO/PALMITO"},{"$f":"IFERROR(VLOOKUP(A305,CADASTRO!C:F,3,0),\"\")","v":0},null,10,"2023-02-22"]
[53,{"$f":"IF(A306=\"\",\"\",IFERROR(VLOOKUP(A306,CADASTRO!C:D,2,FALSE),\"Produto Não Cadastrado\"))","v":"EMPADA PALMITO"},{"$f":"IFERROR(VLOOKUP(A306,CADASTRO!C:F,3,0),\"\")","v":0},null,6,"2023-02-22"]
[71,{"$f":"IF(A307=\"\",\"\",IFERROR(VLOOKUP(A307,CADASTRO!C:D,2,FALSE),\"Produto Não Cadastrado\"))","v":"MASSA MINI PIZZA"},{"$f":"IFERROR(VLOOKUP(A307,CADASTRO!C:F,3,0),\"\")","v":0},null,1,"2023-02-22"]
[88,{"$f":"IF(A308=\"\",\"\",IFERROR(VLOOKUP(A308,CADASTRO!C:D,2,FALSE),\"Produto Não Cadastrado\"))","v":"MINI PÃO BATATA (ERVAS,PARMESÃO)"},{"$f":"IFERROR(VLOOKUP(A308,CADASTRO!C:F,3,0),\"\")","v":0},null,192,"2023-02-22"]
[89,{"$f":"IF(A309=\"\",\"\",IFERROR(VLOOKUP(A309,CADASTRO!C:D,2,FALSE),\"Produto Não Cadastrado\"))","v":"MINI PÃO BATATA HAMBÚRGUER"},{"$f":"IFERROR(VLOOKUP(A309,CADASTRO!C:F,3,0),\"\")","v":0},null,108,"2023-02-22"]
[91,{"$f":"IF(A310=\"\",\"\",IFERROR(VLOOKUP(A310,CADASTRO!C:D,2,FALSE),\"Produto Não Cadastrado\"))","v":"MINI PÃO BRIOCHE (PCT C/ 24UND)"},{"$f":"IFERROR(VLOOKUP(A310,CADASTRO!C:F,3,0),\"\")","v":0},null,1,"2023-02-22"]
[92,{"$f":"IF(A311=\"\",\"\",IFERROR(VLOOKUP(A311,CADASTRO!C:D,2,FALSE),\"Produto Não Cadastrado\"))","v":"MINI PÃO DELÍCIA  (PCT C/ 24UND)"},{"$f":"IFERROR(VLOOKUP(A311,CADASTRO!C:F,3,0),\"\")","v":0},null,4,"2023-02-22"]
[116,{"$f":"IF(A312=\"\",\"\",IFERROR(VLOOKUP(A312,CADASTRO!C:D,2,FALSE),\"Produto Não Cadastrado\"))","v":"PÃO BAGUETE 10 HORAS"},{"$f":"IFERROR(VLOOKUP(A312,CADASTRO!C:F,3,0),\"\")","v":0},null,5,"2023-02-22"]
[121,{"$f":"IF(A313=\"\",\"\",IFERROR(VLOOKUP(A313,CADASTRO!C:D,2,FALSE),\"Produto Não Cadastrado\"))","v":"PÃO BAIÃO"},{"$f":"IFERROR(VLOOKUP(A313,CADASTRO!C:F,3,0),\"\")","v":0},null,20,"2023-02-22"]
[122,{"$f":"IF(A314=\"\",\"\",IFERROR(VLOOKUP(A314,CADASTRO!C:D,2,FALSE),\"Produto Não Cadastrado\"))","v":"PÃO BENGALA 10 HORAS"},{"$f":"IFERROR(VLOOKUP(A314,CADASTRO!C:F,3,0),\"\")","v":0},null,10,"2023-02-22"]
[123,{"$f":"IF(A315=\"\",\"\",IFERROR(VLOOKUP(A315,CADASTRO!C:D,2,FALSE),\"Produto Não Cadastrado\"))","v":"PÃO BRIOCHE DE FORMA  1000"},{"$f":"IFERROR(VLOOKUP(A315,CADASTRO!C:F,3,0),\"\")","v":0},null,5,"2023-02-22"]
[124,{"$f":"IF(A316=\"\",\"\",IFERROR(VLOOKUP(A316,CADASTRO!C:D,2,FALSE),\"Produto Não Cadastrado\"))","v":"PÃO BRIOCHE HAMBÚRGUER"},{"$f":"IFERROR(VLOOKUP(A316,CADASTRO!C:F,3,0),\"\")","v":0},null,14,"2023-02-22"]
[135,{"$f":"IF(A317=\"\",\"\",IFERROR(VLOOKUP(A317,CADASTRO!C:D,2,FALSE),\"Produto Não Cadastrado\"))","v":"PÃO DE BATATA FILÃO"},{"$f":"IFERROR(VLOOKUP(A317,CADASTRO!C:F,3,0),\"\")","v":0},null,48,"2023-02-22"]
[146,{"$f":"IF(A318=\"\",\"\",IFERROR(VLOOKUP(A318,CADASTRO!C:D,2,FALSE),\"Produto Não Cadastrado\"))","v":"PÃO DOCE LIEVITO"},{"$f":"IFERROR(VLOOKUP(A318,CADASTRO!C:F,3,0),\"\")","v":0},null,4,"2023-02-22"]
[154,{"$f":"IF(A319=\"\",\"\",IFERROR(VLOOKUP(A319,CADASTRO!C:D,2,FALSE),\"Produto Não Cadastrado\"))","v":"PÃO FORMA BRIOCHE A25"},{"$f":"IFERROR(VLOOKUP(A319,CADASTRO!C:F,3,0),\"\")","v":0},null,20,"2023-02-22"]
[155,{"$f":"IF(A320=\"\",\"\",IFERROR(VLOOKUP(A320,CADASTRO!C:D,2,FALSE),\"Produto Não Cadastrado\"))","v":"PÃO FORMA INTEGRAL 1000"},{"$f":"IFERROR(VLOOKUP(A320,CADASTRO!C:F,3,0),\"\")","v":0},null,8,"2023-02-22"]
[156,{"$f":"IF(A321=\"\",\"\",IFERROR(VLOOKUP(A321,CADASTRO!C:D,2,FALSE),\"Produto Não Cadastrado\"))","v":"PÃO FORMA INTEGRAL 700"},{"$f":"IFERROR(VLOOKUP(A321,CADASTRO!C:F,3,0),\"\")","v":0},null,5,"2023-02-22"]
[157,{"$f":"IF(A322=\"\",\"\",IFERROR(VLOOKUP(A322,CADASTRO!C:D,2,FALSE),\"Produto Não Cadastrado\"))","v":"PÃO FORMA LEITE A25"},{"$f":"IFERROR(VLOOKUP(A322,CADASTRO!C:F,3,0),\"\")","v":0},null,11,"2023-02-22"]
[158,{"$f":"IF(A323=\"\",\"\",IFERROR(VLOOKUP(A323,CADASTRO!C:D,2,FALSE),\"Produto Não Cadastrado\"))","v":"PÃO FORMA MILHO A25"},{"$f":"IFERROR(VLOOKUP(A323,CADASTRO!C:F,3,0),\"\")","v":0},null,14,"2023-02-22"]
[159,{"$f":"IF(A324=\"\",\"\",IFERROR(VLOOKUP(A324,CADASTRO!C:D,2,FALSE),\"Produto Não Cadastrado\"))","v":"PÃO FORMA TRADICIONAL 1000"},{"$f":"IFERROR(VLOOKUP(A324,CADASTRO!C:F,3,0),\"\")","v":0},null,8,"2023-02-22"]
[160,{"$f":"IF(A325=\"\",\"\",IFERROR(VLOOKUP(A325,CADASTRO!C:D,2,FALSE),\"Produto Não Cadastrado\"))","v":"PÃO FORMA TRADICIONAL 700"},{"$f":"IFERROR(VLOOKUP(A325,CADASTRO!C:F,3,0),\"\")","v":0},null,5,"2023-02-22"]
[161,{"$f":"IF(A326=\"\",\"\",IFERROR(VLOOKUP(A326,CADASTRO!C:D,2,FALSE),\"Produto Não Cadastrado\"))","v":"PÃO FRANCÊS 10H"},{"$f":"IFERROR(VLOOKUP(A326,CADASTRO!C:F,3,0),\"\")","v":0},null,30,"2023-02-22"]
[163,{"$f":"IF(A327=\"\",\"\",IFERROR(VLOOKUP(A327,CADASTRO!C:D,2,FALSE),\"Produto Não Cadastrado\"))","v":"PÃO FRANCÊS 5H"},{"$f":"IFERROR(VLOOKUP(A327,CADASTRO!C:F,3,0),\"\")","v":0},null,30,"2023-02-22"]
[167,{"$f":"IF(A328=\"\",\"\",IFERROR(VLOOKUP(A328,CADASTRO!C:D,2,FALSE),\"Produto Não Cadastrado\"))","v":"PÃO QUEIJO CALABRESA"},{"$f":"IFERROR(VLOOKUP(A328,CADASTRO!C:F,3,0),\"\")","v":0},null,4,"2023-02-22"]
[169,{"$f":"IF(A329=\"\",\"\",IFERROR(VLOOKUP(A329,CADASTRO!C:D,2,FALSE),\"Produto Não Cadastrado\"))","v":"PÃO SEMI ITALIANO"},{"$f":"IFERROR(VLOOKUP(A329,CADASTRO!C:F,3,0),\"\")","v":0},null,20,"2023-02-22"]
[170,{"$f":"IF(A330=\"\",\"\",IFERROR(VLOOKUP(A330,CADASTRO!C:D,2,FALSE),\"Produto Não Cadastrado\"))","v":"PÃO VIENNOIS"},{"$f":"IFERROR(VLOOKUP(A330,CADASTRO!C:F,3,0),\"\")","v":0},null,20,"2023-02-22"]
[181,{"$f":"IF(A331=\"\",\"\",IFERROR(VLOOKUP(A331,CADASTRO!C:D,2,FALSE),\"Produto Não Cadastrado\"))","v":"PIZZA INTEGRAL (MASSA)"},{"$f":"IFERROR(VLOOKUP(A331,CADASTRO!C:F,3,0),\"\")","v":0},null,4,"2023-02-22"]
[244,{"$f":"IF(A332=\"\",\"\",IFERROR(VLOOKUP(A332,CADASTRO!C:D,2,FALSE),\"Produto Não Cadastrado\"))","v":"ROSQUINHA DE LEITE (PCT C/ 32UND)"},{"$f":"IFERROR(VLOOKUP(A332,CADASTRO!C:F,3,0),\"\")","v":0},null,2,"2023-02-22"]
[245,{"$f":"IF(A333=\"\",\"\",IFERROR(VLOOKUP(A333,CADASTRO!C:D,2,FALSE),\"Produto Não Cadastrado\"))","v":"SALGADO ITALIANO FRANGO"},{"$f":"IFERROR(VLOOKUP(A333,CADASTRO!C:F,3,0),\"\")","v":0},null,10,"2023-02-22"]
[246,{"$f":"IF(A334=\"\",\"\",IFERROR(VLOOKUP(A334,CADASTRO!C:D,2,FALSE),\"Produto Não Cadastrado\"))","v":"SALGADO ITALIANO MIX FRIOS"},{"$f":"IFERROR(VLOOKUP(A334,CADASTRO!C:F,3,0),\"\")","v":0},null,10,"2023-02-22"]
[247,{"$f":"IF(A335=\"\",\"\",IFERROR(VLOOKUP(A335,CADASTRO!C:D,2,FALSE),\"Produto Não Cadastrado\"))","v":"SONHO"},{"$f":"IFERROR(VLOOKUP(A335,CADASTRO!C:F,3,0),\"\")","v":0},null,4,"2023-02-22"]
[273,{"$f":"IF(A336=\"\",\"\",IFERROR(VLOOKUP(A336,CADASTRO!C:D,2,FALSE),\"Produto Não Cadastrado\"))","v":"PÃO BENGALA 5 HORAS"},{"$f":"IFERROR(VLOOKUP(A336,CADASTRO!C:F,3,0),\"\")","v":0},null,5,"2023-02-22"]
[60,{"$f":"IF(A337=\"\",\"\",IFERROR(VLOOKUP(A337,CADASTRO!C:D,2,FALSE),\"Produto Não Cadastrado\"))","v":"FOCACCIA RUSTICA  CALABRESA (MASSA)"},{"$f":"IFERROR(VLOOKUP(A337,CADASTRO!C:F,3,0),\"\")","v":0},null,1,"2023-02-22"]
[61,{"$f":"IF(A338=\"\",\"\",IFERROR(VLOOKUP(A338,CADASTRO!C:D,2,FALSE),\"Produto Não Cadastrado\"))","v":"FOCACCIA TABULEIRO"},{"$f":"IFERROR(VLOOKUP(A338,CADASTRO!C:F,3,0),\"\")","v":0},null,2,"2023-02-22"]
[119,{"$f":"IF(A339=\"\",\"\",IFERROR(VLOOKUP(A339,CADASTRO!C:D,2,FALSE),\"Produto Não Cadastrado\"))","v":"PÃO BAGUETE LYON"},{"$f":"IFERROR(VLOOKUP(A339,CADASTRO!C:F,3,0),\"\")","v":0},null,50,"2023-02-22"]
[126,{"$f":"IF(A340=\"\",\"\",IFERROR(VLOOKUP(A340,CADASTRO!C:D,2,FALSE),\"Produto Não Cadastrado\"))","v":"PÃO CAMPONÊS"},{"$f":"IFERROR(VLOOKUP(A340,CADASTRO!C:F,3,0),\"\")","v":0},null,20,"2023-02-22"]
[222,{"$f":"IF(A341=\"\",\"\",IFERROR(VLOOKUP(A341,CADASTRO!C:D,2,FALSE),\"Produto Não Cadastrado\"))","v":"QUICHE 4 QUEIJOS"},{"$f":"IFERROR(VLOOKUP(A341,CADASTRO!C:F,3,0),\"\")","v":0},null,5,"2023-02-22"]
[223,{"$f":"IF(A342=\"\",\"\",IFERROR(VLOOKUP(A342,CADASTRO!C:D,2,FALSE),\"Produto Não Cadastrado\"))","v":"QUICHE ALHO PORO"},{"$f":"IFERROR(VLOOKUP(A342,CADASTRO!C:F,3,0),\"\")","v":0},null,5,"2023-02-22"]
[224,{"$f":"IF(A343=\"\",\"\",IFERROR(VLOOKUP(A343,CADASTRO!C:D,2,FALSE),\"Produto Não Cadastrado\"))","v":"QUICHE BACALHAU"},{"$f":"IFERROR(VLOOKUP(A343,CADASTRO!C:F,3,0),\"\")","v":0},null,10,"2023-02-22"]
[225,{"$f":"IF(A344=\"\",\"\",IFERROR(VLOOKUP(A344,CADASTRO!C:D,2,FALSE),\"Produto Não Cadastrado\"))","v":"QUICHE FRANGO"},{"$f":"IFERROR(VLOOKUP(A344,CADASTRO!C:F,3,0),\"\")","v":0},null,5,"2023-02-22"]
[228,{"$f":"IF(A345=\"\",\"\",IFERROR(VLOOKUP(A345,CADASTRO!C:D,2,FALSE),\"Produto Não Cadastrado\"))","v":"QUICHE MARGUERITA"},{"$f":"IFERROR(VLOOKUP(A345,CADASTRO!C:F,3,0),\"\")","v":0},null,5,"2023-02-22"]
[229,{"$f":"IF(A346=\"\",\"\",IFERROR(VLOOKUP(A346,CADASTRO!C:D,2,FALSE),\"Produto Não Cadastrado\"))","v":"QUICHE QUEIJO CUIA"},{"$f":"IFERROR(VLOOKUP(A346,CADASTRO!C:F,3,0),\"\")","v":0},null,5,"2023-02-22"]
[26,{"$f":"IF(A347=\"\",\"\",IFERROR(VLOOKUP(A347,CADASTRO!C:D,2,FALSE),\"Produto Não Cadastrado\"))","v":"CARRET"},{"$f":"IFERROR(VLOOKUP(A347,CADASTRO!C:F,3,0),\"\")","v":0},null,31,"2023-02-23"]
[28,{"$f":"IF(A348=\"\",\"\",IFERROR(VLOOKUP(A348,CADASTRO!C:D,2,FALSE),\"Produto Não Cadastrado\"))","v":"CATARINA DE BACALHAU "},{"$f":"IFERROR(VLOOKUP(A348,CADASTRO!C:F,3,0),\"\")","v":0},null,1,"2023-02-23"]
[29,{"$f":"IF(A349=\"\",\"\",IFERROR(VLOOKUP(A349,CADASTRO!C:D,2,FALSE),\"Produto Não Cadastrado\"))","v":"CATARINA DE FRANGO"},{"$f":"IFERROR(VLOOKUP(A349,CADASTRO!C:F,3,0),\"\")","v":0},null,1,"2023-02-23"]
[44,{"$f":"IF(A350=\"\",\"\",IFERROR(VLOOKUP(A350,CADASTRO!C:D,2,FALSE),\"Produto Não Cadastrado\"))","v":"DANISH CAPRESE"},{"$f":"IFERROR(VLOOKUP(A350,CADASTRO!C:F,3,0),\"\")","v":0},null,15,"2023-02-23"]
[66,{"$f":"IF(A351=\"\",\"\",IFERROR(VLOOKUP(A351,CADASTRO!C:D,2,FALSE),\"Produto Não Cadastrado\"))","v":"LASANHA FOLHADA MISTA"},{"$f":"IFERROR(VLOOKUP(A351,CADASTRO!C:F,3,0),\"\")","v":0},null,1,"2023-02-23"]
[79,{"$f":"IF(A352=\"\",\"\",IFERROR(VLOOKUP(A352,CADASTRO!C:D,2,FALSE),\"Produto Não Cadastrado\"))","v":"MINI FOLHADO CALABRESA"},{"$f":"IFERROR(VLOOKUP(A352,CADASTRO!C:F,3,0),\"\")","v":0},null,3.21,"2023-02-23"]
[94,{"$f":"IF(A353=\"\",\"\",IFERROR(VLOOKUP(A353,CADASTRO!C:D,2,FALSE),\"Produto Não Cadastrado\"))","v":"MINI TRANÇA BACALHAU"},{"$f":"IFERROR(VLOOKUP(A353,CADASTRO!C:F,3,0),\"\")","v":0},null,2,"2023-02-23"]
[95,{"$f":"IF(A354=\"\",\"\",IFERROR(VLOOKUP(A354,CADASTRO!C:D,2,FALSE),\"Produto Não Cadastrado\"))","v":"MINI TRANÇA CALABRESA"},{"$f":"IFERROR(VLOOKUP(A354,CADASTRO!C:F,3,0),\"\")","v":0},null,4,"2023-02-23"]
[97,{"$f":"IF(A355=\"\",\"\",IFERROR(VLOOKUP(A355,CADASTRO!C:D,2,FALSE),\"Produto Não Cadastrado\"))","v":"MINI TRANÇA FRANGO"},{"$f":"IFERROR(VLOOKUP(A355,CADASTRO!C:F,3,0),\"\")","v":0},null,2,"2023-02-23"]
[98,{"$f":"IF(A356=\"\",\"\",IFERROR(VLOOKUP(A356,CADASTRO!C:D,2,FALSE),\"Produto Não Cadastrado\"))","v":"MINI TRANÇA MISTA"},{"$f":"IFERROR(VLOOKUP(A356,CADASTRO!C:F,3,0),\"\")","v":0},null,4,"2023-02-23"]
[104,{"$f":"IF(A357=\"\",\"\",IFERROR(VLOOKUP(A357,CADASTRO!C:D,2,FALSE),\"Produto Não Cadastrado\"))","v":"MINI TRANÇA SALAME"},{"$f":"IFERROR(VLOOKUP(A357,CADASTRO!C:F,3,0),\"\")","v":0},null,2,"2023-02-23"]
[107,{"$f":"IF(A358=\"\",\"\",IFERROR(VLOOKUP(A358,CADASTRO!C:D,2,FALSE),\"Produto Não Cadastrado\"))","v":"ORELHINHA CANELA"},{"$f":"IFERROR(VLOOKUP(A358,CADASTRO!C:F,3,0),\"\")","v":0},null,3.67,"2023-02-23"]
[108,{"$f":"IF(A359=\"\",\"\",IFERROR(VLOOKUP(A359,CADASTRO!C:D,2,FALSE),\"Produto Não Cadastrado\"))","v":"ORELINHA TRADICIONAL"},{"$f":"IFERROR(VLOOKUP(A359,CADASTRO!C:F,3,0),\"\")","v":0},null,3.6,"2023-02-23"]
[174,{"$f":"IF(A360=\"\",\"\",IFERROR(VLOOKUP(A360,CADASTRO!C:D,2,FALSE),\"Produto Não Cadastrado\"))","v":"PASTEL FOLHADO FRANGO "},{"$f":"IFERROR(VLOOKUP(A360,CADASTRO!C:F,3,0),\"\")","v":0},null,15,"2023-02-23"]
[176,{"$f":"IF(A361=\"\",\"\",IFERROR(VLOOKUP(A361,CADASTRO!C:D,2,FALSE),\"Produto Não Cadastrado\"))","v":"PASTEL FOLHADO QUEIJO "},{"$f":"IFERROR(VLOOKUP(A361,CADASTRO!C:F,3,0),\"\")","v":0},null,18,"2023-02-23"]
[264,{"$f":"IF(A362=\"\",\"\",IFERROR(VLOOKUP(A362,CADASTRO!C:D,2,FALSE),\"Produto Não Cadastrado\"))","v":"TRANÇA FOLHADA CALABRESA"},{"$f":"IFERROR(VLOOKUP(A362,CADASTRO!C:F,3,0),\"\")","v":0},null,1,"2023-02-23"]
[266,{"$f":"IF(A363=\"\",\"\",IFERROR(VLOOKUP(A363,CADASTRO!C:D,2,FALSE),\"Produto Não Cadastrado\"))","v":"TRANÇA FOLHADA FRANGO/JAMBU"},{"$f":"IFERROR(VLOOKUP(A363,CADASTRO!C:F,3,0),\"\")","v":0},null,2,"2023-02-23"]
[267,{"$f":"IF(A364=\"\",\"\",IFERROR(VLOOKUP(A364,CADASTRO!C:D,2,FALSE),\"Produto Não Cadastrado\"))","v":"TRANÇA FOLHADA MISTA"},{"$f":"IFERROR(VLOOKUP(A364,CADASTRO!C:F,3,0),\"\")","v":0},null,3,"2023-02-23"]
[268,{"$f":"IF(A365=\"\",\"\",IFERROR(VLOOKUP(A365,CADASTRO!C:D,2,FALSE),\"Produto Não Cadastrado\"))","v":"TRANÇA FOLHADA MORTADELA DEFUMADA"},{"$f":"IFERROR(VLOOKUP(A365,CADASTRO!C:F,3,0),\"\")","v":0},null,2,"2023-02-23"]
[269,{"$f":"IF(A366=\"\",\"\",IFERROR(VLOOKUP(A366,CADASTRO!C:D,2,FALSE),\"Produto Não Cadastrado\"))","v":"TRANÇA FOLHADA PEITO DEFUMADO"},{"$f":"IFERROR(VLOOKUP(A366,CADASTRO!C:F,3,0),\"\")","v":0},null,4,"2023-02-23"]
[270,{"$f":"IF(A367=\"\",\"\",IFERROR(VLOOKUP(A367,CADASTRO!C:D,2,FALSE),\"Produto Não Cadastrado\"))","v":"TRANÇA FOLHADA PERNIL"},{"$f":"IFERROR(VLOOKUP(A367,CADASTRO!C:F,3,0),\"\")","v":0},null,4,"2023-02-23"]
[8,{"$f":"IF(A368=\"\",\"\",IFERROR(VLOOKUP(A368,CADASTRO!C:D,2,FALSE),\"Produto Não Cadastrado\"))","v":"BAGUETE INTEGRAL (PCT C/ 45 UND = 3 KG)"},{"$f":"IFERROR(VLOOKUP(A368,CADASTRO!C:F,3,0),\"\")","v":0},null,1,"2023-02-23"]
[13,{"$f":"IF(A369=\"\",\"\",IFERROR(VLOOKUP(A369,CADASTRO!C:D,2,FALSE),\"Produto Não Cadastrado\"))","v":"BISCOITO CATUPIRI"},{"$f":"IFERROR(VLOOKUP(A369,CADASTRO!C:F,3,0),\"\")","v":0},null,1,"2023-02-23"]
[19,{"$f":"IF(A370=\"\",\"\",IFERROR(VLOOKUP(A370,CADASTRO!C:D,2,FALSE),\"Produto Não Cadastrado\"))","v":"BISCOITO PAI D'ÉGUA"},{"$f":"IFERROR(VLOOKUP(A370,CADASTRO!C:F,3,0),\"\")","v":0},null,3,"2023-02-23"]
[39,{"$f":"IF(A371=\"\",\"\",IFERROR(VLOOKUP(A371,CADASTRO!C:D,2,FALSE),\"Produto Não Cadastrado\"))","v":"CROISSANT AMÊNDOAS"},{"$f":"IFERROR(VLOOKUP(A371,CADASTRO!C:F,3,0),\"\")","v":0},null,50,"2023-02-23"]
[41,{"$f":"IF(A372=\"\",\"\",IFERROR(VLOOKUP(A372,CADASTRO!C:D,2,FALSE),\"Produto Não Cadastrado\"))","v":"CROISSANT CONGELADO "},{"$f":"IFERROR(VLOOKUP(A372,CADASTRO!C:F,3,0),\"\")","v":0},null,450,"2023-02-23"]
[49,{"$f":"IF(A373=\"\",\"\",IFERROR(VLOOKUP(A373,CADASTRO!C:D,2,FALSE),\"Produto Não Cadastrado\"))","v":"DONNUTS"},{"$f":"IFERROR(VLOOKUP(A373,CADASTRO!C:F,3,0),\"\")","v":0},null,4,"2023-02-23"]
[50,{"$f":"IF(A374=\"\",\"\",IFERROR(VLOOKUP(A374,CADASTRO!C:D,2,FALSE),\"Produto Não Cadastrado\"))","v":"EMPADA BACALHAU"},{"$f":"IFERROR(VLOOKUP(A374,CADASTRO!C:F,3,0),\"\")","v":0},null,10,"2023-02-23"]
[51,{"$f":"IF(A375=\"\",\"\",IFERROR(VLOOKUP(A375,CADASTRO!C:D,2,FALSE),\"Produto Não Cadastrado\"))","v":"EMPADA FRANGO"},{"$f":"IFERROR(VLOOKUP(A375,CADASTRO!C:F,3,0),\"\")","v":0},null,10,"2023-02-23"]
[52,{"$f":"IF(A376=\"\",\"\",IFERROR(VLOOKUP(A376,CADASTRO!C:D,2,FALSE),\"Produto Não Cadastrado\"))","v":"EMPADA FRANGO/PALMITO"},{"$f":"IFERROR(VLOOKUP(A376,CADASTRO!C:F,3,0),\"\")","v":0},null,10,"2023-02-23"]
[71,{"$f":"IF(A377=\"\",\"\",IFERROR(VLOOKUP(A377,CADASTRO!C:D,2,FALSE),\"Produto Não Cadastrado\"))","v":"MASSA MINI PIZZA"},{"$f":"IFERROR(VLOOKUP(A377,CADASTRO!C:F,3,0),\"\")","v":0},null,1,"2023-02-23"]
[91,{"$f":"IF(A378=\"\",\"\",IFERROR(VLOOKUP(A378,CADASTRO!C:D,2,FALSE),\"Produto Não Cadastrado\"))","v":"MINI PÃO BRIOCHE (PCT C/ 24UND)"},{"$f":"IFERROR(VLOOKUP(A378,CADASTRO!C:F,3,0),\"\")","v":0},null,2,"2023-02-23"]
[92,{"$f":"IF(A379=\"\",\"\",IFERROR(VLOOKUP(A379,CADASTRO!C:D,2,FALSE),\"Produto Não Cadastrado\"))","v":"MINI PÃO DELÍCIA  (PCT C/ 24UND)"},{"$f":"IFERROR(VLOOKUP(A379,CADASTRO!C:F,3,0),\"\")","v":0},null,4,"2023-02-23"]
[116,{"$f":"IF(A380=\"\",\"\",IFERROR(VLOOKUP(A380,CADASTRO!C:D,2,FALSE),\"Produto Não Cadastrado\"))","v":"PÃO BAGUETE 10 HORAS"},{"$f":"IFERROR(VLOOKUP(A380,CADASTRO!C:F,3,0),\"\")","v":0},null,5,"2023-02-23"]
[121,{"$f":"IF(A381=\"\",\"\",IFERROR(VLOOKUP(A381,CADASTRO!C:D,2,FALSE),\"Produto Não Cadastrado\"))","v":"PÃO BAIÃO"},{"$f":"IFERROR(VLOOKUP(A381,CADASTRO!C:F,3,0),\"\")","v":0},null,20,"2023-02-23"]
[122,{"$f":"IF(A382=\"\",\"\",IFERROR(VLOOKUP(A382,CADASTRO!C:D,2,FALSE),\"Produto Não Cadastrado\"))","v":"PÃO BENGALA 10 HORAS"},{"$f":"IFERROR(VLOOKUP(A382,CADASTRO!C:F,3,0),\"\")","v":0},null,5,"2023-02-23"]
[123,{"$f":"IF(A383=\"\",\"\",IFERROR(VLOOKUP(A383,CADASTRO!C:D,2,FALSE),\"Produto Não Cadastrado\"))","v":"PÃO BRIOCHE DE FORMA  1000"},{"$f":"IFERROR(VLOOKUP(A383,CADASTRO!C:F,3,0),\"\")","v":0},null,5,"2023-02-23"]
[124,{"$f":"IF(A384=\"\",\"\",IFERROR(VLOOKUP(A384,CADASTRO!C:D,2,FALSE),\"Produto Não Cadastrado\"))","v":"PÃO BRIOCHE HAMBÚRGUER"},{"$f":"IFERROR(VLOOKUP(A384,CADASTRO!C:F,3,0),\"\")","v":0},null,10,"2023-02-23"]
[131,{"$f":"IF(A385=\"\",\"\",IFERROR(VLOOKUP(A385,CADASTRO!C:D,2,FALSE),\"Produto Não Cadastrado\"))","v":"PÃO CUCA DE BANANA"},{"$f":"IFERROR(VLOOKUP(A385,CADASTRO!C:F,3,0),\"\")","v":0},null,12,"2023-02-23"]
[132,{"$f":"IF(A386=\"\",\"\",IFERROR(VLOOKUP(A386,CADASTRO!C:D,2,FALSE),\"Produto Não Cadastrado\"))","v":"PÃO CUCA GOIABADA"},{"$f":"IFERROR(VLOOKUP(A386,CADASTRO!C:F,3,0),\"\")","v":0},null,12,"2023-02-23"]
[153,{"$f":"IF(A387=\"\",\"\",IFERROR(VLOOKUP(A387,CADASTRO!C:D,2,FALSE),\"Produto Não Cadastrado\"))","v":"PÃO FORMA BATATA A25"},{"$f":"IFERROR(VLOOKUP(A387,CADASTRO!C:F,3,0),\"\")","v":0},null,20,"2023-02-23"]
[154,{"$f":"IF(A388=\"\",\"\",IFERROR(VLOOKUP(A388,CADASTRO!C:D,2,FALSE),\"Produto Não Cadastrado\"))","v":"PÃO FORMA BRIOCHE A25"},{"$f":"IFERROR(VLOOKUP(A388,CADASTRO!C:F,3,0),\"\")","v":0},null,12,"2023-02-23"]
[155,{"$f":"IF(A389=\"\",\"\",IFERROR(VLOOKUP(A389,CADASTRO!C:D,2,FALSE),\"Produto Não Cadastrado\"))","v":"PÃO FORMA INTEGRAL 1000"},{"$f":"IFERROR(VLOOKUP(A389,CADASTRO!C:F,3,0),\"\")","v":0},null,8,"2023-02-23"]
[156,{"$f":"IF(A390=\"\",\"\",IFERROR(VLOOKUP(A390,CADASTRO!C:D,2,FALSE),\"Produto Não Cadastrado\"))","v":"PÃO FORMA INTEGRAL 700"},{"$f":"IFERROR(VLOOKUP(A390,CADASTRO!C:F,3,0),\"\")","v":0},null,5,"2023-02-23"]
[157,{"$f":"IF(A391=\"\",\"\",IFERROR(VLOOKUP(A391,CADASTRO!C:D,2,FALSE),\"Produto Não Cadastrado\"))","v":"PÃO FORMA LEITE A25"},{"$f":"IFERROR(VLOOKUP(A391,CADASTRO!C:F,3,0),\"\")","v":0},null,20,"2023-02-23"]
[158,{"$f":"IF(A392=\"\",\"\",IFERROR(VLOOKUP(A392,CADASTRO!C:D,2,FALSE),\"Produto Não Cadastrado\"))","v":"PÃO FORMA MILHO A25"},{"$f":"IFERROR(VLOOKUP(A392,CADASTRO!C:F,3,0),\"\")","v":0},null,12,"2023-02-23"]
[159,{"$f":"IF(A393=\"\",\"\",IFERROR(VLOOKUP(A393,CADASTRO!C:D,2,FALSE),\"Produto Não Cadastrado\"))","v":"PÃO FORMA TRADICIONAL 1000"},{"$f":"IFERROR(VLOOKUP(A393,CADASTRO!C:F,3,0),\"\")","v":0},null,8,"2023-02-23"]
[160,{"$f":"IF(A394=\"\",\"\",IFERROR(VLOOKUP(A394,CADASTRO!C:D,2,FALSE),\"Produto Não Cadastrado\"))","v":"PÃO FORMA TRADICIONAL 700"},{"$f":"IFERROR(VLOOKUP(A394,CADASTRO!C:F,3,0),\"\")","v":0},null,5,"2023-02-23"]
[161,{"$f":"IF(A395=\"\",\"\",IFERROR(VLOOKUP(A395,CADASTRO!C:D,2,FALSE),\"Produto Não Cadastrado\"))","v":"PÃO FRANCÊS 10H"},{"$f":"IFERROR(VLOOKUP(A395,CADASTRO!C:F,3,0),\"\")","v":0},null,35,"2023-02-23"]
[163,{"$f":"IF(A396=\"\",\"\",IFERROR(VLOOKUP(A396,CADASTRO!C:D,2,FALSE),\"Produto Não Cadastrado\"))","v":"PÃO FRANCÊS 5H"},{"$f":"IFERROR(VLOOKUP(A396,CADASTRO!C:F,3,0),\"\")","v":0},null,25,"2023-02-23"]
[167,{"$f":"IF(A397=\"\",\"\",IFERROR(VLOOKUP(A397,CADASTRO!C:D,2,FALSE),\"Produto Não Cadastrado\"))","v":"PÃO QUEIJO CALABRESA"},{"$f":"IFERROR(VLOOKUP(A397,CADASTRO!C:F,3,0),\"\")","v":0},null,6.5,"2023-02-23"]
[169,{"$f":"IF(A398=\"\",\"\",IFERROR(VLOOKUP(A398,CADASTRO!C:D,2,FALSE),\"Produto Não Cadastrado\"))","v":"PÃO SEMI ITALIANO"},{"$f":"IFERROR(VLOOKUP(A398,CADASTRO!C:F,3,0),\"\")","v":0},null,20,"2023-02-23"]
[170,{"$f":"IF(A399=\"\",\"\",IFERROR(VLOOKUP(A399,CADASTRO!C:D,2,FALSE),\"Produto Não Cadastrado\"))","v":"PÃO VIENNOIS"},{"$f":"IFERROR(VLOOKUP(A399,CADASTRO!C:F,3,0),\"\")","v":0},null,14,"2023-02-23"]
[244,{"$f":"IF(A400=\"\",\"\",IFERROR(VLOOKUP(A400,CADASTRO!C:D,2,FALSE),\"Produto Não Cadastrado\"))","v":"ROSQUINHA DE LEITE (PCT C/ 32UND)"},{"$f":"IFERROR(VLOOKUP(A400,CADASTRO!C:F,3,0),\"\")","v":0},null,1,"2023-02-23"]
[247,{"$f":"IF(A401=\"\",\"\",IFERROR(VLOOKUP(A401,CADASTRO!C:D,2,FALSE),\"Produto Não Cadastrado\"))","v":"SONHO"},{"$f":"IFERROR(VLOOKUP(A401,CADASTRO!C:F,3,0),\"\")","v":0},null,2,"2023-02-23"]
[273,{"$f":"IF(A402=\"\",\"\",IFERROR(VLOOKUP(A402,CADASTRO!C:D,2,FALSE),\"Produto Não Cadastrado\"))","v":"PÃO BENGALA 5 HORAS"},{"$f":"IFERROR(VLOOKUP(A402,CADASTRO!C:F,3,0),\"\")","v":0},null,5,"2023-02-23"]
[60,{"$f":"IF(A403=\"\",\"\",IFERROR(VLOOKUP(A403,CADASTRO!C:D,2,FALSE),\"Produto Não Cadastrado\"))","v":"FOCACCIA RUSTICA  CALABRESA (MASSA)"},{"$f":"IFERROR(VLOOKUP(A403,CADASTRO!C:F,3,0),\"\")","v":0},null,1,"2023-02-23"]
[119,{"$f":"IF(A404=\"\",\"\",IFERROR(VLOOKUP(A404,CADASTRO!C:D,2,FALSE),\"Produto Não Cadastrado\"))","v":"PÃO BAGUETE LYON"},{"$f":"IFERROR(VLOOKUP(A404,CADASTRO!C:F,3,0),\"\")","v":0},null,65,"2023-02-23"]
[126,{"$f":"IF(A405=\"\",\"\",IFERROR(VLOOKUP(A405,CADASTRO!C:D,2,FALSE),\"Produto Não Cadastrado\"))","v":"PÃO CAMPONÊS"},{"$f":"IFERROR(VLOOKUP(A405,CADASTRO!C:F,3,0),\"\")","v":0},null,20,"2023-02-23"]
[222,{"$f":"IF(A406=\"\",\"\",IFERROR(VLOOKUP(A406,CADASTRO!C:D,2,FALSE),\"Produto Não Cadastrado\"))","v":"QUICHE 4 QUEIJOS"},{"$f":"IFERROR(VLOOKUP(A406,CADASTRO!C:F,3,0),\"\")","v":0},null,5,"2023-02-23"]
[223,{"$f":"IF(A407=\"\",\"\",IFERROR(VLOOKUP(A407,CADASTRO!C:D,2,FALSE),\"Produto Não Cadastrado\"))","v":"QUICHE ALHO PORO"},{"$f":"IFERROR(VLOOKUP(A407,CADASTRO!C:F,3,0),\"\")","v":0},null,5,"2023-02-23"]
[225,{"$f":"IF(A408=\"\",\"\",IFERROR(VLOOKUP(A408,CADASTRO!C:D,2,FALSE),\"Produto Não Cadastrado\"))","v":"QUICHE FRANGO"},{"$f":"IFERROR(VLOOKUP(A408,CADASTRO!C:F,3,0),\"\")","v":0},null,5,"2023-02-23"]
[227,{"$f":"IF(A409=\"\",\"\",IFERROR(VLOOKUP(A409,CADASTRO!C:D,2,FALSE),\"Produto Não Cadastrado\"))","v":"QUICHE MARAJOARA"},{"$f":"IFERROR(VLOOKUP(A409,CADASTRO!C:F,3,0),\"\")","v":0},null,5,"2023-02-23"]
[228,{"$f":"IF(A410=\"\",\"\",IFERROR(VLOOKUP(A410,CADASTRO!C:D,2,FALSE),\"Produto Não Cadastrado\"))","v":"QUICHE MARGUERITA"},{"$f":"IFERROR(VLOOKUP(A410,CADASTRO!C:F,3,0),\"\")","v":0},null,5,"2023-02-23"]
[229,{"$f":"IF(A411=\"\",\"\",IFERROR(VLOOKUP(A411,CADASTRO!C:D,2,FALSE),\"Produto Não Cadastrado\"))","v":"QUICHE QUEIJO CUIA"},{"$f":"IFERROR(VLOOKUP(A411,CADASTRO!C:F,3,0),\"\")","v":0},null,5,"2023-02-23"]
[28,{"$f":"IF(A412=\"\",\"\",IFERROR(VLOOKUP(A412,CADASTRO!C:D,2,FALSE),\"Produto Não Cadastrado\"))","v":"CATARINA DE BACALHAU "},{"$f":"IFERROR(VLOOKUP(A412,CADASTRO!C:F,3,0),\"\")","v":0},null,1,"2023-02-24"]
[29,{"$f":"IF(A413=\"\",\"\",IFERROR(VLOOKUP(A413,CADASTRO!C:D,2,FALSE),\"Produto Não Cadastrado\"))","v":"CATARINA DE FRANGO"},{"$f":"IFERROR(VLOOKUP(A413,CADASTRO!C:F,3,0),\"\")","v":0},null,2,"2023-02-24"]
[44,{"$f":"IF(A414=\"\",\"\",IFERROR(VLOOKUP(A414,CADASTRO!C:D,2,FALSE),\"Produto Não Cadastrado\"))","v":"DANISH CAPRESE"},{"$f":"IFERROR(VLOOKUP(A414,CADASTRO!C:F,3,0),\"\")","v":0},null,5,"2023-02-24"]
[66,{"$f":"IF(A415=\"\",\"\",IFERROR(VLOOKUP(A415,CADASTRO!C:D,2,FALSE),\"Produto Não Cadastrado\"))","v":"LASANHA FOLHADA MISTA"},{"$f":"IFERROR(VLOOKUP(A415,CADASTRO!C:F,3,0),\"\")","v":0},null,1,"2023-02-24"]
[80,{"$f":"IF(A416=\"\",\"\",IFERROR(VLOOKUP(A416,CADASTRO!C:D,2,FALSE),\"Produto Não Cadastrado\"))","v":"MINI FOLHADO CUPUAÇU"},{"$f":"IFERROR(VLOOKUP(A416,CADASTRO!C:F,3,0),\"\")","v":0},null,3.74,"2023-02-24"]
[81,{"$f":"IF(A417=\"\",\"\",IFERROR(VLOOKUP(A417,CADASTRO!C:D,2,FALSE),\"Produto Não Cadastrado\"))","v":"MINI FOLHADO DE QUEIJO"},{"$f":"IFERROR(VLOOKUP(A417,CADASTRO!C:F,3,0),\"\")","v":0},null,3.4,"2023-02-24"]
[107,{"$f":"IF(A418=\"\",\"\",IFERROR(VLOOKUP(A418,CADASTRO!C:D,2,FALSE),\"Produto Não Cadastrado\"))","v":"ORELHINHA CANELA"},{"$f":"IFERROR(VLOOKUP(A418,CADASTRO!C:F,3,0),\"\")","v":0},null,3.62,"2023-02-24"]
[108,{"$f":"IF(A419=\"\",\"\",IFERROR(VLOOKUP(A419,CADASTRO!C:D,2,FALSE),\"Produto Não Cadastrado\"))","v":"ORELINHA TRADICIONAL"},{"$f":"IFERROR(VLOOKUP(A419,CADASTRO!C:F,3,0),\"\")","v":0},null,3.7,"2023-02-24"]
[110,{"$f":"IF(A420=\"\",\"\",IFERROR(VLOOKUP(A420,CADASTRO!C:D,2,FALSE),\"Produto Não Cadastrado\"))","v":"PALITO CANELA"},{"$f":"IFERROR(VLOOKUP(A420,CADASTRO!C:F,3,0),\"\")","v":0},null,3.64,"2023-02-24"]
[180,{"$f":"IF(A421=\"\",\"\",IFERROR(VLOOKUP(A421,CADASTRO!C:D,2,FALSE),\"Produto Não Cadastrado\"))","v":"PIZZA FOLHADA MIX FRIOS "},{"$f":"IFERROR(VLOOKUP(A421,CADASTRO!C:F,3,0),\"\")","v":0},null,10,"2023-02-24"]
[264,{"$f":"IF(A422=\"\",\"\",IFERROR(VLOOKUP(A422,CADASTRO!C:D,2,FALSE),\"Produto Não Cadastrado\"))","v":"TRANÇA FOLHADA CALABRESA"},{"$f":"IFERROR(VLOOKUP(A422,CADASTRO!C:F,3,0),\"\")","v":0},null,2,"2023-02-24"]
[267,{"$f":"IF(A423=\"\",\"\",IFERROR(VLOOKUP(A423,CADASTRO!C:D,2,FALSE),\"Produto Não Cadastrado\"))","v":"TRANÇA FOLHADA MISTA"},{"$f":"IFERROR(VLOOKUP(A423,CADASTRO!C:F,3,0),\"\")","v":0},null,2,"2023-02-24"]
[268,{"$f":"IF(A424=\"\",\"\",IFERROR(VLOOKUP(A424,CADASTRO!C:D,2,FALSE),\"Produto Não Cadastrado\"))","v":"TRANÇA FOLHADA MORTADELA DEFUMADA"},{"$f":"IFERROR(VLOOKUP(A424,CADASTRO!C:F,3,0),\"\")","v":0},null,1,"2023-02-24"]
[270,{"$f":"IF(A425=\"\",\"\",IFERROR(VLOOKUP(A425,CADASTRO!C:D,2,FALSE),\"Produto Não Cadastrado\"))","v":"TRANÇA FOLHADA PERNIL"},{"$f":"IFERROR(VLOOKUP(A425,CADASTRO!C:F,3,0),\"\")","v":0},null,1,"2023-02-24"]
[8,{"$f":"IF(A426=\"\",\"\",IFERROR(VLOOKUP(A426,CADASTRO!C:D,2,FALSE),\"Produto Não Cadastrado\"))","v":"BAGUETE INTEGRAL (PCT C/ 45 UND = 3 KG)"},{"$f":"IFERROR(VLOOKUP(A426,CADASTRO!C:F,3,0),\"\")","v":0},null,1,"2023-02-24"]
[13,{"$f":"IF(A427=\"\",\"\",IFERROR(VLOOKUP(A427,CADASTRO!C:D,2,FALSE),\"Produto Não Cadastrado\"))","v":"BISCOITO CATUPIRI"},{"$f":"IFERROR(VLOOKUP(A427,CADASTRO!C:F,3,0),\"\")","v":0},null,2,"2023-02-24"]
[14,{"$f":"IF(A428=\"\",\"\",IFERROR(VLOOKUP(A428,CADASTRO!C:D,2,FALSE),\"Produto Não Cadastrado\"))","v":"BISCOITO COCO"},{"$f":"IFERROR(VLOOKUP(A428,CADASTRO!C:F,3,0),\"\")","v":0},null,2,"2023-02-24"]
[17,{"$f":"IF(A429=\"\",\"\",IFERROR(VLOOKUP(A429,CADASTRO!C:D,2,FALSE),\"Produto Não Cadastrado\"))","v":"BISCOITO MONTEIRO LOPES"},{"$f":"IFERROR(VLOOKUP(A429,CADASTRO!C:F,3,0),\"\")","v":0},null,3,"2023-02-24"]
[39,{"$f":"IF(A430=\"\",\"\",IFERROR(VLOOKUP(A430,CADASTRO!C:D,2,FALSE),\"Produto Não Cadastrado\"))","v":"CROISSANT AMÊNDOAS"},{"$f":"IFERROR(VLOOKUP(A430,CADASTRO!C:F,3,0),\"\")","v":0},null,15,"2023-02-24"]
[41,{"$f":"IF(A431=\"\",\"\",IFERROR(VLOOKUP(A431,CADASTRO!C:D,2,FALSE),\"Produto Não Cadastrado\"))","v":"CROISSANT CONGELADO "},{"$f":"IFERROR(VLOOKUP(A431,CADASTRO!C:F,3,0),\"\")","v":0},null,400,"2023-02-24"]
[91,{"$f":"IF(A432=\"\",\"\",IFERROR(VLOOKUP(A432,CADASTRO!C:D,2,FALSE),\"Produto Não Cadastrado\"))","v":"MINI PÃO BRIOCHE (PCT C/ 24UND)"},{"$f":"IFERROR(VLOOKUP(A432,CADASTRO!C:F,3,0),\"\")","v":0},null,2,"2023-02-24"]
[92,{"$f":"IF(A433=\"\",\"\",IFERROR(VLOOKUP(A433,CADASTRO!C:D,2,FALSE),\"Produto Não Cadastrado\"))","v":"MINI PÃO DELÍCIA  (PCT C/ 24UND)"},{"$f":"IFERROR(VLOOKUP(A433,CADASTRO!C:F,3,0),\"\")","v":0},null,4,"2023-02-24"]
[116,{"$f":"IF(A434=\"\",\"\",IFERROR(VLOOKUP(A434,CADASTRO!C:D,2,FALSE),\"Produto Não Cadastrado\"))","v":"PÃO BAGUETE 10 HORAS"},{"$f":"IFERROR(VLOOKUP(A434,CADASTRO!C:F,3,0),\"\")","v":0},null,5,"2023-02-24"]
[121,{"$f":"IF(A435=\"\",\"\",IFERROR(VLOOKUP(A435,CADASTRO!C:D,2,FALSE),\"Produto Não Cadastrado\"))","v":"PÃO BAIÃO"},{"$f":"IFERROR(VLOOKUP(A435,CADASTRO!C:F,3,0),\"\")","v":0},null,20,"2023-02-24"]
[122,{"$f":"IF(A436=\"\",\"\",IFERROR(VLOOKUP(A436,CADASTRO!C:D,2,FALSE),\"Produto Não Cadastrado\"))","v":"PÃO BENGALA 10 HORAS"},{"$f":"IFERROR(VLOOKUP(A436,CADASTRO!C:F,3,0),\"\")","v":0},null,10,"2023-02-24"]
[124,{"$f":"IF(A437=\"\",\"\",IFERROR(VLOOKUP(A437,CADASTRO!C:D,2,FALSE),\"Produto Não Cadastrado\"))","v":"PÃO BRIOCHE HAMBÚRGUER"},{"$f":"IFERROR(VLOOKUP(A437,CADASTRO!C:F,3,0),\"\")","v":0},null,10,"2023-02-24"]
[154,{"$f":"IF(A438=\"\",\"\",IFERROR(VLOOKUP(A438,CADASTRO!C:D,2,FALSE),\"Produto Não Cadastrado\"))","v":"PÃO FORMA BRIOCHE A25"},{"$f":"IFERROR(VLOOKUP(A438,CADASTRO!C:F,3,0),\"\")","v":0},null,20,"2023-02-24"]
[161,{"$f":"IF(A439=\"\",\"\",IFERROR(VLOOKUP(A439,CADASTRO!C:D,2,FALSE),\"Produto Não Cadastrado\"))","v":"PÃO FRANCÊS 10H"},{"$f":"IFERROR(VLOOKUP(A439,CADASTRO!C:F,3,0),\"\")","v":0},null,35,"2023-02-24"]
[163,{"$f":"IF(A440=\"\",\"\",IFERROR(VLOOKUP(A440,CADASTRO!C:D,2,FALSE),\"Produto Não Cadastrado\"))","v":"PÃO FRANCÊS 5H"},{"$f":"IFERROR(VLOOKUP(A440,CADASTRO!C:F,3,0),\"\")","v":0},null,30,"2023-02-24"]
[167,{"$f":"IF(A441=\"\",\"\",IFERROR(VLOOKUP(A441,CADASTRO!C:D,2,FALSE),\"Produto Não Cadastrado\"))","v":"PÃO QUEIJO CALABRESA"},{"$f":"IFERROR(VLOOKUP(A441,CADASTRO!C:F,3,0),\"\")","v":0},null,5,"2023-02-24"]
[169,{"$f":"IF(A442=\"\",\"\",IFERROR(VLOOKUP(A442,CADASTRO!C:D,2,FALSE),\"Produto Não Cadastrado\"))","v":"PÃO SEMI ITALIANO"},{"$f":"IFERROR(VLOOKUP(A442,CADASTRO!C:F,3,0),\"\")","v":0},null,20,"2023-02-24"]
[170,{"$f":"IF(A443=\"\",\"\",IFERROR(VLOOKUP(A443,CADASTRO!C:D,2,FALSE),\"Produto Não Cadastrado\"))","v":"PÃO VIENNOIS"},{"$f":"IFERROR(VLOOKUP(A443,CADASTRO!C:F,3,0),\"\")","v":0},null,20,"2023-02-24"]
[181,{"$f":"IF(A444=\"\",\"\",IFERROR(VLOOKUP(A444,CADASTRO!C:D,2,FALSE),\"Produto Não Cadastrado\"))","v":"PIZZA INTEGRAL (MASSA)"},{"$f":"IFERROR(VLOOKUP(A444,CADASTRO!C:F,3,0),\"\")","v":0},null,1,"2023-02-24"]
[244,{"$f":"IF(A445=\"\",\"\",IFERROR(VLOOKUP(A445,CADASTRO!C:D,2,FALSE),\"Produto Não Cadastrado\"))","v":"ROSQUINHA DE LEITE (PCT C/ 32UND)"},{"$f":"IFERROR(VLOOKUP(A445,CADASTRO!C:F,3,0),\"\")","v":0},null,1,"2023-02-24"]
[246,{"$f":"IF(A446=\"\",\"\",IFERROR(VLOOKUP(A446,CADASTRO!C:D,2,FALSE),\"Produto Não Cadastrado\"))","v":"SALGADO ITALIANO MIX FRIOS"},{"$f":"IFERROR(VLOOKUP(A446,CADASTRO!C:F,3,0),\"\")","v":0},null,20,"2023-02-24"]
[247,{"$f":"IF(A447=\"\",\"\",IFERROR(VLOOKUP(A447,CADASTRO!C:D,2,FALSE),\"Produto Não Cadastrado\"))","v":"SONHO"},{"$f":"IFERROR(VLOOKUP(A447,CADASTRO!C:F,3,0),\"\")","v":0},null,4,"2023-02-24"]
[273,{"$f":"IF(A448=\"\",\"\",IFERROR(VLOOKUP(A448,CADASTRO!C:D,2,FALSE),\"Produto Não Cadastrado\"))","v":"PÃO BENGALA 5 HORAS"},{"$f":"IFERROR(VLOOKUP(A448,CADASTRO!C:F,3,0),\"\")","v":0},null,5,"2023-02-24"]
[60,{"$f":"IF(A449=\"\",\"\",IFERROR(VLOOKUP(A449,CADASTRO!C:D,2,FALSE),\"Produto Não Cadastrado\"))","v":"FOCACCIA RUSTICA  CALABRESA (MASSA)"},{"$f":"IFERROR(VLOOKUP(A449,CADASTRO!C:F,3,0),\"\")","v":0},null,1,"2023-02-24"]
[225,{"$f":"IF(A450=\"\",\"\",IFERROR(VLOOKUP(A450,CADASTRO!C:D,2,FALSE),\"Produto Não Cadastrado\"))","v":"QUICHE FRANGO"},{"$f":"IFERROR(VLOOKUP(A450,CADASTRO!C:F,3,0),\"\")","v":0},null,5,"2023-02-24"]
[228,{"$f":"IF(A451=\"\",\"\",IFERROR(VLOOKUP(A451,CADASTRO!C:D,2,FALSE),\"Produto Não Cadastrado\"))","v":"QUICHE MARGUERITA"},{"$f":"IFERROR(VLOOKUP(A451,CADASTRO!C:F,3,0),\"\")","v":0},null,5,"2023-02-24"]
[229,{"$f":"IF(A452=\"\",\"\",IFERROR(VLOOKUP(A452,CADASTRO!C:D,2,FALSE),\"Produto Não Cadastrado\"))","v":"QUICHE QUEIJO CUIA"},{"$f":"IFERROR(VLOOKUP(A452,CADASTRO!C:F,3,0),\"\")","v":0},null,5,"2023-02-24"]
[231,{"$f":"IF(A453=\"\",\"\",IFERROR(VLOOKUP(A453,CADASTRO!C:D,2,FALSE),\"Produto Não Cadastrado\"))","v":"QUICHE TOMATE SECO"},{"$f":"IFERROR(VLOOKUP(A453,CADASTRO!C:F,3,0),\"\")","v":0},null,5,"2023-02-24"]
[28,{"$f":"IF(A454=\"\",\"\",IFERROR(VLOOKUP(A454,CADASTRO!C:D,2,FALSE),\"Produto Não Cadastrado\"))","v":"CATARINA DE BACALHAU "},{"$f":"IFERROR(VLOOKUP(A454,CADASTRO!C:F,3,0),\"\")","v":0},null,3,"2023-02-24"]
[29,{"$f":"IF(A455=\"\",\"\",IFERROR(VLOOKUP(A455,CADASTRO!C:D,2,FALSE),\"Produto Não Cadastrado\"))","v":"CATARINA DE FRANGO"},{"$f":"IFERROR(VLOOKUP(A455,CADASTRO!C:F,3,0),\"\")","v":0},null,3,"2023-02-24"]
[8,{"$f":"IF(A456=\"\",\"\",IFERROR(VLOOKUP(A456,CADASTRO!C:D,2,FALSE),\"Produto Não Cadastrado\"))","v":"BAGUETE INTEGRAL (PCT C/ 45 UND = 3 KG)"},{"$f":"IFERROR(VLOOKUP(A456,CADASTRO!C:F,3,0),\"\")","v":0},null,1,"2023-02-24"]
[79,{"$f":"IF(A457=\"\",\"\",IFERROR(VLOOKUP(A457,CADASTRO!C:D,2,FALSE),\"Produto Não Cadastrado\"))","v":"MINI FOLHADO CALABRESA"},{"$f":"IFERROR(VLOOKUP(A457,CADASTRO!C:F,3,0),\"\")","v":0},null,3.42,"2023-02-24"]
[81,{"$f":"IF(A458=\"\",\"\",IFERROR(VLOOKUP(A458,CADASTRO!C:D,2,FALSE),\"Produto Não Cadastrado\"))","v":"MINI FOLHADO DE QUEIJO"},{"$f":"IFERROR(VLOOKUP(A458,CADASTRO!C:F,3,0),\"\")","v":0},null,2.93,"2023-02-24"]
[82,{"$f":"IF(A459=\"\",\"\",IFERROR(VLOOKUP(A459,CADASTRO!C:D,2,FALSE),\"Produto Não Cadastrado\"))","v":"MINI FOLHADO FRANGO"},{"$f":"IFERROR(VLOOKUP(A459,CADASTRO!C:F,3,0),\"\")","v":0},null,3.9,"2023-02-24"]
[84,{"$f":"IF(A460=\"\",\"\",IFERROR(VLOOKUP(A460,CADASTRO!C:D,2,FALSE),\"Produto Não Cadastrado\"))","v":"MINI FOLHADO MISTO"},{"$f":"IFERROR(VLOOKUP(A460,CADASTRO!C:F,3,0),\"\")","v":0},null,3.32,"2023-02-24"]
[93,{"$f":"IF(A461=\"\",\"\",IFERROR(VLOOKUP(A461,CADASTRO!C:D,2,FALSE),\"Produto Não Cadastrado\"))","v":"MINI PASTEL FOLHADO"},{"$f":"IFERROR(VLOOKUP(A461,CADASTRO!C:F,3,0),\"\")","v":0},null,3.65,"2023-02-24"]
[94,{"$f":"IF(A462=\"\",\"\",IFERROR(VLOOKUP(A462,CADASTRO!C:D,2,FALSE),\"Produto Não Cadastrado\"))","v":"MINI TRANÇA BACALHAU"},{"$f":"IFERROR(VLOOKUP(A462,CADASTRO!C:F,3,0),\"\")","v":0},null,2,"2023-02-24"]
[95,{"$f":"IF(A463=\"\",\"\",IFERROR(VLOOKUP(A463,CADASTRO!C:D,2,FALSE),\"Produto Não Cadastrado\"))","v":"MINI TRANÇA CALABRESA"},{"$f":"IFERROR(VLOOKUP(A463,CADASTRO!C:F,3,0),\"\")","v":0},null,2,"2023-02-24"]
[98,{"$f":"IF(A464=\"\",\"\",IFERROR(VLOOKUP(A464,CADASTRO!C:D,2,FALSE),\"Produto Não Cadastrado\"))","v":"MINI TRANÇA MISTA"},{"$f":"IFERROR(VLOOKUP(A464,CADASTRO!C:F,3,0),\"\")","v":0},null,4,"2023-02-24"]
[104,{"$f":"IF(A465=\"\",\"\",IFERROR(VLOOKUP(A465,CADASTRO!C:D,2,FALSE),\"Produto Não Cadastrado\"))","v":"MINI TRANÇA SALAME"},{"$f":"IFERROR(VLOOKUP(A465,CADASTRO!C:F,3,0),\"\")","v":0},null,2,"2023-02-24"]
[108,{"$f":"IF(A466=\"\",\"\",IFERROR(VLOOKUP(A466,CADASTRO!C:D,2,FALSE),\"Produto Não Cadastrado\"))","v":"ORELINHA TRADICIONAL"},{"$f":"IFERROR(VLOOKUP(A466,CADASTRO!C:F,3,0),\"\")","v":0},null,3.7,"2023-02-24"]
[111,{"$f":"IF(A467=\"\",\"\",IFERROR(VLOOKUP(A467,CADASTRO!C:D,2,FALSE),\"Produto Não Cadastrado\"))","v":"PALITO QUEIJO"},{"$f":"IFERROR(VLOOKUP(A467,CADASTRO!C:F,3,0),\"\")","v":0},null,3.3,"2023-02-24"]
[112,{"$f":"IF(A468=\"\",\"\",IFERROR(VLOOKUP(A468,CADASTRO!C:D,2,FALSE),\"Produto Não Cadastrado\"))","v":"PALMIER"},{"$f":"IFERROR(VLOOKUP(A468,CADASTRO!C:F,3,0),\"\")","v":0},null,10,"2023-02-24"]
[175,{"$f":"IF(A469=\"\",\"\",IFERROR(VLOOKUP(A469,CADASTRO!C:D,2,FALSE),\"Produto Não Cadastrado\"))","v":"PASTEL FOLHADO MISTO "},{"$f":"IFERROR(VLOOKUP(A469,CADASTRO!C:F,3,0),\"\")","v":0},null,33,"2023-02-24"]
[180,{"$f":"IF(A470=\"\",\"\",IFERROR(VLOOKUP(A470,CADASTRO!C:D,2,FALSE),\"Produto Não Cadastrado\"))","v":"PIZZA FOLHADA MIX FRIOS "},{"$f":"IFERROR(VLOOKUP(A470,CADASTRO!C:F,3,0),\"\")","v":0},null,15,"2023-02-24"]
[263,{"$f":"IF(A471=\"\",\"\",IFERROR(VLOOKUP(A471,CADASTRO!C:D,2,FALSE),\"Produto Não Cadastrado\"))","v":"TRANÇA FOLHADA BACALHAU"},{"$f":"IFERROR(VLOOKUP(A471,CADASTRO!C:F,3,0),\"\")","v":0},null,2,"2023-02-24"]
[264,{"$f":"IF(A472=\"\",\"\",IFERROR(VLOOKUP(A472,CADASTRO!C:D,2,FALSE),\"Produto Não Cadastrado\"))","v":"TRANÇA FOLHADA CALABRESA"},{"$f":"IFERROR(VLOOKUP(A472,CADASTRO!C:F,3,0),\"\")","v":0},null,4,"2023-02-24"]
[266,{"$f":"IF(A473=\"\",\"\",IFERROR(VLOOKUP(A473,CADASTRO!C:D,2,FALSE),\"Produto Não Cadastrado\"))","v":"TRANÇA FOLHADA FRANGO/JAMBU"},{"$f":"IFERROR(VLOOKUP(A473,CADASTRO!C:F,3,0),\"\")","v":0},null,4,"2023-02-24"]
[267,{"$f":"IF(A474=\"\",\"\",IFERROR(VLOOKUP(A474,CADASTRO!C:D,2,FALSE),\"Produto Não Cadastrado\"))","v":"TRANÇA FOLHADA MISTA"},{"$f":"IFERROR(VLOOKUP(A474,CADASTRO!C:F,3,0),\"\")","v":0},null,4,"2023-02-24"]
[268,{"$f":"IF(A475=\"\",\"\",IFERROR(VLOOKUP(A475,CADASTRO!C:D,2,FALSE),\"Produto Não Cadastrado\"))","v":"TRANÇA FOLHADA MORTADELA DEFUMADA"},{"$f":"IFERROR(VLOOKUP(A475,CADASTRO!C:F,3,0),\"\")","v":0},null,2,"2023-02-24"]
[269,{"$f":"IF(A476=\"\",\"\",IFERROR(VLOOKUP(A476,CADASTRO!C:D,2,FALSE),\"Produto Não Cadastrado\"))","v":"TRANÇA FOLHADA PEITO DEFUMADO"},{"$f":"IFERROR(VLOOKUP(A476,CADASTRO!C:F,3,0),\"\")","v":0},null,4,"2023-02-24"]
[270,{"$f":"IF(A477=\"\",\"\",IFERROR(VLOOKUP(A477,CADASTRO!C:D,2,FALSE),\"Produto Não Cadastrado\"))","v":"TRANÇA FOLHADA PERNIL"},{"$f":"IFERROR(VLOOKUP(A477,CADASTRO!C:F,3,0),\"\")","v":0},null,4,"2023-02-24"]
[17,{"$f":"IF(A478=\"\",\"\",IFERROR(VLOOKUP(A478,CADASTRO!C:D,2,FALSE),\"Produto Não Cadastrado\"))","v":"BISCOITO MONTEIRO LOPES"},{"$f":"IFERROR(VLOOKUP(A478,CADASTRO!C:F,3,0),\"\")","v":0},null,4,"2023-02-24"]
[39,{"$f":"IF(A479=\"\",\"\",IFERROR(VLOOKUP(A479,CADASTRO!C:D,2,FALSE),\"Produto Não Cadastrado\"))","v":"CROISSANT AMÊNDOAS"},{"$f":"IFERROR(VLOOKUP(A479,CADASTRO!C:F,3,0),\"\")","v":0},null,35,"2023-02-24"]
[41,{"$f":"IF(A480=\"\",\"\",IFERROR(VLOOKUP(A480,CADASTRO!C:D,2,FALSE),\"Produto Não Cadastrado\"))","v":"CROISSANT CONGELADO "},{"$f":"IFERROR(VLOOKUP(A480,CADASTRO!C:F,3,0),\"\")","v":0},null,600,"2023-02-24"]
[49,{"$f":"IF(A481=\"\",\"\",IFERROR(VLOOKUP(A481,CADASTRO!C:D,2,FALSE),\"Produto Não Cadastrado\"))","v":"DONNUTS"},{"$f":"IFERROR(VLOOKUP(A481,CADASTRO!C:F,3,0),\"\")","v":0},null,16,"2023-02-24"]
[51,{"$f":"IF(A482=\"\",\"\",IFERROR(VLOOKUP(A482,CADASTRO!C:D,2,FALSE),\"Produto Não Cadastrado\"))","v":"EMPADA FRANGO"},{"$f":"IFERROR(VLOOKUP(A482,CADASTRO!C:F,3,0),\"\")","v":0},null,16,"2023-02-24"]
[52,{"$f":"IF(A483=\"\",\"\",IFERROR(VLOOKUP(A483,CADASTRO!C:D,2,FALSE),\"Produto Não Cadastrado\"))","v":"EMPADA FRANGO/PALMITO"},{"$f":"IFERROR(VLOOKUP(A483,CADASTRO!C:F,3,0),\"\")","v":0},null,6,"2023-02-24"]
[53,{"$f":"IF(A484=\"\",\"\",IFERROR(VLOOKUP(A484,CADASTRO!C:D,2,FALSE),\"Produto Não Cadastrado\"))","v":"EMPADA PALMITO"},{"$f":"IFERROR(VLOOKUP(A484,CADASTRO!C:F,3,0),\"\")","v":0},null,11,"2023-02-24"]
[92,{"$f":"IF(A485=\"\",\"\",IFERROR(VLOOKUP(A485,CADASTRO!C:D,2,FALSE),\"Produto Não Cadastrado\"))","v":"MINI PÃO DELÍCIA  (PCT C/ 24UND)"},{"$f":"IFERROR(VLOOKUP(A485,CADASTRO!C:F,3,0),\"\")","v":0},null,1,"2023-02-24"]
[116,{"$f":"IF(A486=\"\",\"\",IFERROR(VLOOKUP(A486,CADASTRO!C:D,2,FALSE),\"Produto Não Cadastrado\"))","v":"PÃO BAGUETE 10 HORAS"},{"$f":"IFERROR(VLOOKUP(A486,CADASTRO!C:F,3,0),\"\")","v":0},null,5,"2023-02-24"]
[121,{"$f":"IF(A487=\"\",\"\",IFERROR(VLOOKUP(A487,CADASTRO!C:D,2,FALSE),\"Produto Não Cadastrado\"))","v":"PÃO BAIÃO"},{"$f":"IFERROR(VLOOKUP(A487,CADASTRO!C:F,3,0),\"\")","v":0},null,20,"2023-02-24"]
[122,{"$f":"IF(A488=\"\",\"\",IFERROR(VLOOKUP(A488,CADASTRO!C:D,2,FALSE),\"Produto Não Cadastrado\"))","v":"PÃO BENGALA 10 HORAS"},{"$f":"IFERROR(VLOOKUP(A488,CADASTRO!C:F,3,0),\"\")","v":0},null,8,"2023-02-25"]
[124,{"$f":"IF(A489=\"\",\"\",IFERROR(VLOOKUP(A489,CADASTRO!C:D,2,FALSE),\"Produto Não Cadastrado\"))","v":"PÃO BRIOCHE HAMBÚRGUER"},{"$f":"IFERROR(VLOOKUP(A489,CADASTRO!C:F,3,0),\"\")","v":0},null,10,"2023-02-25"]
[146,{"$f":"IF(A490=\"\",\"\",IFERROR(VLOOKUP(A490,CADASTRO!C:D,2,FALSE),\"Produto Não Cadastrado\"))","v":"PÃO DOCE LIEVITO"},{"$f":"IFERROR(VLOOKUP(A490,CADASTRO!C:F,3,0),\"\")","v":0},null,6,"2023-02-25"]
[153,{"$f":"IF(A491=\"\",\"\",IFERROR(VLOOKUP(A491,CADASTRO!C:D,2,FALSE),\"Produto Não Cadastrado\"))","v":"PÃO FORMA BATATA A25"},{"$f":"IFERROR(VLOOKUP(A491,CADASTRO!C:F,3,0),\"\")","v":0},null,20,"2023-02-25"]
[154,{"$f":"IF(A492=\"\",\"\",IFERROR(VLOOKUP(A492,CADASTRO!C:D,2,FALSE),\"Produto Não Cadastrado\"))","v":"PÃO FORMA BRIOCHE A25"},{"$f":"IFERROR(VLOOKUP(A492,CADASTRO!C:F,3,0),\"\")","v":0},null,10,"2023-02-25"]
[157,{"$f":"IF(A493=\"\",\"\",IFERROR(VLOOKUP(A493,CADASTRO!C:D,2,FALSE),\"Produto Não Cadastrado\"))","v":"PÃO FORMA LEITE A25"},{"$f":"IFERROR(VLOOKUP(A493,CADASTRO!C:F,3,0),\"\")","v":0},null,20,"2023-02-25"]
[158,{"$f":"IF(A494=\"\",\"\",IFERROR(VLOOKUP(A494,CADASTRO!C:D,2,FALSE),\"Produto Não Cadastrado\"))","v":"PÃO FORMA MILHO A25"},{"$f":"IFERROR(VLOOKUP(A494,CADASTRO!C:F,3,0),\"\")","v":0},null,6,"2023-02-25"]
[161,{"$f":"IF(A495=\"\",\"\",IFERROR(VLOOKUP(A495,CADASTRO!C:D,2,FALSE),\"Produto Não Cadastrado\"))","v":"PÃO FRANCÊS 10H"},{"$f":"IFERROR(VLOOKUP(A495,CADASTRO!C:F,3,0),\"\")","v":0},null,35,"2023-02-25"]
[162,{"$f":"IF(A496=\"\",\"\",IFERROR(VLOOKUP(A496,CADASTRO!C:D,2,FALSE),\"Produto Não Cadastrado\"))","v":"PÃO FRANCÊS 18H"},{"$f":"IFERROR(VLOOKUP(A496,CADASTRO!C:F,3,0),\"\")","v":0},null,35,"2023-02-25"]
[163,{"$f":"IF(A497=\"\",\"\",IFERROR(VLOOKUP(A497,CADASTRO!C:D,2,FALSE),\"Produto Não Cadastrado\"))","v":"PÃO FRANCÊS 5H"},{"$f":"IFERROR(VLOOKUP(A497,CADASTRO!C:F,3,0),\"\")","v":0},null,25,"2023-02-25"]
[167,{"$f":"IF(A498=\"\",\"\",IFERROR(VLOOKUP(A498,CADASTRO!C:D,2,FALSE),\"Produto Não Cadastrado\"))","v":"PÃO QUEIJO CALABRESA"},{"$f":"IFERROR(VLOOKUP(A498,CADASTRO!C:F,3,0),\"\")","v":0},null,3,"2023-02-25"]
[169,{"$f":"IF(A499=\"\",\"\",IFERROR(VLOOKUP(A499,CADASTRO!C:D,2,FALSE),\"Produto Não Cadastrado\"))","v":"PÃO SEMI ITALIANO"},{"$f":"IFERROR(VLOOKUP(A499,CADASTRO!C:F,3,0),\"\")","v":0},null,20,"2023-02-25"]
[170,{"$f":"IF(A500=\"\",\"\",IFERROR(VLOOKUP(A500,CADASTRO!C:D,2,FALSE),\"Produto Não Cadastrado\"))","v":"PÃO VIENNOIS"},{"$f":"IFERROR(VLOOKUP(A500,CADASTRO!C:F,3,0),\"\")","v":0},null,20,"2023-02-25"]
[244,{"$f":"IF(A501=\"\",\"\",IFERROR(VLOOKUP(A501,CADASTRO!C:D,2,FALSE),\"Produto Não Cadastrado\"))","v":"ROSQUINHA DE LEITE (PCT C/ 32UND)"},{"$f":"IFERROR(VLOOKUP(A501,CADASTRO!C:F,3,0),\"\")","v":0},null,2,"2023-02-25"]
[273,{"$f":"IF(A502=\"\",\"\",IFERROR(VLOOKUP(A502,CADASTRO!C:D,2,FALSE),\"Produto Não Cadastrado\"))","v":"PÃO BENGALA 5 HORAS"},{"$f":"IFERROR(VLOOKUP(A502,CADASTRO!C:F,3,0),\"\")","v":0},null,5,"2023-02-25"]
[60,{"$f":"IF(A503=\"\",\"\",IFERROR(VLOOKUP(A503,CADASTRO!C:D,2,FALSE),\"Produto Não Cadastrado\"))","v":"FOCACCIA RUSTICA  CALABRESA (MASSA)"},{"$f":"IFERROR(VLOOKUP(A503,CADASTRO!C:F,3,0),\"\")","v":0},null,1,"2023-02-25"]
[61,{"$f":"IF(A504=\"\",\"\",IFERROR(VLOOKUP(A504,CADASTRO!C:D,2,FALSE),\"Produto Não Cadastrado\"))","v":"FOCACCIA TABULEIRO"},{"$f":"IFERROR(VLOOKUP(A504,CADASTRO!C:F,3,0),\"\")","v":0},null,2,"2023-02-25"]
[222,{"$f":"IF(A505=\"\",\"\",IFERROR(VLOOKUP(A505,CADASTRO!C:D,2,FALSE),\"Produto Não Cadastrado\"))","v":"QUICHE 4 QUEIJOS"},{"$f":"IFERROR(VLOOKUP(A505,CADASTRO!C:F,3,0),\"\")","v":0},null,11,"2023-02-25"]
[224,{"$f":"IF(A506=\"\",\"\",IFERROR(VLOOKUP(A506,CADASTRO!C:D,2,FALSE),\"Produto Não Cadastrado\"))","v":"QUICHE BACALHAU"},{"$f":"IFERROR(VLOOKUP(A506,CADASTRO!C:F,3,0),\"\")","v":0},null,16,"2023-02-25"]
[225,{"$f":"IF(A507=\"\",\"\",IFERROR(VLOOKUP(A507,CADASTRO!C:D,2,FALSE),\"Produto Não Cadastrado\"))","v":"QUICHE FRANGO"},{"$f":"IFERROR(VLOOKUP(A507,CADASTRO!C:F,3,0),\"\")","v":0},null,5,"2023-02-25"]
[227,{"$f":"IF(A508=\"\",\"\",IFERROR(VLOOKUP(A508,CADASTRO!C:D,2,FALSE),\"Produto Não Cadastrado\"))","v":"QUICHE MARAJOARA"},{"$f":"IFERROR(VLOOKUP(A508,CADASTRO!C:F,3,0),\"\")","v":0},null,5,"2023-02-25"]
[228,{"$f":"IF(A509=\"\",\"\",IFERROR(VLOOKUP(A509,CADASTRO!C:D,2,FALSE),\"Produto Não Cadastrado\"))","v":"QUICHE MARGUERITA"},{"$f":"IFERROR(VLOOKUP(A509,CADASTRO!C:F,3,0),\"\")","v":0},null,6,"2023-02-25"]
[229,{"$f":"IF(A510=\"\",\"\",IFERROR(VLOOKUP(A510,CADASTRO!C:D,2,FALSE),\"Produto Não Cadastrado\"))","v":"QUICHE QUEIJO CUIA"},{"$f":"IFERROR(VLOOKUP(A510,CADASTRO!C:F,3,0),\"\")","v":0},null,10,"2023-02-25"]
[231,{"$f":"IF(A511=\"\",\"\",IFERROR(VLOOKUP(A511,CADASTRO!C:D,2,FALSE),\"Produto Não Cadastrado\"))","v":"QUICHE TOMATE SECO"},{"$f":"IFERROR(VLOOKUP(A511,CADASTRO!C:F,3,0),\"\")","v":0},null,9,"2023-02-25"]
[229,{"$f":"IF(A512=\"\",\"\",IFERROR(VLOOKUP(A512,CADASTRO!C:D,2,FALSE),\"Produto Não Cadastrado\"))","v":"QUICHE QUEIJO CUIA"},null,null,8,"2023-03-02"]
[227,{"$f":"IF(A513=\"\",\"\",IFERROR(VLOOKUP(A513,CADASTRO!C:D,2,FALSE),\"Produto Não Cadastrado\"))","v":"QUICHE MARAJOARA"},{"$f":"IFERROR(VLOOKUP(A513,CADASTRO!C:F,3,0),\"\")","v":0},null,7.1,"2023-03-02"]
[61,{"$f":"IF(A514=\"\",\"\",IFERROR(VLOOKUP(A514,CADASTRO!C:D,2,FALSE),\"Produto Não Cadastrado\"))","v":"FOCACCIA TABULEIRO"},{"$f":"IFERROR(VLOOKUP(A514,CADASTRO!C:F,3,0),\"\")","v":0},null,8.8000000000000007,"01/01/2022"]
[111,{"$f":"IF(A515=\"\",\"\",IFERROR(VLOOKUP(A515,CADASTRO!C:D,2,FALSE),\"Produto Não Cadastrado\"))","v":"PALITO QUEIJO"},{"$f":"IFERROR(VLOOKUP(A515,CADASTRO!C:F,3,0),\"\")","v":0},null,8.5,"2023-03-02"]
[null,{"$f":"IF(A516=\"\",\"\",IFERROR(VLOOKUP(A516,CADASTRO!C:D,2,FALSE),\"Produto Não Cadastrado\"))","v":""},{"$f":"IFERROR(VLOOKUP(A516,CADASTRO!C:F,3,0),\"\")","v":""}]
[null,{"$f":"IF(A517=\"\",\"\",IFERROR(VLOOKUP(A517,CADASTRO!C:D,2,FALSE),\"Produto Não Cadastrado\"))","v":""},{"$f":"IFERROR(VLOOKUP(A517,CADASTRO!C:F,3,0),\"\")","v":""}]
[null,{"$f":"IF(A518=\"\",\"\",IFERROR(VLOOKUP(A518,CADASTRO!C:D,2,FALSE),\"Produto Não Cadastrado\"))","v":""},{"$f":"IFERROR(VLOOKUP(A518,CADASTRO!C:F,3,0),\"\")","v":""}]
[null,{"$f":"IF(A519=\"\",\"\",IFERROR(VLOOKUP(A519,CADASTRO!C:D,2,FALSE),\"Produto Não Cadastrado\"))","v":""},{"$f":"IFERROR(VLOOKUP(A519,CADASTRO!C:F,3,0),\"\")","v":""}]
[null,{"$f":"IF(A520=\"\",\"\",IFERROR(VLOOKUP(A520,CADASTRO!C:D,2,FALSE),\"Produto Não Cadastrado\"))","v":""},{"$f":"IFERROR(VLOOKUP(A520,CADASTRO!C:F,3,0),\"\")","v":""}]
[null,{"$f":"IF(A521=\"\",\"\",IFERROR(VLOOKUP(A521,CADASTRO!C:D,2,FALSE),\"Produto Não Cadastrado\"))","v":""},{"$f":"IFERROR(VLOOKUP(A521,CADASTRO!C:F,3,0),\"\")","v":""}]
[null,{"$f":"IF(A522=\"\",\"\",IFERROR(VLOOKUP(A522,CADASTRO!C:D,2,FALSE),\"Produto Não Cadastrado\"))","v":""},{"$f":"IFERROR(VLOOKUP(A522,CADASTRO!C:F,3,0),\"\")","v":""}]
[null,{"$f":"IF(A523=\"\",\"\",IFERROR(VLOOKUP(A523,CADASTRO!C:D,2,FALSE),\"Produto Não Cadastrado\"))","v":""},{"$f":"IFERROR(VLOOKUP(A523,CADASTRO!C:F,3,0),\"\")","v":""}]
[null,{"$f":"IF(A524=\"\",\"\",IFERROR(VLOOKUP(A524,CADASTRO!C:D,2,FALSE),\"Produto Não Cadastrado\"))","v":""},{"$f":"IFERROR(VLOOKUP(A524,CADASTRO!C:F,3,0),\"\")","v":""}]
[null,{"$f":"IF(A525=\"\",\"\",IFERROR(VLOOKUP(A525,CADASTRO!C:D,2,FALSE),\"Produto Não Cadastrado\"))","v":""},{"$f":"IFERROR(VLOOKUP(A525,CADASTRO!C:F,3,0),\"\")","v":""}]
[null,{"$f":"IF(A526=\"\",\"\",IFERROR(VLOOKUP(A526,CADASTRO!C:D,2,FALSE),\"Produto Não Cadastrado\"))","v":""},{"$f":"IFERROR(VLOOKUP(A526,CADASTRO!C:F,3,0),\"\")","v":""}]
[null,{"$f":"IF(A527=\"\",\"\",IFERROR(VLOOKUP(A527,CADASTRO!C:D,2,FALSE),\"Produto Não Cadastrado\"))","v":""},{"$f":"IFERROR(VLOOKUP(A527,CADASTRO!C:F,3,0),\"\")","v":""}]
[null,{"$f":"IF(A528=\"\",\"\",IFERROR(VLOOKUP(A528,CADASTRO!C:D,2,FALSE),\"Produto Não Cadastrado\"))","v":""},{"$f":"IFERROR(VLOOKUP(A528,CADASTRO!C:F,3,0),\"\")","v":""}]
[null,{"$f":"IF(A529=\"\",\"\",IFERROR(VLOOKUP(A529,CADASTRO!C:D,2,FALSE),\"Produto Não Cadastrado\"))","v":""},{"$f":"IFERROR(VLOOKUP(A529,CADASTRO!C:F,3,0),\"\")","v":""}]
[null,{"$f":"IF(A530=\"\",\"\",IFERROR(VLOOKUP(A530,CADASTRO!C:D,2,FALSE),\"Produto Não Cadastrado\"))","v":""},{"$f":"IFERROR(VLOOKUP(A530,CADASTRO!C:F,3,0),\"\")","v":""}]
[null,{"$f":"IF(A531=\"\",\"\",IFERROR(VLOOKUP(A531,CADASTRO!C:D,2,FALSE),\"Produto Não Cadastrado\"))","v":""},{"$f":"IFERROR(VLOOKUP(A531,CADASTRO!C:F,3,0),\"\")","v":""}]
[null,{"$f":"IF(A532=\"\",\"\",IFERROR(VLOOKUP(A532,CADASTRO!C:D,2,FALSE),\"Produto Não Cadastrado\"))","v":""},{"$f":"IFERROR(VLOOKUP(A532,CADASTRO!C:F,3,0),\"\")","v":""}]
[null,{"$f":"IF(A533=\"\",\"\",IFERROR(VLOOKUP(A533,CADASTRO!C:D,2,FALSE),\"Produto Não Cadastrado\"))","v":""},{"$f":"IFERROR(VLOOKUP(A533,CADASTRO!C:F,3,0),\"\")","v":""}]
[null,{"$f":"IF(A534=\"\",\"\",IFERROR(VLOOKUP(A534,CADASTRO!C:D,2,FALSE),\"Produto Não Cadastrado\"))","v":""},{"$f":"IFERROR(VLOOKUP(A534,CADASTRO!C:F,3,0),\"\")","v":""}]
[null,{"$f":"IF(A535=\"\",\"\",IFERROR(VLOOKUP(A535,CADASTRO!C:D,2,FALSE),\"Produto Não Cadastrado\"))","v":""},{"$f":"IFERROR(VLOOKUP(A535,CADASTRO!C:F,3,0),\"\")","v":""}]

{"sheet":"ORDEM DE PRODUÇÃO","index":5,"n_rows":10,"n_cols":4,"rows_kept":10,"cut":false,"hidden":false,"merged":[]}
["Estoque Atual","Mensagem","CÓD","Descrição"]
[null,"PRODUZIR!*"]
["Estoque Atual","Mensagem","CÓD","Descrição"]
[-3.421999999999997,"PRODUZIR! -3,422 A MENOR",79,"MINI FOLHADO CALABRESA"]
[-3.9000000000000004,"PRODUZIR! -3,9 A MENOR",82,"MINI FOLHADO FRANGO"]
[-3.3200000000000003,"PRODUZIR! -3,32 A MENOR",84,"MINI FOLHADO MISTO"]
[-4.0000000000013358E-3,"PRODUZIR! -0,00400000000000134 A MENOR",93,"MINI PASTEL FOLHADO"]
[-30,"PRODUZIR! -30 A MENOR",161,"PÃO FRANCÊS 10H"]
[-35,"PRODUZIR! -35 A MENOR",162,"PÃO FRANCÊS 18H"]
[-10,"PRODUZIR! -10 A MENOR",163,"PÃO FRANCÊS 5H"]