{"text_format":"1","workbook":"xlsx","n_sheets":2,"sheets":["SI_Ind","Screw"],"not_rendered":{"charts":0,"images":0,"macros":1,"external_links":0,"defined_names":16,"comments":0,"pivot_tables":0},"unopened":[],"bounds":{"document_bytes":16777216,"sheet_cells":100000,"rows_first":2000,"rows_last":500,"rows_between":2000,"halvings":0,"cell_chars":16384,"cell_head_chars":4096},"cells_cut":0,"cells_raw":0,"read":"whole","date_system":"1900"}

{"sheet":"SI_Ind","index":0,"n_rows":493,"n_cols":26,"rows_kept":493,"cut":false,"hidden":false,"merged":[[1,11,2,13],[1,14,2,16],[1,19,2,25],[1,17,2,18]]}
[null,null,null,null,null,null,null,null,null,null,null,null,null,null,null,null,null,null,null,null,null,{"$f":"NOW()","v":"2023-06-24T08:01:47.980"}]
[null,null,null,null,null,null,null,null,null,null,null,"Supervisor de Produção",null,null,"Automatic",null,null,"PC&L",null,"Prep. Lotes"]
[]
[null,null,null,null,null,null,null,null,null,null,null,"Machine","WorkDay","Batch ID","Part Number","2023-11-05T14:38:00","# Pieces","URGENTE","Delivery Date","Op.Prep.","Prep. (Y/N)","Date/Time","Anode","Cathode","Paper","Comments"]
[{"$f":"L5&LEFT(P5,3)&B5","v":{"$error":"#REF!"}},{"$f":"IF(VLOOKUP(M5,#REF!,2,FALSE)<=#REF!+1,\"OK\",\"X\")","v":{"$error":"#REF!"}},{"$f":"IF(P5=\"start dummy operation\",0,1)","v":1},{"$f":"IF(U5=\"Y\",1,0)","v":1},{"$f":"SUM(C5:D5)","v":2},{"$f":"IF(E5>0,\"OK\",\"X2\")","v":"OK"},{"$f":"WEEKDAY(V5)&T5","v":"7"},{"$f":"L5&M5","v":"2Thursday_n-1"},{"$f":"M5&L5&U5","v":"Thursday_n-12y"},{"$f":"M5&L5&F5","v":"Thursday_n-12OK"},null,2,"Thursday_n-1",23222166,{"$f":"IFERROR(VLOOKUP(N5,#REF!,3,FALSE),\"_\")","v":"_"},{"$f":"IFERROR(VLOOKUP(N5,#REF!,7,FALSE),\"_\")","v":"_"},{"$f":"IFERROR(VLOOKUP(N5,#REF!,12,FALSE),\"_\")","v":"_"},{"$f":"IFERROR(VLOOKUP(N5,#REF!,3,FALSE),\"\")","v":""},{"$f":"IFERROR(VLOOKUP(N5,#REF!,2,FALSE),\"\")","v":""},null,"y"]
[{"$f":"L6&LEFT(P6,3)&B6","v":{"$error":"#REF!"}},{"$f":"IF(VLOOKUP(M6,#REF!,2,FALSE)<=#REF!+1,\"OK\",\"X\")","v":{"$error":"#REF!"}},{"$f":"IF(P6=\"start dummy operation\",0,1)","v":1},{"$f":"IF(U6=\"Y\",1,0)","v":1},{"$f":"SUM(C6:D6)","v":2},{"$f":"IF(E6>0,\"OK\",\"X2\")","v":"OK"},{"$f":"WEEKDAY(V6)&T6","v":"7"},{"$f":"L6&M6","v":"2Thursday_n-1"},{"$f":"M6&L6&U6","v":"Thursday_n-12y"},{"$f":"M6&L6&F6","v":"Thursday_n-12OK"},null,2,"Thursday_n-1",23222165,{"$f":"IFERROR(VLOOKUP(N6,#REF!,3,FALSE),\"_\")","v":"_"},{"$f":"IFERROR(VLOOKUP(N6,#REF!,7,FALSE),\"_\")","v":"_"},{"$f":"IFERROR(VLOOKUP(N6,#REF!,12,FALSE),\"_\")","v":"_"},{"$f":"IFERROR(VLOOKUP(N6,#REF!,3,FALSE),\"\")","v":""},{"$f":"IFERROR(VLOOKUP(N6,#REF!,2,FALSE),\"\")","v":""},null,"y"]
[{"$error":"#REF!"},{"$f":"IF(VLOOKUP(M7,#REF!,2,FALSE)<=#REF!+1,\"OK\",\"X\")","v":{"$error":"#REF!"}},1,1,2,"OK","7","2Thursday_n-1","Thursday_n-12y","Thursday_n-12OK",null,2,"Thursday_n-1",23222167,{"$f":"IFERROR(VLOOKUP(N7,#REF!,3,FALSE),\"_\")","v":"_"},{"$f":"IFERROR(VLOOKUP(N7,#REF!,7,FALSE),\"_\")","v":"_"},{"$f":"IFERROR(VLOOKUP(N7,#REF!,12,FALSE),\"_\")","v":"_"},{"$f":"IFERROR(VLOOKUP(N7,#REF!,3,FALSE),\"\")","v":""},{"$f":"IFERROR(VLOOKUP(N7,#REF!,2,FALSE),\"\")","v":""},null,"y"]
[{"$error":"#REF!"},{"$f":"IF(VLOOKUP(M8,#REF!,2,FALSE)<=#REF!+1,\"OK\",\"X\")","v":{"$error":"#REF!"}},1,1,2,"OK","7Joao Cebola","2Thursday_n-1","Thursday_n-12Y","Thursday_n-12OK",null,2,"Thursday_n-1",23212162,{"$f":"IFERROR(VLOOKUP(N8,#REF!,3,FALSE),\"_\")","v":"_"},{"$f":"IFERROR(VLOOKUP(N8,#REF!,7,FALSE),\"_\")","v":"_"},{"$f":"IFERROR(VLOOKUP(N8,#REF!,12,FALSE),\"_\")","v":"_"},{"$f":"IFERROR(VLOOKUP(N8,#REF!,3,FALSE),\"\")","v":""},{"$f":"IFERROR(VLOOKUP(N8,#REF!,2,FALSE),\"\")","v":""},"Joao Cebola","Y"]
[{"$error":"#REF!"},{"$f":"IF(VLOOKUP(M9,#REF!,2,FALSE)<=#REF!+1,\"OK\",\"X\")","v":{"$error":"#REF!"}},1,1,2,"OK","7Paulo M.","2Friday_n-1","Friday_n-12Y","Friday_n-12OK",null,2,"Friday_n-1",23232082,{"$f":"IFERROR(VLOOKUP(N9,#REF!,3,FALSE),\"_\")","v":"_"},{"$f":"IFERROR(VLOOKUP(N9,#REF!,7,FALSE),\"_\")","v":"_"},{"$f":"IFERROR(VLOOKUP(N9,#REF!,12,FALSE),\"_\")","v":"_"},{"$f":"IFERROR(VLOOKUP(N9,#REF!,3,FALSE),\"\")","v":""},{"$f":"IFERROR(VLOOKUP(N9,#REF!,2,FALSE),\"\")","v":""},"Paulo M.","Y"]
[{"$error":"#REF!"},{"$f":"IF(VLOOKUP(M10,#REF!,2,FALSE)<=#REF!+1,\"OK\",\"X\")","v":{"$error":"#REF!"}},1,1,2,"OK","7Paulo M.","2Friday_n-1","Friday_n-12Y","Friday_n-12OK",null,2,"Friday_n-1",23232083,{"$f":"IFERROR(VLOOKUP(N10,#REF!,3,FALSE),\"_\")","v":"_"},{"$f":"IFERROR(VLOOKUP(N10,#REF!,7,FALSE),\"_\")","v":"_"},{"$f":"IFERROR(VLOOKUP(N10,#REF!,12,FALSE),\"_\")","v":"_"},{"$f":"IFERROR(VLOOKUP(N10,#REF!,3,FALSE),\"\")","v":""},{"$f":"IFERROR(VLOOKUP(N10,#REF!,2,FALSE),\"\")","v":""},"Paulo M.","Y"]
[{"$error":"#REF!"},{"$f":"IF(VLOOKUP(M11,#REF!,2,FALSE)<=#REF!+1,\"OK\",\"X\")","v":{"$error":"#REF!"}},1,0,1,"OK","7Paulo M.","2Friday_n-1","Friday_n-12n","Friday_n-12OK",null,2,"Friday_n-1",23232084,{"$f":"IFERROR(VLOOKUP(N11,#REF!,3,FALSE),\"_\")","v":"_"},{"$f":"IFERROR(VLOOKUP(N11,#REF!,7,FALSE),\"_\")","v":"_"},{"$f":"IFERROR(VLOOKUP(N11,#REF!,12,FALSE),\"_\")","v":"_"},{"$f":"IFERROR(VLOOKUP(N11,#REF!,3,FALSE),\"\")","v":""},{"$f":"IFERROR(VLOOKUP(N11,#REF!,2,FALSE),\"\")","v":""},"Paulo M.","n",null,null,null,"4070D074","OK"]
[{"$error":"#REF!"},{"$f":"IF(VLOOKUP(M12,#REF!,2,FALSE)<=#REF!+1,\"OK\",\"X\")","v":{"$error":"#REF!"}},1,1,2,"OK","7Paulo M.","2Friday_n-1","Friday_n-12Y","Friday_n-12OK",null,2,"Friday_n-1",23202140,{"$f":"IFERROR(VLOOKUP(N12,#REF!,3,FALSE),\"_\")","v":"_"},{"$f":"IFERROR(VLOOKUP(N12,#REF!,7,FALSE),\"_\")","v":"_"},{"$f":"IFERROR(VLOOKUP(N12,#REF!,12,FALSE),\"_\")","v":"_"},{"$f":"IFERROR(VLOOKUP(N12,#REF!,3,FALSE),\"\")","v":""},{"$f":"IFERROR(VLOOKUP(N12,#REF!,2,FALSE),\"\")","v":""},"Paulo M.","Y"]
[{"$error":"#REF!"},{"$f":"IF(VLOOKUP(M13,#REF!,2,FALSE)<=#REF!+1,\"OK\",\"X\")","v":{"$error":"#REF!"}},1,1,2,"OK","7Paulo M.","2Friday_n-1","Friday_n-12Y","Friday_n-12OK",null,2,"Friday_n-1",23202141,{"$f":"IFERROR(VLOOKUP(N13,#REF!,3,FALSE),\"_\")","v":"_"},{"$f":"IFERROR(VLOOKUP(N13,#REF!,7,FALSE),\"_\")","v":"_"},{"$f":"IFERROR(VLOOKUP(N13,#REF!,12,FALSE),\"_\")","v":"_"},{"$f":"IFERROR(VLOOKUP(N13,#REF!,3,FALSE),\"\")","v":""},{"$f":"IFERROR(VLOOKUP(N13,#REF!,2,FALSE),\"\")","v":""},"Paulo M.","Y"]
[{"$error":"#REF!"},{"$f":"IF(VLOOKUP(M14,#REF!,2,FALSE)<=#REF!+1,\"OK\",\"X\")","v":{"$error":"#REF!"}},1,1,2,"OK","7Paulo M.","2Saturday_n-1","Saturday_n-12Y","Saturday_n-12OK",null,2,"Saturday_n-1",23202142,{"$f":"IFERROR(VLOOKUP(N14,#REF!,3,FALSE),\"_\")","v":"_"},{"$f":"IFERROR(VLOOKUP(N14,#REF!,7,FALSE),\"_\")","v":"_"},{"$f":"IFERROR(VLOOKUP(N14,#REF!,12,FALSE),\"_\")","v":"_"},{"$f":"IFERROR(VLOOKUP(N14,#REF!,3,FALSE),\"\")","v":""},{"$f":"IFERROR(VLOOKUP(N14,#REF!,2,FALSE),\"\")","v":""},"Paulo M.","Y"]
[{"$error":"#REF!"},{"$f":"IF(VLOOKUP(M15,#REF!,2,FALSE)<=#REF!+1,\"OK\",\"X\")","v":{"$error":"#REF!"}},1,1,2,"OK","7Paulo M.","2Saturday_n-1","Saturday_n-12Y","Saturday_n-12OK",null,2,"Saturday_n-1",23212169,{"$f":"IFERROR(VLOOKUP(N15,#REF!,3,FALSE),\"_\")","v":"_"},{"$f":"IFERROR(VLOOKUP(N15,#REF!,7,FALSE),\"_\")","v":"_"},{"$f":"IFERROR(VLOOKUP(N15,#REF!,12,FALSE),\"_\")","v":"_"},{"$f":"IFERROR(VLOOKUP(N15,#REF!,3,FALSE),\"\")","v":""},{"$f":"IFERROR(VLOOKUP(N15,#REF!,2,FALSE),\"\")","v":""},"Paulo M.","Y"]
[{"$error":"#REF!"},{"$f":"IF(VLOOKUP(M16,#REF!,2,FALSE)<=#REF!+1,\"OK\",\"X\")","v":{"$error":"#REF!"}},1,1,2,"OK","7Paulo M.","2Saturday_n-1","Saturday_n-12Y","Saturday_n-12OK",null,2,"Saturday_n-1",23212171,{"$f":"IFERROR(VLOOKUP(N16,#REF!,3,FALSE),\"_\")","v":"_"},{"$f":"IFERROR(VLOOKUP(N16,#REF!,7,FALSE),\"_\")","v":"_"},{"$f":"IFERROR(VLOOKUP(N16,#REF!,12,FALSE),\"_\")","v":"_"},{"$f":"IFERROR(VLOOKUP(N16,#REF!,3,FALSE),\"\")","v":""},{"$f":"IFERROR(VLOOKUP(N16,#REF!,2,FALSE),\"\")","v":""},"Paulo M.","Y"]
[{"$error":"#REF!"},{"$f":"IF(VLOOKUP(M17,#REF!,2,FALSE)<=#REF!+1,\"OK\",\"X\")","v":{"$error":"#REF!"}},1,0,1,"OK","7Wagner Ferreira","2Saturday_n-1","Saturday_n-12N","Saturday_n-12OK",null,2,"Saturday_n-1",23252010,{"$f":"IFERROR(VLOOKUP(N17,#REF!,3,FALSE),\"_\")","v":"_"},{"$f":"IFERROR(VLOOKUP(N17,#REF!,7,FALSE),\"_\")","v":"_"},{"$f":"IFERROR(VLOOKUP(N17,#REF!,12,FALSE),\"_\")","v":"_"},{"$f":"IFERROR(VLOOKUP(N17,#REF!,3,FALSE),\"\")","v":""},{"$f":"IFERROR(VLOOKUP(N17,#REF!,2,FALSE),\"\")","v":""},"Wagner Ferreira","N",null,"110HL10760089",null,"3068D098","CAP GAIN SUPERIOR A PN"]
[{"$f":"L18&LEFT(P18,3)&B18","v":{"$error":"#REF!"}},{"$f":"IF(VLOOKUP(M18,#REF!,2,FALSE)<=#REF!+1,\"OK\",\"X\")","v":{"$error":"#REF!"}},{"$f":"IF(P18=\"start dummy operation\",0,1)","v":1},{"$f":"IF(U18=\"Y\",1,0)","v":0},{"$f":"SUM(C18:D18)","v":1},{"$f":"IF(E18>0,\"OK\",\"X2\")","v":"OK"},{"$f":"WEEKDAY(V18)&T18","v":"7Wagner Ferreira"},{"$f":"L18&M18","v":"2Saturday_n-1"},{"$f":"M18&L18&U18","v":"Saturday_n-12N"},{"$f":"M18&L18&F18","v":"Saturday_n-12OK"},null,2,"Saturday_n-1",23192088,{"$f":"IFERROR(VLOOKUP(N18,#REF!,3,FALSE),\"_\")","v":"_"},{"$f":"IFERROR(VLOOKUP(N18,#REF!,7,FALSE),\"_\")","v":"_"},{"$f":"IFERROR(VLOOKUP(N18,#REF!,12,FALSE),\"_\")","v":"_"},{"$f":"IFERROR(VLOOKUP(N18,#REF!,3,FALSE),\"\")","v":""},{"$f":"IFERROR(VLOOKUP(N18,#REF!,2,FALSE),\"\")","v":""},"Wagner Ferreira","N",null,null,null,"5030L089"]
[{"$error":"#REF!"},{"$f":"IF(VLOOKUP(M19,#REF!,2,FALSE)<=#REF!+1,\"OK\",\"X\")","v":{"$error":"#REF!"}},1,0,1,"OK","7Wagner Ferreira","2Saturday_n-1","Saturday_n-12N","Saturday_n-12OK",null,2,"Saturday_n-1",23172195,{"$f":"IFERROR(VLOOKUP(N19,#REF!,3,FALSE),\"_\")","v":"_"},{"$f":"IFERROR(VLOOKUP(N19,#REF!,7,FALSE),\"_\")","v":"_"},{"$f":"IFERROR(VLOOKUP(N19,#REF!,12,FALSE),\"_\")","v":"_"},{"$f":"IFERROR(VLOOKUP(N19,#REF!,3,FALSE),\"\")","v":""},{"$f":"IFERROR(VLOOKUP(N19,#REF!,2,FALSE),\"\")","v":""},"Wagner Ferreira","N",null,null,null,"5030L089"]
[{"$error":"#REF!"},{"$f":"IF(VLOOKUP(M20,#REF!,2,FALSE)<=#REF!+1,\"OK\",\"X\")","v":{"$error":"#REF!"}},1,0,1,"OK","7Wagner Ferreira","2Saturday_n-1","Saturday_n-12N","Saturday_n-12OK",null,2,"Saturday_n-1",23252011,{"$f":"IFERROR(VLOOKUP(N20,#REF!,3,FALSE),\"_\")","v":"_"},{"$f":"IFERROR(VLOOKUP(N20,#REF!,7,FALSE),\"_\")","v":"_"},{"$f":"IFERROR(VLOOKUP(N20,#REF!,12,FALSE),\"_\")","v":"_"},{"$f":"IFERROR(VLOOKUP(N20,#REF!,3,FALSE),\"\")","v":""},{"$f":"IFERROR(VLOOKUP(N20,#REF!,2,FALSE),\"\")","v":""},"Wagner Ferreira","N",null,null,null,"5030L096"]
{"$rows_left_out":474}
{"sheet":"Screw","index":1,"n_rows":500,"n_cols":26,"rows_kept":500,"cut":false,"hidden":false,"merged":[[1,11,2,13],[1,14,2,16],[1,17,2,18],[1,19,2,25]]}
[null,null,null,null,null,null,null,null,null,null,null,null,null,null,null,null,null,null,null,null,null,{"$f":"NOW()","v":"2023-06-24T08:01:47.980"}]
[null,null,null,null,null,null,null,null,null,null,null,"Supervisor de Produção",null,null,"Automatic",null,null,"PC&L",null,"Prep. Lotes"]
[]
[null,null,null,null,null,null,null,null,null,null,null,"Machine","WorkDay","Batch ID","Part Number","2023-11-05T14:38:00","# Pieces","URGENTE","Delivery Date","Op.Prep.","Prep. (Y/N)","Date/Time","Anode","Cathode","Paper","Comments"]
[{"$f":"L5&LEFT(P5,3)&B5","v":{"$error":"#REF!"}},{"$f":"IF(VLOOKUP(M5,#REF!,2,FALSE)<=#REF!+1,\"OK\",\"X\")","v":{"$error":"#REF!"}},{"$f":"IF(P5=\"start dummy operation\",0,1)","v":1},{"$f":"IF(U5=\"Y\",1,0)","v":1},{"$f":"SUM(C5:D5)","v":2},{"$f":"IF(E5>0,\"OK\",\"X2\")","v":"OK"},{"$f":"WEEKDAY(V5)&T5","v":"7"},{"$f":"L5&M5","v":"1Thursday_n-1"},{"$f":"M5&L5&U5","v":"Thursday_n-11y"},{"$f":"M5&L5&F5","v":"Thursday_n-11OK"},null,1,"Thursday_n-1",23222126,{"$f":"IFERROR(VLOOKUP(N5,#REF!,3,FALSE),\"_\")","v":"_"},{"$f":"IFERROR(VLOOKUP(N5,#REF!,7,FALSE),\"_\")","v":"_"},{"$f":"IFERROR(VLOOKUP(N5,#REF!,12,FALSE),\"_\")","v":"_"},{"$f":"IFERROR(VLOOKUP(N5,#REF!,3,FALSE),\"\")","v":""},{"$f":"IFERROR(VLOOKUP(N5,#REF!,2,FALSE),\"\")","v":""},null,"y"]
[{"$f":"L6&LEFT(P6,3)&B6","v":{"$error":"#REF!"}},{"$f":"IF(VLOOKUP(M6,#REF!,2,FALSE)<=#REF!+1,\"OK\",\"X\")","v":{"$error":"#REF!"}},{"$f":"IF(P6=\"start dummy operation\",0,1)","v":1},{"$f":"IF(U6=\"Y\",1,0)","v":1},{"$f":"SUM(C6:D6)","v":2},{"$f":"IF(E6>0,\"OK\",\"X2\")","v":"OK"},{"$f":"WEEKDAY(V6)&T6","v":"7"},{"$f":"L6&M6","v":"1Thursday_n-1"},{"$f":"M6&L6&U6","v":"Thursday_n-11y"},{"$f":"M6&L6&F6","v":"Thursday_n-11OK"},null,1,"Thursday_n-1",23222127,{"$f":"IFERROR(VLOOKUP(N6,#REF!,3,FALSE),\"_\")","v":"_"},{"$f":"IFERROR(VLOOKUP(N6,#REF!,7,FALSE),\"_\")","v":"_"},{"$f":"IFERROR(VLOOKUP(N6,#REF!,12,FALSE),\"_\")","v":"_"},{"$f":"IFERROR(VLOOKUP(N6,#REF!,3,FALSE),\"\")","v":""},{"$f":"IFERROR(VLOOKUP(N6,#REF!,2,FALSE),\"\")","v":""},null,"y"]
[{"$error":"#REF!"},{"$f":"IF(VLOOKUP(M7,#REF!,2,FALSE)<=#REF!+1,\"OK\",\"X\")","v":{"$error":"#REF!"}},1,1,2,"OK","7","1Thursday_n-1","Thursday_n-11y","Thursday_n-11OK",null,1,"Thursday_n-1",23222128,{"$f":"IFERROR(VLOOKUP(N7,#REF!,3,FALSE),\"_\")","v":"_"},{"$f":"IFERROR(VLOOKUP(N7,#REF!,7,FALSE),\"_\")","v":"_"},{"$f":"IFERROR(VLOOKUP(N7,#REF!,12,FALSE),\"_\")","v":"_"},{"$f":"IFERROR(VLOOKUP(N7,#REF!,3,FALSE),\"\")","v":""},{"$f":"IFERROR(VLOOKUP(N7,#REF!,2,FALSE),\"\")","v":""},null,"y"]
[{"$error":"#REF!"},{"$f":"IF(VLOOKUP(M8,#REF!,2,FALSE)<=#REF!+1,\"OK\",\"X\")","v":{"$error":"#REF!"}},1,1,2,"OK","7Wagner Ferreira","1Thursday_n-1","Thursday_n-11Y","Thursday_n-11OK",null,1,"Thursday_n-1",23222114,{"$f":"IFERROR(VLOOKUP(N8,#REF!,3,FALSE),\"_\")","v":"_"},{"$f":"IFERROR(VLOOKUP(N8,#REF!,7,FALSE),\"_\")","v":"_"},{"$f":"IFERROR(VLOOKUP(N8,#REF!,12,FALSE),\"_\")","v":"_"},{"$f":"IFERROR(VLOOKUP(N8,#REF!,3,FALSE),\"\")","v":""},{"$f":"IFERROR(VLOOKUP(N8,#REF!,2,FALSE),\"\")","v":""},"Wagner Ferreira","Y"]
[{"$error":"#REF!"},{"$f":"IF(VLOOKUP(M9,#REF!,2,FALSE)<=#REF!+1,\"OK\",\"X\")","v":{"$error":"#REF!"}},1,1,2,"OK","7Francisco A.","1Friday_n-1","Friday_n-11Y","Friday_n-11OK",null,1,"Friday_n-1",23222115,{"$f":"IFERROR(VLOOKUP(N9,#REF!,3,FALSE),\"_\")","v":"_"},{"$f":"IFERROR(VLOOKUP(N9,#REF!,7,FALSE),\"_\")","v":"_"},{"$f":"IFERROR(VLOOKUP(N9,#REF!,12,FALSE),\"_\")","v":"_"},{"$f":"IFERROR(VLOOKUP(N9,#REF!,3,FALSE),\"\")","v":""},{"$f":"IFERROR(VLOOKUP(N9,#REF!,2,FALSE),\"\")","v":""},"Francisco A.","Y"]
[{"$error":"#REF!"},{"$f":"IF(VLOOKUP(M10,#REF!,2,FALSE)<=#REF!+1,\"OK\",\"X\")","v":{"$error":"#REF!"}},1,1,2,"OK","7Francisco A.","1Friday_n-1","Friday_n-11Y","Friday_n-11OK",null,1,"Friday_n-1",23222116,{"$f":"IFERROR(VLOOKUP(N10,#REF!,3,FALSE),\"_\")","v":"_"},{"$f":"IFERROR(VLOOKUP(N10,#REF!,7,FALSE),\"_\")","v":"_"},{"$f":"IFERROR(VLOOKUP(N10,#REF!,12,FALSE),\"_\")","v":"_"},{"$f":"IFERROR(VLOOKUP(N10,#REF!,3,FALSE),\"\")","v":""},{"$f":"IFERROR(VLOOKUP(N10,#REF!,2,FALSE),\"\")","v":""},"Francisco A.","Y"]
[null,null,null,1,null,null,null,null,"Friday_n-11y",null,null,1,"Friday_n-1",23172111,"A459SW602Q450AV5NC","Start Dummy Operation",49,"","",null,"y"]
[null,null,null,null,null,null,null,null,null,null,null,1,"Friday_n-1",23232030,"A390UU105M025A","Start Dummy Operation",98,"",""]
[null,null,null,null,null,null,null,null,null,null,null,1,"Saturday_n-1",23242075,"A331UV143M450AU34V","Start Dummy Operation",60,"",""]
[{"$error":"#REF!"},{"$f":"IF(VLOOKUP(M14,#REF!,2,FALSE)<=#REF!+1,\"OK\",\"X\")","v":{"$error":"#REF!"}},1,0,1,"OK","7","1Saturday_n-1","Saturday_n-11","Saturday_n-11OK",null,1,"Saturday_n-1",23232029,{"$f":"IFERROR(VLOOKUP(N14,#REF!,3,FALSE),\"_\")","v":"_"},{"$f":"IFERROR(VLOOKUP(N14,#REF!,7,FALSE),\"_\")","v":"_"},{"$f":"IFERROR(VLOOKUP(N14,#REF!,12,FALSE),\"_\")","v":"_"},{"$f":"IFERROR(VLOOKUP(N14,#REF!,3,FALSE),\"\")","v":""},{"$f":"IFERROR(VLOOKUP(N14,#REF!,2,FALSE),\"\")","v":""}]
[{"$error":"#REF!"},{"$f":"IF(VLOOKUP(M15,#REF!,2,FALSE)<=#REF!+1,\"OK\",\"X\")","v":{"$error":"#REF!"}},1,0,1,"OK","7","1Saturday_n-1","Saturday_n-11","Saturday_n-11OK",null,1,"Saturday_n-1",23242073,{"$f":"IFERROR(VLOOKUP(N15,#REF!,3,FALSE),\"_\")","v":"_"},{"$f":"IFERROR(VLOOKUP(N15,#REF!,7,FALSE),\"_\")","v":"_"},{"$f":"IFERROR(VLOOKUP(N15,#REF!,12,FALSE),\"_\")","v":"_"},{"$f":"IFERROR(VLOOKUP(N15,#REF!,3,FALSE),\"\")","v":""},{"$f":"IFERROR(VLOOKUP(N15,#REF!,2,FALSE),\"\")","v":""}]
[{"$error":"#REF!"},{"$f":"IF(VLOOKUP(M16,#REF!,2,FALSE)<=#REF!+1,\"OK\",\"X\")","v":{"$error":"#REF!"}},1,0,1,"OK","7","1Saturday_n-1","Saturday_n-11","Saturday_n-11OK",null,1,"Saturday_n-1",23242065,{"$f":"IFERROR(VLOOKUP(N16,#REF!,3,FALSE),\"_\")","v":"_"},{"$f":"IFERROR(VLOOKUP(N16,#REF!,7,FALSE),\"_\")","v":"_"},{"$f":"IFERROR(VLOOKUP(N16,#REF!,12,FALSE),\"_\")","v":"_"},{"$f":"IFERROR(VLOOKUP(N16,#REF!,3,FALSE),\"\")","v":""},{"$f":"IFERROR(VLOOKUP(N16,#REF!,2,FALSE),\"\")","v":""}]
[{"$f":"L17&LEFT(P17,3)&B17","v":{"$error":"#REF!"}},{"$f":"IF(VLOOKUP(M17,#REF!,2,FALSE)<=#REF!+1,\"OK\",\"X\")","v":{"$error":"#REF!"}},{"$f":"IF(P17=\"start dummy operation\",0,1)","v":1},{"$f":"IF(U17=\"Y\",1,0)","v":0},{"$f":"SUM(C17:D17)","v":1},{"$f":"IF(E17>0,\"OK\",\"X2\")","v":"OK"},{"$f":"WEEKDAY(V17)&T17","v":"7"},{"$f":"L17&M17","v":"1Sunday_n-1"},{"$f":"M17&L17&U17","v":"Sunday_n-11"},{"$f":"M17&L17&F17","v":"Sunday_n-11OK"},null,1,"Sunday_n-1",23242066,{"$f":"IFERROR(VLOOKUP(N17,#REF!,3,FALSE),\"_\")","v":"_"},{"$f":"IFERROR(VLOOKUP(N17,#REF!,7,FALSE),\"_\")","v":"_"},{"$f":"IFERROR(VLOOKUP(N17,#REF!,12,FALSE),\"_\")","v":"_"},{"$f":"IFERROR(VLOOKUP(N17,#REF!,3,FALSE),\"\")","v":""},{"$f":"IFERROR(VLOOKUP(N17,#REF!,2,FALSE),\"\")","v":""}]
[{"$error":"#REF!"},{"$f":"IF(VLOOKUP(M18,#REF!,2,FALSE)<=#REF!+1,\"OK\",\"X\")","v":{"$error":"#REF!"}},1,0,1,"OK","7","1Sunday_n-1","Sunday_n-11","Sunday_n-11OK",null,1,"Sunday_n-1",23202129,{"$f":"IFERROR(VLOOKUP(N18,#REF!,3,FALSE),\"_\")","v":"_"},{"$f":"IFERROR(VLOOKUP(N18,#REF!,7,FALSE),\"_\")","v":"_"},{"$f":"IFERROR(VLOOKUP(N18,#REF!,12,FALSE),\"_\")","v":"_"},{"$f":"IFERROR(VLOOKUP(N18,#REF!,3,FALSE),\"\")","v":""},{"$f":"IFERROR(VLOOKUP(N18,#REF!,2,FALSE),\"\")","v":""}]
[{"$error":"#REF!"},{"$f":"IF(VLOOKUP(M19,#REF!,2,FALSE)<=#REF!+1,\"OK\",\"X\")","v":{"$error":"#REF!"}},1,0,1,"OK","7","1Sunday_n-1","Sunday_n-11","Sunday_n-11OK",null,1,"Sunday_n-1",23242067,{"$f":"IFERROR(VLOOKUP(N19,#REF!,3,FALSE),\"_\")","v":"_"},{"$f":"IFERROR(VLOOKUP(N19,#REF!,7,FALSE),\"_\")","v":"_"},{"$f":"IFERROR(VLOOKUP(N19,#REF!,12,FALSE),\"_\")","v":"_"},{"$f":"IFERROR(VLOOKUP(N19,#REF!,3,FALSE),\"\")","v":""},{"$f":"IFERROR(VLOOKUP(N19,#REF!,2,FALSE),\"\")","v":""}]
[{"$error":"#REF!"},{"$f":"IF(VLOOKUP(M20,#REF!,2,FALSE)<=#REF!+1,\"OK\",\"X\")","v":{"$error":"#REF!"}},1,0,1,"OK","7","1Sunday_n-1","Sunday_n-11","Sunday_n-11OK",null,1,"Sunday_n-1",23242068,{"$f":"IFERROR(VLOOKUP(N20,#REF!,3,FALSE),\"_\")","v":"_"},{"$f":"IFERROR(VLOOKUP(N20,#REF!,7,FALSE),\"_\")","v":"_"},{"$f":"IFERROR(VLOOKUP(N20,#REF!,12,FALSE),\"_\")","v":"_"},{"$f":"IFERROR(VLOOKUP(N20,#REF!,3,FALSE),\"\")","v":""},{"$f":"IFERROR(VLOOKUP(N20,#REF!,2,FALSE),\"\")","v":""}]
{"$rows_left_out":480}