{"text_format":"1","workbook":"xlsx","n_sheets":10,"sheets":["Fornecedores","Nota_Fiscal","Relatório","Saída","Atividade","Unidade","Insumos","Produtos","Consulta_Estoque","Relatorio_Atividades"],"not_rendered":{"charts":0,"images":0,"macros":1,"external_links":0,"defined_names":10,"comments":0,"pivot_tables":0},"unopened":[],"bounds":{"document_bytes":16777216,"sheet_cells":100000,"rows_first":2000,"rows_last":500,"rows_between":2000,"halvings":0,"cell_chars":16384,"cell_head_chars":4096},"cells_cut":0,"cells_raw":0,"read":"row_number_cap","date_system":"1900"}

{"sheet":"Fornecedores","index":0,"n_rows":5,"n_cols":6,"rows_kept":5,"cut":false,"hidden":false,"merged":[[0,0,0,5]]}
["Cadastro de Fornecedores"]
["Nome","Endereço","Nº","Cidade","Estado","CNPJ"]
["COPASUL COOPERATIVA AGRÍCOLA","Av. Deodato leonardo da Silva",1076,"Deodapolis","MS","03.902.129/0004-26"]
["PARCERIA AGRICOLA E PECUARIA LTDA","Rua Hayel Bon Faker",950,"Dourados","MS",8013743000108]
["BIO ATUMUS DOURADOS COMERCIO","R JOAO ROSA GOES",73,"DOURADOS","MS",47896647000107]

{"sheet":"Nota_Fiscal","index":1,"n_rows":2504,"n_cols":12,"rows_kept":2504,"cut":false,"hidden":false,"merged":[[0,1,1,9]]}
[null,"CADASTRO DE NOTA FISCAL"]
[]
[null,"NOTA FISCAL","DATA DA COMPRA","FORNECEDOR","INSUMO","UN","PRODUTO","VALOR UNITÁRIO","QTD","VALOR TOTAL",null,"TIPO"]
[null,6126,"2023-08-03","COPASUL COOPERATIVA AGRÍCOLA","Defensivo Galão",{"$f":"IFERROR(VLOOKUP(E4,Insumos!A:C,2,FALSE),\"\")","v":"Lt"},"OFF ROAD",28.639199999999999,300,{"$f":"IFERROR(H4*I4,\"\")","v":8591.76},null,"herbicida"]
[null,6126,"2023-08-03","COPASUL COOPERATIVA AGRÍCOLA","Defensivo Galão",{"$f":"IFERROR(VLOOKUP(E5,Insumos!A:C,2,FALSE),\"\")","v":"Lt"},"POQUER ",34.546399999999998,240,{"$f":"IFERROR(H5*I5,\"\")","v":8291.1360000000004},null,"herbicida"]
[null,6126,"2023-08-03","COPASUL COOPERATIVA AGRÍCOLA","Defensivo Galão",{"$f":"IFERROR(VLOOKUP(E6,Insumos!A:C,2,FALSE),\"\")","v":"Lt"},"IHARA GOLD",24.773199999999999,180,4459.1759999999995,null,"óleo"]
[null,6126,"2023-08-04","COPASUL COOPERATIVA AGRÍCOLA","Defensivo Galão",{"$f":"IFERROR(VLOOKUP(E7,Insumos!A:C,2,FALSE),\"\")","v":"Lt"},"TRICLON",64.113399999999999,240,15387.216,null,"herbicida"]
[null,6123,"2023-08-03","COPASUL COOPERATIVA AGRÍCOLA","Defensivo Galão",{"$f":"IFERROR(VLOOKUP(E8,Insumos!A:C,2,FALSE),\"\")","v":"Lt"},"OFF ROAD",28.639199999999999,300,8591.76,null,"herbicida"]
[null,6123,"2023-08-03","COPASUL COOPERATIVA AGRÍCOLA","Defensivo Galão",{"$f":"IFERROR(VLOOKUP(E9,Insumos!A:C,2,FALSE),\"\")","v":"Lt"},"POQUER ",34.546399999999998,240,8291.1360000000004,null,"herbicida"]
[null,6123,"2023-08-03","COPASUL COOPERATIVA AGRÍCOLA","Defensivo Galão",{"$f":"IFERROR(VLOOKUP(E10,Insumos!A:C,2,FALSE),\"\")","v":"Lt"},"IHARA GOLD",24.773199999999999,180,4459.1759999999995,null,"óleo"]
[null,6123,"2023-08-03","COPASUL COOPERATIVA AGRÍCOLA","Defensivo Galão",{"$f":"IFERROR(VLOOKUP(E11,Insumos!A:C,2,FALSE),\"\")","v":"Lt"},"TRICLON",64.113399999999999,220,14104.948,null,"herbicida"]
[null,1856,"2023-06-07","COPASUL COOPERATIVA AGRÍCOLA","Defensivo Granulado",{"$f":"IFERROR(VLOOKUP(E12,Insumos!A:C,2,FALSE),\"\")","v":"Kg"},"STRINGER WG",29.17,180,5250.6,null,"herbicida"]
[null,1854,"2023-06-07","COPASUL COOPERATIVA AGRÍCOLA","Defensivo Granulado",{"$f":"IFERROR(VLOOKUP(E13,Insumos!A:C,2,FALSE),\"\")","v":"Kg"},"STRINGER WG",29.17,640,18668.800000000003,null,"herbicida"]
[null,1853,"2023-06-07","COPASUL COOPERATIVA AGRÍCOLA","Defensivo Granulado",{"$f":"IFERROR(VLOOKUP(E14,Insumos!A:C,2,FALSE),\"\")","v":"Kg"},"STRINGER WG",29.17,1180,34420.6,null,"herbicida"]
[null,33607,"2023-08-28","PARCERIA AGRICOLA E PECUARIA LTDA","Defensivo Galão",{"$f":"IFERROR(VLOOKUP(E15,Insumos!A:C,2,FALSE),\"\")","v":"Lt"},"CADDET BB",15,120,1800,null,"óleo"]
[null,33582,"2023-08-24","PARCERIA AGRICOLA E PECUARIA LTDA","Defensivo Galão",{"$f":"IFERROR(VLOOKUP(E16,Insumos!A:C,2,FALSE),\"\")","v":"Lt"},"SAPEK MAX 880",113,175,19775,null,"herbicida"]
[null,33582,"2023-08-24","PARCERIA AGRICOLA E PECUARIA LTDA","Defensivo Galão",{"$f":"IFERROR(VLOOKUP(E17,Insumos!A:C,2,FALSE),\"\")","v":"Lt"},"CLETODIM CCAB EC",28,360,10080,null,"herbicida"]
[null,947,"2023-08-28","BIO ATUMUS DOURADOS COMERCIO","Defensivo Galão",{"$f":"IFERROR(VLOOKUP(E18,Insumos!A:C,2,FALSE),\"\")","v":"Lt"},"ATUMUS TANDER",90,100,9000,null,"Adjuvante"]
[null,null,null,null,null,{"$f":"IFERROR(VLOOKUP(E19,Insumos!A:C,2,FALSE),\"\")","v":""},null,null,null,0]
[null,null,null,null,null,{"$f":"IFERROR(VLOOKUP(E20,Insumos!A:C,2,FALSE),\"\")","v":""},null,null,null,0]
[null,null,null,null,null,{"$f":"IFERROR(VLOOKUP(E21,Insumos!A:C,2,FALSE),\"\")","v":""},null,null,null,0]
[null,null,null,null,null,{"$f":"IFERROR(VLOOKUP(E22,Insumos!A:C,2,FALSE),\"\")","v":""},null,null,null,0]
[null,null,null,null,null,{"$f":"IFERROR(VLOOKUP(E23,Insumos!A:C,2,FALSE),\"\")","v":""},null,null,null,0]
[null,null,null,null,null,{"$f":"IFERROR(VLOOKUP(E24,Insumos!A:C,2,FALSE),\"\")","v":""},null,null,null,0]
[null,null,null,null,null,{"$f":"IFERROR(VLOOKUP(E25,Insumos!A:C,2,FALSE),\"\")","v":""},null,null,null,0]
[null,null,null,null,null,{"$f":"IFERROR(VLOOKUP(E26,Insumos!A:C,2,FALSE),\"\")","v":""},null,null,null,0]
[null,null,null,null,null,{"$f":"IFERROR(VLOOKUP(E27,Insumos!A:C,2,FALSE),\"\")","v":""},null,null,null,0]
[null,null,null,null,null,{"$f":"IFERROR(VLOOKUP(E28,Insumos!A:C,2,FALSE),\"\")","v":""},null,null,null,0]
[null,null,null,null,null,{"$f":"IFERROR(VLOOKUP(E29,Insumos!A:C,2,FALSE),\"\")","v":""},null,null,null,0]
[null,null,null,null,null,{"$f":"IFERROR(VLOOKUP(E30,Insumos!A:C,2,FALSE),\"\")","v":""},null,null,null,0]
[null,null,null,null,null,{"$f":"IFERROR(VLOOKUP(E31,Insumos!A:C,2,FALSE),\"\")","v":""},null,null,null,0]
[null,null,null,null,null,{"$f":"IFERROR(VLOOKUP(E32,Insumos!A:C,2,FALSE),\"\")","v":""},null,null,null,0]
[null,null,null,null,null,{"$f":"IFERROR(VLOOKUP(E33,Insumos!A:C,2,FALSE),\"\")","v":""},null,null,null,0]
[null,null,null,null,null,{"$f":"IFERROR(VLOOKUP(E34,Insumos!A:C,2,FALSE),\"\")","v":""},null,null,null,0]
[null,null,null,null,null,{"$f":"IFERROR(VLOOKUP(E35,Insumos!A:C,2,FALSE),\"\")","v":""},null,null,null,0]
[null,null,null,null,null,{"$f":"IFERROR(VLOOKUP(E36,Insumos!A:C,2,FALSE),\"\")","v":""},null,null,null,0]
[null,null,null,null,null,{"$f":"IFERROR(VLOOKUP(E37,Insumos!A:C,2,FALSE),\"\")","v":""},null,null,null,0]
[null,null,null,null,null,{"$f":"IFERROR(VLOOKUP(E38,Insumos!A:C,2,FALSE),\"\")","v":""},null,null,null,0]
[null,null,null,null,null,{"$f":"IFERROR(VLOOKUP(E39,Insumos!A:C,2,FALSE),\"\")","v":""},null,null,null,0]
[null,null,null,null,null,{"$f":"IFERROR(VLOOKUP(E40,Insumos!A:C,2,FALSE),\"\")","v":""},null,null,null,0]
[null,null,null,null,null,{"$f":"IFERROR(VLOOKUP(E41,Insumos!A:C,2,FALSE),\"\")","v":""},null,null,null,0]
[null,null,null,null,null,{"$f":"IFERROR(VLOOKUP(E42,Insumos!A:C,2,FALSE),\"\")","v":""},null,null,null,0]
[null,null,null,null,null,{"$f":"IFERROR(VLOOKUP(E43,Insumos!A:C,2,FALSE),\"\")","v":""},null,null,null,0]
[null,null,null,null,null,{"$f":"IFERROR(VLOOKUP(E44,Insumos!A:C,2,FALSE),\"\")","v":""},null,null,null,0]
[null,null,null,null,null,{"$f":"IFERROR(VLOOKUP(E45,Insumos!A:C,2,FALSE),\"\")","v":""},null,null,null,0]
[null,null,null,null,null,{"$f":"IFERROR(VLOOKUP(E46,Insumos!A:C,2,FALSE),\"\")","v":""},null,null,null,0]
[null,null,null,null,null,{"$f":"IFERROR(VLOOKUP(E47,Insumos!A:C,2,FALSE),\"\")","v":""},null,null,null,0]
[null,null,null,null,null,{"$f":"IFERROR(VLOOKUP(E48,Insumos!A:C,2,FALSE),\"\")","v":""},null,null,null,0]
[null,null,null,null,null,{"$f":"IFERROR(VLOOKUP(E49,Insumos!A:C,2,FALSE),\"\")","v":""},null,null,null,0]
[null,null,null,null,null,{"$f":"IFERROR(VLOOKUP(E50,Insumos!A:C,2,FALSE),\"\")","v":""},null,null,null,0]
[null,null,null,null,null,{"$f":"IFERROR(VLOOKUP(E51,Insumos!A:C,2,FALSE),\"\")","v":""},null,null,null,0]
[null,null,null,null,null,{"$f":"IFERROR(VLOOKUP(E52,Insumos!A:C,2,FALSE),\"\")","v":""},null,null,null,0]
[null,null,null,null,null,{"$f":"IFERROR(VLOOKUP(E53,Insumos!A:C,2,FALSE),\"\")","v":""},null,null,null,0]
[null,null,null,null,null,{"$f":"IFERROR(VLOOKUP(E54,Insumos!A:C,2,FALSE),\"\")","v":""},null,null,null,0]
[null,null,null,null,null,{"$f":"IFERROR(VLOOKUP(E55,Insumos!A:C,2,FALSE),\"\")","v":""},null,null,null,0]
[null,null,null,null,null,{"$f":"IFERROR(VLOOKUP(E56,Insumos!A:C,2,FALSE),\"\")","v":""},null,null,null,0]
[null,null,null,null,null,{"$f":"IFERROR(VLOOKUP(E57,Insumos!A:C,2,FALSE),\"\")","v":""},null,null,null,0]
[null,null,null,null,null,{"$f":"IFERROR(VLOOKUP(E58,Insumos!A:C,2,FALSE),\"\")","v":""},null,null,null,0]
[null,null,null,null,null,{"$f":"IFERROR(VLOOKUP(E59,Insumos!A:C,2,FALSE),\"\")","v":""},null,null,null,0]
[null,null,null,null,null,{"$f":"IFERROR(VLOOKUP(E60,Insumos!A:C,2,FALSE),\"\")","v":""},null,null,null,0]
[null,null,null,null,null,{"$f":"IFERROR(VLOOKUP(E61,Insumos!A:C,2,FALSE),\"\")","v":""},null,null,null,0]
[null,null,null,null,null,{"$f":"IFERROR(VLOOKUP(E62,Insumos!A:C,2,FALSE),\"\")","v":""},null,null,null,0]
[null,null,null,null,null,{"$f":"IFERROR(VLOOKUP(E63,Insumos!A:C,2,FALSE),\"\")","v":""},null,null,null,0]
[null,null,null,null,null,{"$f":"IFERROR(VLOOKUP(E64,Insumos!A:C,2,FALSE),\"\")","v":""},null,null,null,0]
[null,null,null,null,null,{"$f":"IFERROR(VLOOKUP(E65,Insumos!A:C,2,FALSE),\"\")","v":""},null,null,null,0]
[null,null,null,null,null,{"$f":"IFERROR(VLOOKUP(E66,Insumos!A:C,2,FALSE),\"\")","v":""},null,null,null,0]
[null,null,null,null,null,{"$f":"IFERROR(VLOOKUP(E67,Insumos!A:C,2,FALSE),\"\")","v":""},null,null,null,0]
[null,null,null,null,null,{"$f":"IFERROR(VLOOKUP(E68,Insumos!A:C,2,FALSE),\"\")","v":""},null,null,null,0]
[null,null,null,null,null,{"$f":"IFERROR(VLOOKUP(E69,Insumos!A:C,2,FALSE),\"\")","v":""},null,null,null,{"$f":"IFERROR(H69*I69,\"\")","v":0}]
[null,null,null,null,null,{"$f":"IFERROR(VLOOKUP(E70,Insumos!A:C,2,FALSE),\"\")","v":""},null,null,null,0]
[null,null,null,null,null,{"$f":"IFERROR(VLOOKUP(E71,Insumos!A:C,2,FALSE),\"\")","v":""},null,null,null,0]
[null,null,null,null,null,{"$f":"IFERROR(VLOOKUP(E72,Insumos!A:C,2,FALSE),\"\")","v":""},null,null,null,0]
[null,null,null,null,null,{"$f":"IFERROR(VLOOKUP(E73,Insumos!A:C,2,FALSE),\"\")","v":""},null,null,null,0]
[null,null,null,null,null,{"$f":"IFERROR(VLOOKUP(E74,Insumos!A:C,2,FALSE),\"\")","v":""},null,null,null,0]
[null,null,null,null,null,{"$f":"IFERROR(VLOOKUP(E75,Insumos!A:C,2,FALSE),\"\")","v":""},null,null,null,0]
[null,null,null,null,null,{"$f":"IFERROR(VLOOKUP(E76,Insumos!A:C,2,FALSE),\"\")","v":""},null,null,null,0]
[null,null,null,null,null,{"$f":"IFERROR(VLOOKUP(E77,Insumos!A:C,2,FALSE),\"\")","v":""},null,null,null,0]
[null,null,null,null,null,{"$f":"IFERROR(VLOOKUP(E78,Insumos!A:C,2,FALSE),\"\")","v":""},null,null,null,0]
[null,null,null,null,null,{"$f":"IFERROR(VLOOKUP(E79,Insumos!A:C,2,FALSE),\"\")","v":""},null,null,null,0]
[null,null,null,null,null,{"$f":"IFERROR(VLOOKUP(E80,Insumos!A:C,2,FALSE),\"\")","v":""},null,null,null,0]
[null,null,null,null,null,{"$f":"IFERROR(VLOOKUP(E81,Insumos!A:C,2,FALSE),\"\")","v":""},null,null,null,0]
[null,null,null,null,null,{"$f":"IFERROR(VLOOKUP(E82,Insumos!A:C,2,FALSE),\"\")","v":""},null,null,null,0]
[null,null,null,null,null,{"$f":"IFERROR(VLOOKUP(E83,Insumos!A:C,2,FALSE),\"\")","v":""},null,null,null,0]
[null,null,null,null,null,{"$f":"IFERROR(VLOOKUP(E84,Insumos!A:C,2,FALSE),\"\")","v":""},null,null,null,0]
[null,null,null,null,null,{"$f":"IFERROR(VLOOKUP(E85,Insumos!A:C,2,FALSE),\"\")","v":""},null,null,null,0]
[null,null,null,null,null,{"$f":"IFERROR(VLOOKUP(E86,Insumos!A:C,2,FALSE),\"\")","v":""},null,null,null,0]
[null,null,null,null,null,{"$f":"IFERROR(VLOOKUP(E87,Insumos!A:C,2,FALSE),\"\")","v":""},null,null,null,0]
[null,null,null,null,null,{"$f":"IFERROR(VLOOKUP(E88,Insumos!A:C,2,FALSE),\"\")","v":""},null,null,null,0]
[null,null,null,null,null,{"$f":"IFERROR(VLOOKUP(E89,Insumos!A:C,2,FALSE),\"\")","v":""},null,null,null,0]
[null,null,null,null,null,{"$f":"IFERROR(VLOOKUP(E90,Insumos!A:C,2,FALSE),\"\")","v":""},null,null,null,0]
[null,null,null,null,null,{"$f":"IFERROR(VLOOKUP(E91,Insumos!A:C,2,FALSE),\"\")","v":""},null,null,null,0]
[null,null,null,null,null,{"$f":"IFERROR(VLOOKUP(E92,Insumos!A:C,2,FALSE),\"\")","v":""},null,null,null,0]
[null,null,null,null,null,{"$f":"IFERROR(VLOOKUP(E93,Insumos!A:C,2,FALSE),\"\")","v":""},null,null,null,0]
[null,null,null,null,null,{"$f":"IFERROR(VLOOKUP(E94,Insumos!A:C,2,FALSE),\"\")","v":""},null,null,null,0]
[null,null,null,null,null,{"$f":"IFERROR(VLOOKUP(E95,Insumos!A:C,2,FALSE),\"\")","v":""},null,null,null,0]
[null,null,null,null,null,{"$f":"IFERROR(VLOOKUP(E96,Insumos!A:C,2,FALSE),\"\")","v":""},null,null,null,0]
[null,null,null,null,null,{"$f":"IFERROR(VLOOKUP(E97,Insumos!A:C,2,FALSE),\"\")","v":""},null,null,null,0]
[null,null,null,null,null,{"$f":"IFERROR(VLOOKUP(E98,Insumos!A:C,2,FALSE),\"\")","v":""},null,null,null,0]
[null,null,null,null,null,{"$f":"IFERROR(VLOOKUP(E99,Insumos!A:C,2,FALSE),\"\")","v":""},null,null,null,0]
[null,null,null,null,null,{"$f":"IFERROR(VLOOKUP(E100,Insumos!A:C,2,FALSE),\"\")","v":""},null,null,null,0]
[null,null,null,null,null,{"$f":"IFERROR(VLOOKUP(E101,Insumos!A:C,2,FALSE),\"\")","v":""},null,null,null,0]
[null,null,null,null,null,{"$f":"IFERROR(VLOOKUP(E102,Insumos!A:C,2,FALSE),\"\")","v":""},null,null,null,0]
[null,null,null,null,null,{"$f":"IFERROR(VLOOKUP(E103,Insumos!A:C,2,FALSE),\"\")","v":""},null,null,null,0]
[null,null,null,null,null,{"$f":"IFERROR(VLOOKUP(E104,Insumos!A:C,2,FALSE),\"\")","v":""},null,null,null,0]
[null,null,null,null,null,{"$f":"IFERROR(VLOOKUP(E105,Insumos!A:C,2,FALSE),\"\")","v":""},null,null,null,0]
[null,null,null,null,null,{"$f":"IFERROR(VLOOKUP(E106,Insumos!A:C,2,FALSE),\"\")","v":""},null,null,null,0]
[null,null,null,null,null,{"$f":"IFERROR(VLOOKUP(E107,Insumos!A:C,2,FALSE),\"\")","v":""},null,null,null,0]
[null,null,null,null,null,{"$f":"IFERROR(VLOOKUP(E108,Insumos!A:C,2,FALSE),\"\")","v":""},null,null,null,0]
[null,null,null,null,null,{"$f":"IFERROR(VLOOKUP(E109,Insumos!A:C,2,FALSE),\"\")","v":""},null,null,null,0]
[null,null,null,null,null,{"$f":"IFERROR(VLOOKUP(E110,Insumos!A:C,2,FALSE),\"\")","v":""},null,null,null,0]
[null,null,null,null,null,{"$f":"IFERROR(VLOOKUP(E111,Insumos!A:C,2,FALSE),\"\")","v":""},null,null,null,0]
[null,null,null,null,null,{"$f":"IFERROR(VLOOKUP(E112,Insumos!A:C,2,FALSE),\"\")","v":""},null,null,null,0]
[null,null,null,null,null,{"$f":"IFERROR(VLOOKUP(E113,Insumos!A:C,2,FALSE),\"\")","v":""},null,null,null,0]
[null,null,null,null,null,{"$f":"IFERROR(VLOOKUP(E114,Insumos!A:C,2,FALSE),\"\")","v":""},null,null,null,0]
[null,null,null,null,null,{"$f":"IFERROR(VLOOKUP(E115,Insumos!A:C,2,FALSE),\"\")","v":""},null,null,null,0]
[null,null,null,null,null,{"$f":"IFERROR(VLOOKUP(E116,Insumos!A:C,2,FALSE),\"\")","v":""},null,null,null,0]
[null,null,null,null,null,{"$f":"IFERROR(VLOOKUP(E117,Insumos!A:C,2,FALSE),\"\")","v":""},null,null,null,0]
[null,null,null,null,null,{"$f":"IFERROR(VLOOKUP(E118,Insumos!A:C,2,FALSE),\"\")","v":""},null,null,null,0]
[null,null,null,null,null,{"$f":"IFERROR(VLOOKUP(E119,Insumos!A:C,2,FALSE),\"\")","v":""},null,null,null,0]
[null,null,null,null,null,{"$f":"IFERROR(VLOOKUP(E120,Insumos!A:C,2,FALSE),\"\")","v":""},null,null,null,0]
[null,null,null,null,null,{"$f":"IFERROR(VLOOKUP(E121,Insumos!A:C,2,FALSE),\"\")","v":""},null,null,null,0]
[null,null,null,null,null,{"$f":"IFERROR(VLOOKUP(E122,Insumos!A:C,2,FALSE),\"\")","v":""},null,null,null,0]
[null,null,null,null,null,{"$f":"IFERROR(VLOOKUP(E123,Insumos!A:C,2,FALSE),\"\")","v":""},null,null,null,0]
[null,null,null,null,null,{"$f":"IFERROR(VLOOKUP(E124,Insumos!A:C,2,FALSE),\"\")","v":""},null,null,null,0]
[null,null,null,null,null,{"$f":"IFERROR(VLOOKUP(E125,Insumos!A:C,2,FALSE),\"\")","v":""},null,null,null,0]
[null,null,null,null,null,{"$f":"IFERROR(VLOOKUP(E126,Insumos!A:C,2,FALSE),\"\")","v":""},null,null,null,0]
[null,null,null,null,null,{"$f":"IFERROR(VLOOKUP(E127,Insumos!A:C,2,FALSE),\"\")","v":""},null,null,null,0]
[null,null,null,null,null,{"$f":"IFERROR(VLOOKUP(E128,Insumos!A:C,2,FALSE),\"\")","v":""},null,null,null,0]
[null,null,null,null,null,{"$f":"IFERROR(VLOOKUP(E129,Insumos!A:C,2,FALSE),\"\")","v":""},null,null,null,0]
[null,null,null,null,null,{"$f":"IFERROR(VLOOKUP(E130,Insumos!A:C,2,FALSE),\"\")","v":""},null,null,null,0]
[null,null,null,null,null,{"$f":"IFERROR(VLOOKUP(E131,Insumos!A:C,2,FALSE),\"\")","v":""},null,null,null,0]
[null,null,null,null,null,{"$f":"IFERROR(VLOOKUP(E132,Insumos!A:C,2,FALSE),\"\")","v":""},null,null,null,0]
[null,null,null,null,null,{"$f":"IFERROR(VLOOKUP(E133,Insumos!A:C,2,FALSE),\"\")","v":""},null,null,null,{"$f":"IFERROR(H133*I133,\"\")","v":0}]
[null,null,null,null,null,{"$f":"IFERROR(VLOOKUP(E134,Insumos!A:C,2,FALSE),\"\")","v":""},null,null,null,0]
[null,null,null,null,null,{"$f":"IFERROR(VLOOKUP(E135,Insumos!A:C,2,FALSE),\"\")","v":""},null,null,null,0]
[null,null,null,null,null,{"$f":"IFERROR(VLOOKUP(E136,Insumos!A:C,2,FALSE),\"\")","v":""},null,null,null,0]
[null,null,null,null,null,{"$f":"IFERROR(VLOOKUP(E137,Insumos!A:C,2,FALSE),\"\")","v":""},null,null,null,0]
[null,null,null,null,null,{"$f":"IFERROR(VLOOKUP(E138,Insumos!A:C,2,FALSE),\"\")","v":""},null,null,null,0]
[null,null,null,null,null,{"$f":"IFERROR(VLOOKUP(E139,Insumos!A:C,2,FALSE),\"\")","v":""},null,null,null,0]
[null,null,null,null,null,{"$f":"IFERROR(VLOOKUP(E140,Insumos!A:C,2,FALSE),\"\")","v":""},null,null,null,0]
[null,null,null,null,null,{"$f":"IFERROR(VLOOKUP(E141,Insumos!A:C,2,FALSE),\"\")","v":""},null,null,null,0]
[null,null,null,null,null,{"$f":"IFERROR(VLOOKUP(E142,Insumos!A:C,2,FALSE),\"\")","v":""},null,null,null,0]
[null,null,null,null,null,{"$f":"IFERROR(VLOOKUP(E143,Insumos!A:C,2,FALSE),\"\")","v":""},null,null,null,0]
[null,null,null,null,null,{"$f":"IFERROR(VLOOKUP(E144,Insumos!A:C,2,FALSE),\"\")","v":""},null,null,null,0]
[null,null,null,null,null,{"$f":"IFERROR(VLOOKUP(E145,Insumos!A:C,2,FALSE),\"\")","v":""},null,null,null,0]
[null,null,null,null,null,{"$f":"IFERROR(VLOOKUP(E146,Insumos!A:C,2,FALSE),\"\")","v":""},null,null,null,0]
[null,null,null,null,null,{"$f":"IFERROR(VLOOKUP(E147,Insumos!A:C,2,FALSE),\"\")","v":""},null,null,null,0]
[null,null,null,null,null,{"$f":"IFERROR(VLOOKUP(E148,Insumos!A:C,2,FALSE),\"\")","v":""},null,null,null,0]
[null,null,null,null,null,{"$f":"IFERROR(VLOOKUP(E149,Insumos!A:C,2,FALSE),\"\")","v":""},null,null,null,0]
[null,null,null,null,null,{"$f":"IFERROR(VLOOKUP(E150,Insumos!A:C,2,FALSE),\"\")","v":""},null,null,null,0]
[null,null,null,null,null,{"$f":"IFERROR(VLOOKUP(E151,Insumos!A:C,2,FALSE),\"\")","v":""},null,null,null,0]
[null,null,null,null,null,{"$f":"IFERROR(VLOOKUP(E152,Insumos!A:C,2,FALSE),\"\")","v":""},null,null,null,0]
[null,null,null,null,null,{"$f":"IFERROR(VLOOKUP(E153,Insumos!A:C,2,FALSE),\"\")","v":""},null,null,null,0]
[null,null,null,null,null,{"$f":"IFERROR(VLOOKUP(E154,Insumos!A:C,2,FALSE),\"\")","v":""},null,null,null,0]
[null,null,null,null,null,{"$f":"IFERROR(VLOOKUP(E155,Insumos!A:C,2,FALSE),\"\")","v":""},null,null,null,0]
[null,null,null,null,null,{"$f":"IFERROR(VLOOKUP(E156,Insumos!A:C,2,FALSE),\"\")","v":""},null,null,null,0]
[null,null,null,null,null,{"$f":"IFERROR(VLOOKUP(E157,Insumos!A:C,2,FALSE),\"\")","v":""},null,null,null,0]
[null,null,null,null,null,{"$f":"IFERROR(VLOOKUP(E158,Insumos!A:C,2,FALSE),\"\")","v":""},null,null,null,0]
[null,null,null,null,null,{"$f":"IFERROR(VLOOKUP(E159,Insumos!A:C,2,FALSE),\"\")","v":""},null,null,null,0]
[null,null,null,null,null,{"$f":"IFERROR(VLOOKUP(E160,Insumos!A:C,2,FALSE),\"\")","v":""},null,null,null,0]
[null,null,null,null,null,{"$f":"IFERROR(VLOOKUP(E161,Insumos!A:C,2,FALSE),\"\")","v":""},null,null,null,0]
[null,null,null,null,null,{"$f":"IFERROR(VLOOKUP(E162,Insumos!A:C,2,FALSE),\"\")","v":""},null,null,null,0]
[null,null,null,null,null,{"$f":"IFERROR(VLOOKUP(E163,Insumos!A:C,2,FALSE),\"\")","v":""},null,null,null,0]
[null,null,null,null,null,{"$f":"IFERROR(VLOOKUP(E164,Insumos!A:C,2,FALSE),\"\")","v":""},null,null,null,0]
[null,null,null,null,null,{"$f":"IFERROR(VLOOKUP(E165,Insumos!A:C,2,FALSE),\"\")","v":""},null,null,null,0]
[null,null,null,null,null,{"$f":"IFERROR(VLOOKUP(E166,Insumos!A:C,2,FALSE),\"\")","v":""},null,null,null,0]
[null,null,null,null,null,{"$f":"IFERROR(VLOOKUP(E167,Insumos!A:C,2,FALSE),\"\")","v":""},null,null,null,0]
[null,null,null,null,null,{"$f":"IFERROR(VLOOKUP(E168,Insumos!A:C,2,FALSE),\"\")","v":""},null,null,null,0]
[null,null,null,null,null,{"$f":"IFERROR(VLOOKUP(E169,Insumos!A:C,2,FALSE),\"\")","v":""},null,null,null,0]
[null,null,null,null,null,{"$f":"IFERROR(VLOOKUP(E170,Insumos!A:C,2,FALSE),\"\")","v":""},null,null,null,0]
[null,null,null,null,null,{"$f":"IFERROR(VLOOKUP(E171,Insumos!A:C,2,FALSE),\"\")","v":""},null,null,null,0]
[null,null,null,null,null,{"$f":"IFERROR(VLOOKUP(E172,Insumos!A:C,2,FALSE),\"\")","v":""},null,null,null,0]
[null,null,null,null,null,{"$f":"IFERROR(VLOOKUP(E173,Insumos!A:C,2,FALSE),\"\")","v":""},null,null,null,0]
[null,null,null,null,null,{"$f":"IFERROR(VLOOKUP(E174,Insumos!A:C,2,FALSE),\"\")","v":""},null,null,null,0]
[null,null,null,null,null,{"$f":"IFERROR(VLOOKUP(E175,Insumos!A:C,2,FALSE),\"\")","v":""},null,null,null,0]
[null,null,null,null,null,{"$f":"IFERROR(VLOOKUP(E176,Insumos!A:C,2,FALSE),\"\")","v":""},null,null,null,0]
[null,null,null,null,null,{"$f":"IFERROR(VLOOKUP(E177,Insumos!A:C,2,FALSE),\"\")","v":""},null,null,null,0]
[null,null,null,null,null,{"$f":"IFERROR(VLOOKUP(E178,Insumos!A:C,2,FALSE),\"\")","v":""},null,null,null,0]
[null,null,null,null,null,{"$f":"IFERROR(VLOOKUP(E179,Insumos!A:C,2,FALSE),\"\")","v":""},null,null,null,0]
[null,null,null,null,null,{"$f":"IFERROR(VLOOKUP(E180,Insumos!A:C,2,FALSE),\"\")","v":""},null,null,null,0]
[null,null,null,null,null,{"$f":"IFERROR(VLOOKUP(E181,Insumos!A:C,2,FALSE),\"\")","v":""},null,null,null,0]
[null,null,null,null,null,{"$f":"IFERROR(VLOOKUP(E182,Insumos!A:C,2,FALSE),\"\")","v":""},null,null,null,0]
[null,null,null,null,null,{"$f":"IFERROR(VLOOKUP(E183,Insumos!A:C,2,FALSE),\"\")","v":""},null,null,null,0]
[null,null,null,null,null,{"$f":"IFERROR(VLOOKUP(E184,Insumos!A:C,2,FALSE),\"\")","v":""},null,null,null,0]
[null,null,null,null,null,{"$f":"IFERROR(VLOOKUP(E185,Insumos!A:C,2,FALSE),\"\")","v":""},null,null,null,0]
[null,null,null,null,null,{"$f":"IFERROR(VLOOKUP(E186,Insumos!A:C,2,FALSE),\"\")","v":""},null,null,null,0]
[null,null,null,null,null,{"$f":"IFERROR(VLOOKUP(E187,Insumos!A:C,2,FALSE),\"\")","v":""},null,null,null,0]
[null,null,null,null,null,{"$f":"IFERROR(VLOOKUP(E188,Insumos!A:C,2,FALSE),\"\")","v":""},null,null,null,0]
[null,null,null,null,null,{"$f":"IFERROR(VLOOKUP(E189,Insumos!A:C,2,FALSE),\"\")","v":""},null,null,null,0]
[null,null,null,null,null,{"$f":"IFERROR(VLOOKUP(E190,Insumos!A:C,2,FALSE),\"\")","v":""},null,null,null,0]
[null,null,null,null,null,{"$f":"IFERROR(VLOOKUP(E191,Insumos!A:C,2,FALSE),\"\")","v":""},null,null,null,0]
[null,null,null,null,null,{"$f":"IFERROR(VLOOKUP(E192,Insumos!A:C,2,FALSE),\"\")","v":""},null,null,null,0]
[null,null,null,null,null,{"$f":"IFERROR(VLOOKUP(E193,Insumos!A:C,2,FALSE),\"\")","v":""},null,null,null,0]
[null,null,null,null,null,{"$f":"IFERROR(VLOOKUP(E194,Insumos!A:C,2,FALSE),\"\")","v":""},null,null,null,0]
[null,null,null,null,null,{"$f":"IFERROR(VLOOKUP(E195,Insumos!A:C,2,FALSE),\"\")","v":""},null,null,null,0]
[null,null,null,null,null,{"$f":"IFERROR(VLOOKUP(E196,Insumos!A:C,2,FALSE),\"\")","v":""},null,null,null,0]
[null,null,null,null,null,{"$f":"IFERROR(VLOOKUP(E197,Insumos!A:C,2,FALSE),\"\")","v":""},null,null,null,{"$f":"IFERROR(H197*I197,\"\")","v":0}]
[null,null,null,null,null,{"$f":"IFERROR(VLOOKUP(E198,Insumos!A:C,2,FALSE),\"\")","v":""},null,null,null,0]
[null,null,null,null,null,{"$f":"IFERROR(VLOOKUP(E199,Insumos!A:C,2,FALSE),\"\")","v":""},null,null,null,0]
[null,null,null,null,null,{"$f":"IFERROR(VLOOKUP(E200,Insumos!A:C,2,FALSE),\"\")","v":""},null,null,null,0]
[null,null,null,null,null,{"$f":"IFERROR(VLOOKUP(E201,Insumos!A:C,2,FALSE),\"\")","v":""},null,null,null,0]
[null,null,null,null,null,{"$f":"IFERROR(VLOOKUP(E202,Insumos!A:C,2,FALSE),\"\")","v":""},null,null,null,0]
[null,null,null,null,null,{"$f":"IFERROR(VLOOKUP(E203,Insumos!A:C,2,FALSE),\"\")","v":""},null,null,null,0]
[null,null,null,null,null,{"$f":"IFERROR(VLOOKUP(E204,Insumos!A:C,2,FALSE),\"\")","v":""},null,null,null,0]
[null,null,null,null,null,{"$f":"IFERROR(VLOOKUP(E205,Insumos!A:C,2,FALSE),\"\")","v":""},null,null,null,0]
[null,null,null,null,null,{"$f":"IFERROR(VLOOKUP(E206,Insumos!A:C,2,FALSE),\"\")","v":""},null,null,null,0]
[null,null,null,null,null,{"$f":"IFERROR(VLOOKUP(E207,Insumos!A:C,2,FALSE),\"\")","v":""},null,null,null,0]
[null,null,null,null,null,{"$f":"IFERROR(VLOOKUP(E208,Insumos!A:C,2,FALSE),\"\")","v":""},null,null,null,0]
[null,null,null,null,null,{"$f":"IFERROR(VLOOKUP(E209,Insumos!A:C,2,FALSE),\"\")","v":""},null,null,null,0]
[null,null,null,null,null,{"$f":"IFERROR(VLOOKUP(E210,Insumos!A:C,2,FALSE),\"\")","v":""},null,null,null,0]
[null,null,null,null,null,{"$f":"IFERROR(VLOOKUP(E211,Insumos!A:C,2,FALSE),\"\")","v":""},null,null,null,0]
[null,null,null,null,null,{"$f":"IFERROR(VLOOKUP(E212,Insumos!A:C,2,FALSE),\"\")","v":""},null,null,null,0]
[null,null,null,null,null,{"$f":"IFERROR(VLOOKUP(E213,Insumos!A:C,2,FALSE),\"\")","v":""},null,null,null,0]
[null,null,null,null,null,{"$f":"IFERROR(VLOOKUP(E214,Insumos!A:C,2,FALSE),\"\")","v":""},null,null,null,0]
[null,null,null,null,null,{"$f":"IFERROR(VLOOKUP(E215,Insumos!A:C,2,FALSE),\"\")","v":""},null,null,null,0]
[null,null,null,null,null,{"$f":"IFERROR(VLOOKUP(E216,Insumos!A:C,2,FALSE),\"\")","v":""},null,null,null,0]
[null,null,null,null,null,{"$f":"IFERROR(VLOOKUP(E217,Insumos!A:C,2,FALSE),\"\")","v":""},null,null,null,0]
[null,null,null,null,null,{"$f":"IFERROR(VLOOKUP(E218,Insumos!A:C,2,FALSE),\"\")","v":""},null,null,null,0]
[null,null,null,null,null,{"$f":"IFERROR(VLOOKUP(E219,Insumos!A:C,2,FALSE),\"\")","v":""},null,null,null,0]
[null,null,null,null,null,{"$f":"IFERROR(VLOOKUP(E220,Insumos!A:C,2,FALSE),\"\")","v":""},null,null,null,0]
[null,null,null,null,null,{"$f":"IFERROR(VLOOKUP(E221,Insumos!A:C,2,FALSE),\"\")","v":""},null,null,null,0]
[null,null,null,null,null,{"$f":"IFERROR(VLOOKUP(E222,Insumos!A:C,2,FALSE),\"\")","v":""},null,null,null,0]
[null,null,null,null,null,{"$f":"IFERROR(VLOOKUP(E223,Insumos!A:C,2,FALSE),\"\")","v":""},null,null,null,0]
[null,null,null,null,null,{"$f":"IFERROR(VLOOKUP(E224,Insumos!A:C,2,FALSE),\"\")","v":""},null,null,null,0]
[null,null,null,null,null,{"$f":"IFERROR(VLOOKUP(E225,Insumos!A:C,2,FALSE),\"\")","v":""},null,null,null,0]
[null,null,null,null,null,{"$f":"IFERROR(VLOOKUP(E226,Insumos!A:C,2,FALSE),\"\")","v":""},null,null,null,0]
[null,null,null,null,null,{"$f":"IFERROR(VLOOKUP(E227,Insumos!A:C,2,FALSE),\"\")","v":""},null,null,null,0]
[null,null,null,null,null,{"$f":"IFERROR(VLOOKUP(E228,Insumos!A:C,2,FALSE),\"\")","v":""},null,null,null,0]
[null,null,null,null,null,{"$f":"IFERROR(VLOOKUP(E229,Insumos!A:C,2,FALSE),\"\")","v":""},null,null,null,0]
[null,null,null,null,null,{"$f":"IFERROR(VLOOKUP(E230,Insumos!A:C,2,FALSE),\"\")","v":""},null,null,null,0]
[null,null,null,null,null,{"$f":"IFERROR(VLOOKUP(E231,Insumos!A:C,2,FALSE),\"\")","v":""},null,null,null,0]
[null,null,null,null,null,{"$f":"IFERROR(VLOOKUP(E232,Insumos!A:C,2,FALSE),\"\")","v":""},null,null,null,0]
[null,null,null,null,null,{"$f":"IFERROR(VLOOKUP(E233,Insumos!A:C,2,FALSE),\"\")","v":""},null,null,null,0]
[null,null,null,null,null,{"$f":"IFERROR(VLOOKUP(E234,Insumos!A:C,2,FALSE),\"\")","v":""},null,null,null,0]
[null,null,null,null,null,{"$f":"IFERROR(VLOOKUP(E235,Insumos!A:C,2,FALSE),\"\")","v":""},null,null,null,0]
[null,null,null,null,null,{"$f":"IFERROR(VLOOKUP(E236,Insumos!A:C,2,FALSE),\"\")","v":""},null,null,null,0]
[null,null,null,null,null,{"$f":"IFERROR(VLOOKUP(E237,Insumos!A:C,2,FALSE),\"\")","v":""},null,null,null,0]
[null,null,null,null,null,{"$f":"IFERROR(VLOOKUP(E238,Insumos!A:C,2,FALSE),\"\")","v":""},null,null,null,0]
[null,null,null,null,null,{"$f":"IFERROR(VLOOKUP(E239,Insumos!A:C,2,FALSE),\"\")","v":""},null,null,null,0]
[null,null,null,null,null,{"$f":"IFERROR(VLOOKUP(E240,Insumos!A:C,2,FALSE),\"\")","v":""},null,null,null,0]
[null,null,null,null,null,{"$f":"IFERROR(VLOOKUP(E241,Insumos!A:C,2,FALSE),\"\")","v":""},null,null,null,0]
[null,null,null,null,null,{"$f":"IFERROR(VLOOKUP(E242,Insumos!A:C,2,FALSE),\"\")","v":""},null,null,null,0]
[null,null,null,null,null,{"$f":"IFERROR(VLOOKUP(E243,Insumos!A:C,2,FALSE),\"\")","v":""},null,null,null,0]
[null,null,null,null,null,{"$f":"IFERROR(VLOOKUP(E244,Insumos!A:C,2,FALSE),\"\")","v":""},null,null,null,0]
[null,null,null,null,null,{"$f":"IFERROR(VLOOKUP(E245,Insumos!A:C,2,FALSE),\"\")","v":""},null,null,null,0]
[null,null,null,null,null,{"$f":"IFERROR(VLOOKUP(E246,Insumos!A:C,2,FALSE),\"\")","v":""},null,null,null,0]
[null,null,null,null,null,{"$f":"IFERROR(VLOOKUP(E247,Insumos!A:C,2,FALSE),\"\")","v":""},null,null,null,0]
[null,null,null,null,null,{"$f":"IFERROR(VLOOKUP(E248,Insumos!A:C,2,FALSE),\"\")","v":""},null,null,null,0]
[null,null,null,null,null,{"$f":"IFERROR(VLOOKUP(E249,Insumos!A:C,2,FALSE),\"\")","v":""},null,null,null,0]
[null,null,null,null,null,{"$f":"IFERROR(VLOOKUP(E250,Insumos!A:C,2,FALSE),\"\")","v":""},null,null,null,0]
[null,null,null,null,null,{"$f":"IFERROR(VLOOKUP(E251,Insumos!A:C,2,FALSE),\"\")","v":""},null,null,null,0]
[null,null,null,null,null,{"$f":"IFERROR(VLOOKUP(E252,Insumos!A:C,2,FALSE),\"\")","v":""},null,null,null,0]
[null,null,null,null,null,{"$f":"IFERROR(VLOOKUP(E253,Insumos!A:C,2,FALSE),\"\")","v":""},null,null,null,0]
[null,null,null,null,null,{"$f":"IFERROR(VLOOKUP(E254,Insumos!A:C,2,FALSE),\"\")","v":""},null,null,null,0]
[null,null,null,null,null,{"$f":"IFERROR(VLOOKUP(E255,Insumos!A:C,2,FALSE),\"\")","v":""},null,null,null,0]
[null,null,null,null,null,{"$f":"IFERROR(VLOOKUP(E256,Insumos!A:C,2,FALSE),\"\")","v":""},null,null,null,0]
[null,null,null,null,null,{"$f":"IFERROR(VLOOKUP(E257,Insumos!A:C,2,FALSE),\"\")","v":""},null,null,null,0]
[null,null,null,null,null,{"$f":"IFERROR(VLOOKUP(E258,Insumos!A:C,2,FALSE),\"\")","v":""},null,null,null,0]
[null,null,null,null,null,{"$f":"IFERROR(VLOOKUP(E259,Insumos!A:C,2,FALSE),\"\")","v":""},null,null,null,0]
[null,null,null,null,null,{"$f":"IFERROR(VLOOKUP(E260,Insumos!A:C,2,FALSE),\"\")","v":""},null,null,null,0]
[null,null,null,null,null,{"$f":"IFERROR(VLOOKUP(E261,Insumos!A:C,2,FALSE),\"\")","v":""},null,null,null,{"$f":"IFERROR(H261*I261,\"\")","v":0}]
[null,null,null,null,null,{"$f":"IFERROR(VLOOKUP(E262,Insumos!A:C,2,FALSE),\"\")","v":""},null,null,null,0]
[null,null,null,null,null,{"$f":"IFERROR(VLOOKUP(E263,Insumos!A:C,2,FALSE),\"\")","v":""},null,null,null,0]
[null,null,null,null,null,{"$f":"IFERROR(VLOOKUP(E264,Insumos!A:C,2,FALSE),\"\")","v":""},null,null,null,0]
[null,null,null,null,null,{"$f":"IFERROR(VLOOKUP(E265,Insumos!A:C,2,FALSE),\"\")","v":""},null,null,null,0]
[null,null,null,null,null,{"$f":"IFERROR(VLOOKUP(E266,Insumos!A:C,2,FALSE),\"\")","v":""},null,null,null,0]
[null,null,null,null,null,{"$f":"IFERROR(VLOOKUP(E267,Insumos!A:C,2,FALSE),\"\")","v":""},null,null,null,0]
[null,null,null,null,null,{"$f":"IFERROR(VLOOKUP(E268,Insumos!A:C,2,FALSE),\"\")","v":""},null,null,null,0]
[null,null,null,null,null,{"$f":"IFERROR(VLOOKUP(E269,Insumos!A:C,2,FALSE),\"\")","v":""},null,null,null,0]
[null,null,null,null,null,{"$f":"IFERROR(VLOOKUP(E270,Insumos!A:C,2,FALSE),\"\")","v":""},null,null,null,0]
[null,null,null,null,null,{"$f":"IFERROR(VLOOKUP(E271,Insumos!A:C,2,FALSE),\"\")","v":""},null,null,null,0]
[null,null,null,null,null,{"$f":"IFERROR(VLOOKUP(E272,Insumos!A:C,2,FALSE),\"\")","v":""},null,null,null,0]
[null,null,null,null,null,{"$f":"IFERROR(VLOOKUP(E273,Insumos!A:C,2,FALSE),\"\")","v":""},null,null,null,0]
[null,null,null,null,null,{"$f":"IFERROR(VLOOKUP(E274,Insumos!A:C,2,FALSE),\"\")","v":""},null,null,null,0]
[null,null,null,null,null,{"$f":"IFERROR(VLOOKUP(E275,Insumos!A:C,2,FALSE),\"\")","v":""},null,null,null,0]
[null,null,null,null,null,{"$f":"IFERROR(VLOOKUP(E276,Insumos!A:C,2,FALSE),\"\")","v":""},null,null,null,0]
[null,null,null,null,null,{"$f":"IFERROR(VLOOKUP(E277,Insumos!A:C,2,FALSE),\"\")","v":""},null,null,null,0]
[null,null,null,null,null,{"$f":"IFERROR(VLOOKUP(E278,Insumos!A:C,2,FALSE),\"\")","v":""},null,null,null,0]
[null,null,null,null,null,{"$f":"IFERROR(VLOOKUP(E279,Insumos!A:C,2,FALSE),\"\")","v":""},null,null,null,0]
[null,null,null,null,null,{"$f":"IFERROR(VLOOKUP(E280,Insumos!A:C,2,FALSE),\"\")","v":""},null,null,null,0]
[null,null,null,null,null,{"$f":"IFERROR(VLOOKUP(E281,Insumos!A:C,2,FALSE),\"\")","v":""},null,null,null,0]
[null,null,null,null,null,{"$f":"IFERROR(VLOOKUP(E282,Insumos!A:C,2,FALSE),\"\")","v":""},null,null,null,0]
[null,null,null,null,null,{"$f":"IFERROR(VLOOKUP(E283,Insumos!A:C,2,FALSE),\"\")","v":""},null,null,null,0]
[null,null,null,null,null,{"$f":"IFERROR(VLOOKUP(E284,Insumos!A:C,2,FALSE),\"\")","v":""},null,null,null,0]
[null,null,null,null,null,{"$f":"IFERROR(VLOOKUP(E285,Insumos!A:C,2,FALSE),\"\")","v":""},null,null,null,0]
[null,null,null,null,null,{"$f":"IFERROR(VLOOKUP(E286,Insumos!A:C,2,FALSE),\"\")","v":""},null,null,null,0]
[null,null,null,null,null,{"$f":"IFERROR(VLOOKUP(E287,Insumos!A:C,2,FALSE),\"\")","v":""},null,null,null,0]
[null,null,null,null,null,{"$f":"IFERROR(VLOOKUP(E288,Insumos!A:C,2,FALSE),\"\")","v":""},null,null,null,0]
[null,null,null,null,null,{"$f":"IFERROR(VLOOKUP(E289,Insumos!A:C,2,FALSE),\"\")","v":""},null,null,null,0]
[null,null,null,null,null,{"$f":"IFERROR(VLOOKUP(E290,Insumos!A:C,2,FALSE),\"\")","v":""},null,null,null,0]
[null,null,null,null,null,{"$f":"IFERROR(VLOOKUP(E291,Insumos!A:C,2,FALSE),\"\")","v":""},null,null,null,0]
[null,null,null,null,null,{"$f":"IFERROR(VLOOKUP(E292,Insumos!A:C,2,FALSE),\"\")","v":""},null,null,null,0]
[null,null,null,null,null,{"$f":"IFERROR(VLOOKUP(E293,Insumos!A:C,2,FALSE),\"\")","v":""},null,null,null,0]
[null,null,null,null,null,{"$f":"IFERROR(VLOOKUP(E294,Insumos!A:C,2,FALSE),\"\")","v":""},null,null,null,0]
[null,null,null,null,null,{"$f":"IFERROR(VLOOKUP(E295,Insumos!A:C,2,FALSE),\"\")","v":""},null,null,null,0]
[null,null,null,null,null,{"$f":"IFERROR(VLOOKUP(E296,Insumos!A:C,2,FALSE),\"\")","v":""},null,null,null,0]
[null,null,null,null,null,{"$f":"IFERROR(VLOOKUP(E297,Insumos!A:C,2,FALSE),\"\")","v":""},null,null,null,0]
[null,null,null,null,null,{"$f":"IFERROR(VLOOKUP(E298,Insumos!A:C,2,FALSE),\"\")","v":""},null,null,null,0]
[null,null,null,null,null,{"$f":"IFERROR(VLOOKUP(E299,Insumos!A:C,2,FALSE),\"\")","v":""},null,null,null,0]
[null,null,null,null,null,{"$f":"IFERROR(VLOOKUP(E300,Insumos!A:C,2,FALSE),\"\")","v":""},null,null,null,0]
[null,null,null,null,null,{"$f":"IFERROR(VLOOKUP(E301,Insumos!A:C,2,FALSE),\"\")","v":""},null,null,null,0]
[null,null,null,null,null,{"$f":"IFERROR(VLOOKUP(E302,Insumos!A:C,2,FALSE),\"\")","v":""},null,null,null,0]
[null,null,null,null,null,{"$f":"IFERROR(VLOOKUP(E303,Insumos!A:C,2,FALSE),\"\")","v":""},null,null,null,0]
[null,null,null,null,null,{"$f":"IFERROR(VLOOKUP(E304,Insumos!A:C,2,FALSE),\"\")","v":""},null,null,null,0]
[null,null,null,null,null,{"$f":"IFERROR(VLOOKUP(E305,Insumos!A:C,2,FALSE),\"\")","v":""},null,null,null,0]
[null,null,null,null,null,{"$f":"IFERROR(VLOOKUP(E306,Insumos!A:C,2,FALSE),\"\")","v":""},null,null,null,0]
[null,null,null,null,null,{"$f":"IFERROR(VLOOKUP(E307,Insumos!A:C,2,FALSE),\"\")","v":""},null,null,null,0]
[null,null,null,null,null,{"$f":"IFERROR(VLOOKUP(E308,Insumos!A:C,2,FALSE),\"\")","v":""},null,null,null,0]
[null,null,null,null,null,{"$f":"IFERROR(VLOOKUP(E309,Insumos!A:C,2,FALSE),\"\")","v":""},null,null,null,0]
[null,null,null,null,null,{"$f":"IFERROR(VLOOKUP(E310,Insumos!A:C,2,FALSE),\"\")","v":""},null,null,null,0]
[null,null,null,null,null,{"$f":"IFERROR(VLOOKUP(E311,Insumos!A:C,2,FALSE),\"\")","v":""},null,null,null,0]
[null,null,null,null,null,{"$f":"IFERROR(VLOOKUP(E312,Insumos!A:C,2,FALSE),\"\")","v":""},null,null,null,0]
[null,null,null,null,null,{"$f":"IFERROR(VLOOKUP(E313,Insumos!A:C,2,FALSE),\"\")","v":""},null,null,null,0]
[null,null,null,null,null,{"$f":"IFERROR(VLOOKUP(E314,Insumos!A:C,2,FALSE),\"\")","v":""},null,null,null,0]
[null,null,null,null,null,{"$f":"IFERROR(VLOOKUP(E315,Insumos!A:C,2,FALSE),\"\")","v":""},null,null,null,0]
[null,null,null,null,null,{"$f":"IFERROR(VLOOKUP(E316,Insumos!A:C,2,FALSE),\"\")","v":""},null,null,null,0]
[null,null,null,null,null,{"$f":"IFERROR(VLOOKUP(E317,Insumos!A:C,2,FALSE),\"\")","v":""},null,null,null,0]
[null,null,null,null,null,{"$f":"IFERROR(VLOOKUP(E318,Insumos!A:C,2,FALSE),\"\")","v":""},null,null,null,0]
[null,null,null,null,null,{"$f":"IFERROR(VLOOKUP(E319,Insumos!A:C,2,FALSE),\"\")","v":""},null,null,null,0]
[null,null,null,null,null,{"$f":"IFERROR(VLOOKUP(E320,Insumos!A:C,2,FALSE),\"\")","v":""},null,null,null,0]
[null,null,null,null,null,{"$f":"IFERROR(VLOOKUP(E321,Insumos!A:C,2,FALSE),\"\")","v":""},null,null,null,0]
[null,null,null,null,null,{"$f":"IFERROR(VLOOKUP(E322,Insumos!A:C,2,FALSE),\"\")","v":""},null,null,null,0]
[null,null,null,null,null,{"$f":"IFERROR(VLOOKUP(E323,Insumos!A:C,2,FALSE),\"\")","v":""},null,null,null,0]
[null,null,null,null,null,{"$f":"IFERROR(VLOOKUP(E324,Insumos!A:C,2,FALSE),\"\")","v":""},null,null,null,0]
[null,null,null,null,null,{"$f":"IFERROR(VLOOKUP(E325,Insumos!A:C,2,FALSE),\"\")","v":""},null,null,null,{"$f":"IFERROR(H325*I325,\"\")","v":0}]
[null,null,null,null,null,{"$f":"IFERROR(VLOOKUP(E326,Insumos!A:C,2,FALSE),\"\")","v":""},null,null,null,0]
[null,null,null,null,null,{"$f":"IFERROR(VLOOKUP(E327,Insumos!A:C,2,FALSE),\"\")","v":""},null,null,null,0]
[null,null,null,null,null,{"$f":"IFERROR(VLOOKUP(E328,Insumos!A:C,2,FALSE),\"\")","v":""},null,null,null,0]
[null,null,null,null,null,{"$f":"IFERROR(VLOOKUP(E329,Insumos!A:C,2,FALSE),\"\")","v":""},null,null,null,0]
[null,null,null,null,null,{"$f":"IFERROR(VLOOKUP(E330,Insumos!A:C,2,FALSE),\"\")","v":""},null,null,null,0]
[null,null,null,null,null,{"$f":"IFERROR(VLOOKUP(E331,Insumos!A:C,2,FALSE),\"\")","v":""},null,null,null,0]
[null,null,null,null,null,{"$f":"IFERROR(VLOOKUP(E332,Insumos!A:C,2,FALSE),\"\")","v":""},null,null,null,0]
[null,null,null,null,null,{"$f":"IFERROR(VLOOKUP(E333,Insumos!A:C,2,FALSE),\"\")","v":""},null,null,null,0]
[null,null,null,null,null,{"$f":"IFERROR(VLOOKUP(E334,Insumos!A:C,2,FALSE),\"\")","v":""},null,null,null,0]
[null,null,null,null,null,{"$f":"IFERROR(VLOOKUP(E335,Insumos!A:C,2,FALSE),\"\")","v":""},null,null,null,0]
[null,null,null,null,null,{"$f":"IFERROR(VLOOKUP(E336,Insumos!A:C,2,FALSE),\"\")","v":""},null,null,null,0]
[null,null,null,null,null,{"$f":"IFERROR(VLOOKUP(E337,Insumos!A:C,2,FALSE),\"\")","v":""},null,null,null,0]
[null,null,null,null,null,{"$f":"IFERROR(VLOOKUP(E338,Insumos!A:C,2,FALSE),\"\")","v":""},null,null,null,0]
[null,null,null,null,null,{"$f":"IFERROR(VLOOKUP(E339,Insumos!A:C,2,FALSE),\"\")","v":""},null,null,null,0]
[null,null,null,null,null,{"$f":"IFERROR(VLOOKUP(E340,Insumos!A:C,2,FALSE),\"\")","v":""},null,null,null,0]
[null,null,null,null,null,{"$f":"IFERROR(VLOOKUP(E341,Insumos!A:C,2,FALSE),\"\")","v":""},null,null,null,0]
[null,null,null,null,null,{"$f":"IFERROR(VLOOKUP(E342,Insumos!A:C,2,FALSE),\"\")","v":""},null,null,null,0]
[null,null,null,null,null,{"$f":"IFERROR(VLOOKUP(E343,Insumos!A:C,2,FALSE),\"\")","v":""},null,null,null,0]
[null,null,null,null,null,{"$f":"IFERROR(VLOOKUP(E344,Insumos!A:C,2,FALSE),\"\")","v":""},null,null,null,0]
[null,null,null,null,null,{"$f":"IFERROR(VLOOKUP(E345,Insumos!A:C,2,FALSE),\"\")","v":""},null,null,null,0]
[null,null,null,null,null,{"$f":"IFERROR(VLOOKUP(E346,Insumos!A:C,2,FALSE),\"\")","v":""},null,null,null,0]
[null,null,null,null,null,{"$f":"IFERROR(VLOOKUP(E347,Insumos!A:C,2,FALSE),\"\")","v":""},null,null,null,0]
[null,null,null,null,null,{"$f":"IFERROR(VLOOKUP(E348,Insumos!A:C,2,FALSE),\"\")","v":""},null,null,null,0]
[null,null,null,null,null,{"$f":"IFERROR(VLOOKUP(E349,Insumos!A:C,2,FALSE),\"\")","v":""},null,null,null,0]
[null,null,null,null,null,{"$f":"IFERROR(VLOOKUP(E350,Insumos!A:C,2,FALSE),\"\")","v":""},null,null,null,0]
[null,null,null,null,null,{"$f":"IFERROR(VLOOKUP(E351,Insumos!A:C,2,FALSE),\"\")","v":""},null,null,null,0]
[null,null,null,null,null,{"$f":"IFERROR(VLOOKUP(E352,Insumos!A:C,2,FALSE),\"\")","v":""},null,null,null,0]
[null,null,null,null,null,{"$f":"IFERROR(VLOOKUP(E353,Insumos!A:C,2,FALSE),\"\")","v":""},null,null,null,0]
[null,null,null,null,null,{"$f":"IFERROR(VLOOKUP(E354,Insumos!A:C,2,FALSE),\"\")","v":""},null,null,null,0]
[null,null,null,null,null,{"$f":"IFERROR(VLOOKUP(E355,Insumos!A:C,2,FALSE),\"\")","v":""},null,null,null,0]
[null,null,null,null,null,{"$f":"IFERROR(VLOOKUP(E356,Insumos!A:C,2,FALSE),\"\")","v":""},null,null,null,0]
[null,null,null,null,null,{"$f":"IFERROR(VLOOKUP(E357,Insumos!A:C,2,FALSE),\"\")","v":""},null,null,null,0]
[null,null,null,null,null,{"$f":"IFERROR(VLOOKUP(E358,Insumos!A:C,2,FALSE),\"\")","v":""},null,null,null,0]
[null,null,null,null,null,{"$f":"IFERROR(VLOOKUP(E359,Insumos!A:C,2,FALSE),\"\")","v":""},null,null,null,0]
[null,null,null,null,null,{"$f":"IFERROR(VLOOKUP(E360,Insumos!A:C,2,FALSE),\"\")","v":""},null,null,null,0]
[null,null,null,null,null,{"$f":"IFERROR(VLOOKUP(E361,Insumos!A:C,2,FALSE),\"\")","v":""},null,null,null,0]
[null,null,null,null,null,{"$f":"IFERROR(VLOOKUP(E362,Insumos!A:C,2,FALSE),\"\")","v":""},null,null,null,0]
[null,null,null,null,null,{"$f":"IFERROR(VLOOKUP(E363,Insumos!A:C,2,FALSE),\"\")","v":""},null,null,null,0]
[null,null,null,null,null,{"$f":"IFERROR(VLOOKUP(E364,Insumos!A:C,2,FALSE),\"\")","v":""},null,null,null,0]
[null,null,null,null,null,{"$f":"IFERROR(VLOOKUP(E365,Insumos!A:C,2,FALSE),\"\")","v":""},null,null,null,0]
[null,null,null,null,null,{"$f":"IFERROR(VLOOKUP(E366,Insumos!A:C,2,FALSE),\"\")","v":""},null,null,null,0]
[null,null,null,null,null,{"$f":"IFERROR(VLOOKUP(E367,Insumos!A:C,2,FALSE),\"\")","v":""},null,null,null,0]
[null,null,null,null,null,{"$f":"IFERROR(VLOOKUP(E368,Insumos!A:C,2,FALSE),\"\")","v":""},null,null,null,0]
[null,null,null,null,null,{"$f":"IFERROR(VLOOKUP(E369,Insumos!A:C,2,FALSE),\"\")","v":""},null,null,null,0]
[null,null,null,null,null,{"$f":"IFERROR(VLOOKUP(E370,Insumos!A:C,2,FALSE),\"\")","v":""},null,null,null,0]
[null,null,null,null,null,{"$f":"IFERROR(VLOOKUP(E371,Insumos!A:C,2,FALSE),\"\")","v":""},null,null,null,0]
[null,null,null,null,null,{"$f":"IFERROR(VLOOKUP(E372,Insumos!A:C,2,FALSE),\"\")","v":""},null,null,null,0]
[null,null,null,null,null,{"$f":"IFERROR(VLOOKUP(E373,Insumos!A:C,2,FALSE),\"\")","v":""},null,null,null,0]
[null,null,null,null,null,{"$f":"IFERROR(VLOOKUP(E374,Insumos!A:C,2,FALSE),\"\")","v":""},null,null,null,0]
[null,null,null,null,null,{"$f":"IFERROR(VLOOKUP(E375,Insumos!A:C,2,FALSE),\"\")","v":""},null,null,null,0]
[null,null,null,null,null,{"$f":"IFERROR(VLOOKUP(E376,Insumos!A:C,2,FALSE),\"\")","v":""},null,null,null,0]
[null,null,null,null,null,{"$f":"IFERROR(VLOOKUP(E377,Insumos!A:C,2,FALSE),\"\")","v":""},null,null,null,0]
[null,null,null,null,null,{"$f":"IFERROR(VLOOKUP(E378,Insumos!A:C,2,FALSE),\"\")","v":""},null,null,null,0]
[null,null,null,null,null,{"$f":"IFERROR(VLOOKUP(E379,Insumos!A:C,2,FALSE),\"\")","v":""},null,null,null,0]
[null,null,null,null,null,{"$f":"IFERROR(VLOOKUP(E380,Insumos!A:C,2,FALSE),\"\")","v":""},null,null,null,0]
[null,null,null,null,null,{"$f":"IFERROR(VLOOKUP(E381,Insumos!A:C,2,FALSE),\"\")","v":""},null,null,null,0]
[null,null,null,null,null,{"$f":"IFERROR(VLOOKUP(E382,Insumos!A:C,2,FALSE),\"\")","v":""},null,null,null,0]
[null,null,null,null,null,{"$f":"IFERROR(VLOOKUP(E383,Insumos!A:C,2,FALSE),\"\")","v":""},null,null,null,0]
[null,null,null,null,null,{"$f":"IFERROR(VLOOKUP(E384,Insumos!A:C,2,FALSE),\"\")","v":""},null,null,null,0]
[null,null,null,null,null,{"$f":"IFERROR(VLOOKUP(E385,Insumos!A:C,2,FALSE),\"\")","v":""},null,null,null,0]
[null,null,null,null,null,{"$f":"IFERROR(VLOOKUP(E386,Insumos!A:C,2,FALSE),\"\")","v":""},null,null,null,0]
[null,null,null,null,null,{"$f":"IFERROR(VLOOKUP(E387,Insumos!A:C,2,FALSE),\"\")","v":""},null,null,null,0]
[null,null,null,null,null,{"$f":"IFERROR(VLOOKUP(E388,Insumos!A:C,2,FALSE),\"\")","v":""},null,null,null,0]
[null,null,null,null,null,{"$f":"IFERROR(VLOOKUP(E389,Insumos!A:C,2,FALSE),\"\")","v":""},null,null,null,{"$f":"IFERROR(H389*I389,\"\")","v":0}]
[null,null,null,null,null,{"$f":"IFERROR(VLOOKUP(E390,Insumos!A:C,2,FALSE),\"\")","v":""},null,null,null,0]
[null,null,null,null,null,{"$f":"IFERROR(VLOOKUP(E391,Insumos!A:C,2,FALSE),\"\")","v":""},null,null,null,0]
[null,null,null,null,null,{"$f":"IFERROR(VLOOKUP(E392,Insumos!A:C,2,FALSE),\"\")","v":""},null,null,null,0]
[null,null,null,null,null,{"$f":"IFERROR(VLOOKUP(E393,Insumos!A:C,2,FALSE),\"\")","v":""},null,null,null,0]
[null,null,null,null,null,{"$f":"IFERROR(VLOOKUP(E394,Insumos!A:C,2,FALSE),\"\")","v":""},null,null,null,0]
[null,null,null,null,null,{"$f":"IFERROR(VLOOKUP(E395,Insumos!A:C,2,FALSE),\"\")","v":""},null,null,null,0]
[null,null,null,null,null,{"$f":"IFERROR(VLOOKUP(E396,Insumos!A:C,2,FALSE),\"\")","v":""},null,null,null,0]
[null,null,null,null,null,{"$f":"IFERROR(VLOOKUP(E397,Insumos!A:C,2,FALSE),\"\")","v":""},null,null,null,0]
[null,null,null,null,null,{"$f":"IFERROR(VLOOKUP(E398,Insumos!A:C,2,FALSE),\"\")","v":""},null,null,null,0]
[null,null,null,null,null,{"$f":"IFERROR(VLOOKUP(E399,Insumos!A:C,2,FALSE),\"\")","v":""},null,null,null,0]
[null,null,null,null,null,{"$f":"IFERROR(VLOOKUP(E400,Insumos!A:C,2,FALSE),\"\")","v":""},null,null,null,0]
[null,null,null,null,null,{"$f":"IFERROR(VLOOKUP(E401,Insumos!A:C,2,FALSE),\"\")","v":""},null,null,null,0]
[null,null,null,null,null,{"$f":"IFERROR(VLOOKUP(E402,Insumos!A:C,2,FALSE),\"\")","v":""},null,null,null,0]
[null,null,null,null,null,{"$f":"IFERROR(VLOOKUP(E403,Insumos!A:C,2,FALSE),\"\")","v":""},null,null,null,0]
[null,null,null,null,null,{"$f":"IFERROR(VLOOKUP(E404,Insumos!A:C,2,FALSE),\"\")","v":""},null,null,null,0]
[null,null,null,null,null,{"$f":"IFERROR(VLOOKUP(E405,Insumos!A:C,2,FALSE),\"\")","v":""},null,null,null,0]
[null,null,null,null,null,{"$f":"IFERROR(VLOOKUP(E406,Insumos!A:C,2,FALSE),\"\")","v":""},null,null,null,0]
[null,null,null,null,null,{"$f":"IFERROR(VLOOKUP(E407,Insumos!A:C,2,FALSE),\"\")","v":""},null,null,null,0]
[null,null,null,null,null,{"$f":"IFERROR(VLOOKUP(E408,Insumos!A:C,2,FALSE),\"\")","v":""},null,null,null,0]
[null,null,null,null,null,{"$f":"IFERROR(VLOOKUP(E409,Insumos!A:C,2,FALSE),\"\")","v":""},null,null,null,0]
[null,null,null,null,null,{"$f":"IFERROR(VLOOKUP(E410,Insumos!A:C,2,FALSE),\"\")","v":""},null,null,null,0]
[null,null,null,null,null,{"$f":"IFERROR(VLOOKUP(E411,Insumos!A:C,2,FALSE),\"\")","v":""},null,null,null,0]
[null,null,null,null,null,{"$f":"IFERROR(VLOOKUP(E412,Insumos!A:C,2,FALSE),\"\")","v":""},null,null,null,0]
[null,null,null,null,null,{"$f":"IFERROR(VLOOKUP(E413,Insumos!A:C,2,FALSE),\"\")","v":""},null,null,null,0]
[null,null,null,null,null,{"$f":"IFERROR(VLOOKUP(E414,Insumos!A:C,2,FALSE),\"\")","v":""},null,null,null,0]
[null,null,null,null,null,{"$f":"IFERROR(VLOOKUP(E415,Insumos!A:C,2,FALSE),\"\")","v":""},null,null,null,0]
[null,null,null,null,null,{"$f":"IFERROR(VLOOKUP(E416,Insumos!A:C,2,FALSE),\"\")","v":""},null,null,null,0]
[null,null,null,null,null,{"$f":"IFERROR(VLOOKUP(E417,Insumos!A:C,2,FALSE),\"\")","v":""},null,null,null,0]
[null,null,null,null,null,{"$f":"IFERROR(VLOOKUP(E418,Insumos!A:C,2,FALSE),\"\")","v":""},null,null,null,0]
[null,null,null,null,null,{"$f":"IFERROR(VLOOKUP(E419,Insumos!A:C,2,FALSE),\"\")","v":""},null,null,null,0]
[null,null,null,null,null,{"$f":"IFERROR(VLOOKUP(E420,Insumos!A:C,2,FALSE),\"\")","v":""},null,null,null,0]
[null,null,null,null,null,{"$f":"IFERROR(VLOOKUP(E421,Insumos!A:C,2,FALSE),\"\")","v":""},null,null,null,0]
[null,null,null,null,null,{"$f":"IFERROR(VLOOKUP(E422,Insumos!A:C,2,FALSE),\"\")","v":""},null,null,null,0]
[null,null,null,null,null,{"$f":"IFERROR(VLOOKUP(E423,Insumos!A:C,2,FALSE),\"\")","v":""},null,null,null,0]
[null,null,null,null,null,{"$f":"IFERROR(VLOOKUP(E424,Insumos!A:C,2,FALSE),\"\")","v":""},null,null,null,0]
[null,null,null,null,null,{"$f":"IFERROR(VLOOKUP(E425,Insumos!A:C,2,FALSE),\"\")","v":""},null,null,null,0]
[null,null,null,null,null,{"$f":"IFERROR(VLOOKUP(E426,Insumos!A:C,2,FALSE),\"\")","v":""},null,null,null,0]
[null,null,null,null,null,{"$f":"IFERROR(VLOOKUP(E427,Insumos!A:C,2,FALSE),\"\")","v":""},null,null,null,0]
[null,null,null,null,null,{"$f":"IFERROR(VLOOKUP(E428,Insumos!A:C,2,FALSE),\"\")","v":""},null,null,null,0]
[null,null,null,null,null,{"$f":"IFERROR(VLOOKUP(E429,Insumos!A:C,2,FALSE),\"\")","v":""},null,null,null,0]
[null,null,null,null,null,{"$f":"IFERROR(VLOOKUP(E430,Insumos!A:C,2,FALSE),\"\")","v":""},null,null,null,0]
[null,null,null,null,null,{"$f":"IFERROR(VLOOKUP(E431,Insumos!A:C,2,FALSE),\"\")","v":""},null,null,null,0]
[null,null,null,null,null,{"$f":"IFERROR(VLOOKUP(E432,Insumos!A:C,2,FALSE),\"\")","v":""},null,null,null,0]
[null,null,null,null,null,{"$f":"IFERROR(VLOOKUP(E433,Insumos!A:C,2,FALSE),\"\")","v":""},null,null,null,0]
[null,null,null,null,null,{"$f":"IFERROR(VLOOKUP(E434,Insumos!A:C,2,FALSE),\"\")","v":""},null,null,null,0]
[null,null,null,null,null,{"$f":"IFERROR(VLOOKUP(E435,Insumos!A:C,2,FALSE),\"\")","v":""},null,null,null,0]
[null,null,null,null,null,{"$f":"IFERROR(VLOOKUP(E436,Insumos!A:C,2,FALSE),\"\")","v":""},null,null,null,0]
[null,null,null,null,null,{"$f":"IFERROR(VLOOKUP(E437,Insumos!A:C,2,FALSE),\"\")","v":""},null,null,null,0]
[null,null,null,null,null,{"$f":"IFERROR(VLOOKUP(E438,Insumos!A:C,2,FALSE),\"\")","v":""},null,null,null,0]
[null,null,null,null,null,{"$f":"IFERROR(VLOOKUP(E439,Insumos!A:C,2,FALSE),\"\")","v":""},null,null,null,0]
[null,null,null,null,null,{"$f":"IFERROR(VLOOKUP(E440,Insumos!A:C,2,FALSE),\"\")","v":""},null,null,null,0]
[null,null,null,null,null,{"$f":"IFERROR(VLOOKUP(E441,Insumos!A:C,2,FALSE),\"\")","v":""},null,null,null,0]
[null,null,null,null,null,{"$f":"IFERROR(VLOOKUP(E442,Insumos!A:C,2,FALSE),\"\")","v":""},null,null,null,0]
[null,null,null,null,null,{"$f":"IFERROR(VLOOKUP(E443,Insumos!A:C,2,FALSE),\"\")","v":""},null,null,null,0]
[null,null,null,null,null,{"$f":"IFERROR(VLOOKUP(E444,Insumos!A:C,2,FALSE),\"\")","v":""},null,null,null,0]
[null,null,null,null,null,{"$f":"IFERROR(VLOOKUP(E445,Insumos!A:C,2,FALSE),\"\")","v":""},null,null,null,0]
[null,null,null,null,null,{"$f":"IFERROR(VLOOKUP(E446,Insumos!A:C,2,FALSE),\"\")","v":""},null,null,null,0]
[null,null,null,null,null,{"$f":"IFERROR(VLOOKUP(E447,Insumos!A:C,2,FALSE),\"\")","v":""},null,null,null,0]
[null,null,null,null,null,{"$f":"IFERROR(VLOOKUP(E448,Insumos!A:C,2,FALSE),\"\")","v":""},null,null,null,0]
[null,null,null,null,null,{"$f":"IFERROR(VLOOKUP(E449,Insumos!A:C,2,FALSE),\"\")","v":""},null,null,null,0]
[null,null,null,null,null,{"$f":"IFERROR(VLOOKUP(E450,Insumos!A:C,2,FALSE),\"\")","v":""},null,null,null,0]
[null,null,null,null,null,{"$f":"IFERROR(VLOOKUP(E451,Insumos!A:C,2,FALSE),\"\")","v":""},null,null,null,0]
[null,null,null,null,null,{"$f":"IFERROR(VLOOKUP(E452,Insumos!A:C,2,FALSE),\"\")","v":""},null,null,null,0]
[null,null,null,null,null,{"$f":"IFERROR(VLOOKUP(E453,Insumos!A:C,2,FALSE),\"\")","v":""},null,null,null,{"$f":"IFERROR(H453*I453,\"\")","v":0}]
[null,null,null,null,null,{"$f":"IFERROR(VLOOKUP(E454,Insumos!A:C,2,FALSE),\"\")","v":""},null,null,null,0]
[null,null,null,null,null,{"$f":"IFERROR(VLOOKUP(E455,Insumos!A:C,2,FALSE),\"\")","v":""},null,null,null,0]
[null,null,null,null,null,{"$f":"IFERROR(VLOOKUP(E456,Insumos!A:C,2,FALSE),\"\")","v":""},null,null,null,0]
[null,null,null,null,null,{"$f":"IFERROR(VLOOKUP(E457,Insumos!A:C,2,FALSE),\"\")","v":""},null,null,null,0]
[null,null,null,null,null,{"$f":"IFERROR(VLOOKUP(E458,Insumos!A:C,2,FALSE),\"\")","v":""},null,null,null,0]
[null,null,null,null,null,{"$f":"IFERROR(VLOOKUP(E459,Insumos!A:C,2,FALSE),\"\")","v":""},null,null,null,0]
[null,null,null,null,null,{"$f":"IFERROR(VLOOKUP(E460,Insumos!A:C,2,FALSE),\"\")","v":""},null,null,null,0]
[null,null,null,null,null,{"$f":"IFERROR(VLOOKUP(E461,Insumos!A:C,2,FALSE),\"\")","v":""},null,null,null,0]
[null,null,null,null,null,{"$f":"IFERROR(VLOOKUP(E462,Insumos!A:C,2,FALSE),\"\")","v":""},null,null,null,0]
[null,null,null,null,null,{"$f":"IFERROR(VLOOKUP(E463,Insumos!A:C,2,FALSE),\"\")","v":""},null,null,null,0]
[null,null,null,null,null,{"$f":"IFERROR(VLOOKUP(E464,Insumos!A:C,2,FALSE),\"\")","v":""},null,null,null,0]
[null,null,null,null,null,{"$f":"IFERROR(VLOOKUP(E465,Insumos!A:C,2,FALSE),\"\")","v":""},null,null,null,0]
[null,null,null,null,null,{"$f":"IFERROR(VLOOKUP(E466,Insumos!A:C,2,FALSE),\"\")","v":""},null,null,null,0]
[null,null,null,null,null,{"$f":"IFERROR(VLOOKUP(E467,Insumos!A:C,2,FALSE),\"\")","v":""},null,null,null,0]
[null,null,null,null,null,{"$f":"IFERROR(VLOOKUP(E468,Insumos!A:C,2,FALSE),\"\")","v":""},null,null,null,0]
[null,null,null,null,null,{"$f":"IFERROR(VLOOKUP(E469,Insumos!A:C,2,FALSE),\"\")","v":""},null,null,null,0]
[null,null,null,null,null,{"$f":"IFERROR(VLOOKUP(E470,Insumos!A:C,2,FALSE),\"\")","v":""},null,null,null,0]
[null,null,null,null,null,{"$f":"IFERROR(VLOOKUP(E471,Insumos!A:C,2,FALSE),\"\")","v":""},null,null,null,0]
[null,null,null,null,null,{"$f":"IFERROR(VLOOKUP(E472,Insumos!A:C,2,FALSE),\"\")","v":""},null,null,null,0]
[null,null,null,null,null,{"$f":"IFERROR(VLOOKUP(E473,Insumos!A:C,2,FALSE),\"\")","v":""},null,null,null,0]
[null,null,null,null,null,{"$f":"IFERROR(VLOOKUP(E474,Insumos!A:C,2,FALSE),\"\")","v":""},null,null,null,0]
[null,null,null,null,null,{"$f":"IFERROR(VLOOKUP(E475,Insumos!A:C,2,FALSE),\"\")","v":""},null,null,null,0]
[null,null,null,null,null,{"$f":"IFERROR(VLOOKUP(E476,Insumos!A:C,2,FALSE),\"\")","v":""},null,null,null,0]
[null,null,null,null,null,{"$f":"IFERROR(VLOOKUP(E477,Insumos!A:C,2,FALSE),\"\")","v":""},null,null,null,0]
[null,null,null,null,null,{"$f":"IFERROR(VLOOKUP(E478,Insumos!A:C,2,FALSE),\"\")","v":""},null,null,null,0]
[null,null,null,null,null,{"$f":"IFERROR(VLOOKUP(E479,Insumos!A:C,2,FALSE),\"\")","v":""},null,null,null,0]
[null,null,null,null,null,{"$f":"IFERROR(VLOOKUP(E480,Insumos!A:C,2,FALSE),\"\")","v":""},null,null,null,0]
[null,null,null,null,null,{"$f":"IFERROR(VLOOKUP(E481,Insumos!A:C,2,FALSE),\"\")","v":""},null,null,null,0]
[null,null,null,null,null,{"$f":"IFERROR(VLOOKUP(E482,Insumos!A:C,2,FALSE),\"\")","v":""},null,null,null,0]
[null,null,null,null,null,{"$f":"IFERROR(VLOOKUP(E483,Insumos!A:C,2,FALSE),\"\")","v":""},null,null,null,0]
[null,null,null,null,null,{"$f":"IFERROR(VLOOKUP(E484,Insumos!A:C,2,FALSE),\"\")","v":""},null,null,null,0]
[null,null,null,null,null,{"$f":"IFERROR(VLOOKUP(E485,Insumos!A:C,2,FALSE),\"\")","v":""},null,null,null,0]
[null,null,null,null,null,{"$f":"IFERROR(VLOOKUP(E486,Insumos!A:C,2,FALSE),\"\")","v":""},null,null,null,0]
[null,null,null,null,null,{"$f":"IFERROR(VLOOKUP(E487,Insumos!A:C,2,FALSE),\"\")","v":""},null,null,null,0]
[null,null,null,null,null,{"$f":"IFERROR(VLOOKUP(E488,Insumos!A:C,2,FALSE),\"\")","v":""},null,null,null,0]
[null,null,null,null,null,{"$f":"IFERROR(VLOOKUP(E489,Insumos!A:C,2,FALSE),\"\")","v":""},null,null,null,0]
[null,null,null,null,null,{"$f":"IFERROR(VLOOKUP(E490,Insumos!A:C,2,FALSE),\"\")","v":""},null,null,null,0]
[null,null,null,null,null,{"$f":"IFERROR(VLOOKUP(E491,Insumos!A:C,2,FALSE),\"\")","v":""},null,null,null,0]
[null,null,null,null,null,{"$f":"IFERROR(VLOOKUP(E492,Insumos!A:C,2,FALSE),\"\")","v":""},null,null,null,0]
[null,null,null,null,null,{"$f":"IFERROR(VLOOKUP(E493,Insumos!A:C,2,FALSE),\"\")","v":""},null,null,null,0]
[null,null,null,null,null,{"$f":"IFERROR(VLOOKUP(E494,Insumos!A:C,2,FALSE),\"\")","v":""},null,null,null,0]
[null,null,null,null,null,{"$f":"IFERROR(VLOOKUP(E495,Insumos!A:C,2,FALSE),\"\")","v":""},null,null,null,0]
[null,null,null,null,null,{"$f":"IFERROR(VLOOKUP(E496,Insumos!A:C,2,FALSE),\"\")","v":""},null,null,null,0]
[null,null,null,null,null,{"$f":"IFERROR(VLOOKUP(E497,Insumos!A:C,2,FALSE),\"\")","v":""},null,null,null,0]
[null,null,null,null,null,{"$f":"IFERROR(VLOOKUP(E498,Insumos!A:C,2,FALSE),\"\")","v":""},null,null,null,0]
[null,null,null,null,null,{"$f":"IFERROR(VLOOKUP(E499,Insumos!A:C,2,FALSE),\"\")","v":""},null,null,null,0]
[null,null,null,null,null,{"$f":"IFERROR(VLOOKUP(E500,Insumos!A:C,2,FALSE),\"\")","v":""},null,null,null,0]
[null,null,null,null,null,{"$f":"IFERROR(VLOOKUP(E501,Insumos!A:C,2,FALSE),\"\")","v":""},null,null,null,0]
[null,null,null,null,null,{"$f":"IFERROR(VLOOKUP(E502,Insumos!A:C,2,FALSE),\"\")","v":""},null,null,null,0]
[null,null,null,null,null,{"$f":"IFERROR(VLOOKUP(E503,Insumos!A:C,2,FALSE),\"\")","v":""},null,null,null,0]
[null,null,null,null,null,{"$f":"IFERROR(VLOOKUP(E504,Insumos!A:C,2,FALSE),\"\")","v":""},null,null,null,0]
[null,null,null,null,null,{"$f":"IFERROR(VLOOKUP(E505,Insumos!A:C,2,FALSE),\"\")","v":""},null,null,null,0]
[null,null,null,null,null,{"$f":"IFERROR(VLOOKUP(E506,Insumos!A:C,2,FALSE),\"\")","v":""},null,null,null,0]
[null,null,null,null,null,{"$f":"IFERROR(VLOOKUP(E507,Insumos!A:C,2,FALSE),\"\")","v":""},null,null,null,0]
[null,null,null,null,null,{"$f":"IFERROR(VLOOKUP(E508,Insumos!A:C,2,FALSE),\"\")","v":""},null,null,null,0]
[null,null,null,null,null,{"$f":"IFERROR(VLOOKUP(E509,Insumos!A:C,2,FALSE),\"\")","v":""},null,null,null,0]
[null,null,null,null,null,{"$f":"IFERROR(VLOOKUP(E510,Insumos!A:C,2,FALSE),\"\")","v":""},null,null,null,0]
[null,null,null,null,null,{"$f":"IFERROR(VLOOKUP(E511,Insumos!A:C,2,FALSE),\"\")","v":""},null,null,null,0]
[null,null,null,null,null,{"$f":"IFERROR(VLOOKUP(E512,Insumos!A:C,2,FALSE),\"\")","v":""},null,null,null,0]
[null,null,null,null,null,{"$f":"IFERROR(VLOOKUP(E513,Insumos!A:C,2,FALSE),\"\")","v":""},null,null,null,0]
[null,null,null,null,null,{"$f":"IFERROR(VLOOKUP(E514,Insumos!A:C,2,FALSE),\"\")","v":""},null,null,null,0]
[null,null,null,null,null,{"$f":"IFERROR(VLOOKUP(E515,Insumos!A:C,2,FALSE),\"\")","v":""},null,null,null,0]
[null,null,null,null,null,{"$f":"IFERROR(VLOOKUP(E516,Insumos!A:C,2,FALSE),\"\")","v":""},null,null,null,0]
[null,null,null,null,null,{"$f":"IFERROR(VLOOKUP(E517,Insumos!A:C,2,FALSE),\"\")","v":""},null,null,null,{"$f":"IFERROR(H517*I517,\"\")","v":0}]
[null,null,null,null,null,{"$f":"IFERROR(VLOOKUP(E518,Insumos!A:C,2,FALSE),\"\")","v":""},null,null,null,0]
[null,null,null,null,null,{"$f":"IFERROR(VLOOKUP(E519,Insumos!A:C,2,FALSE),\"\")","v":""},null,null,null,0]
[null,null,null,null,null,{"$f":"IFERROR(VLOOKUP(E520,Insumos!A:C,2,FALSE),\"\")","v":""},null,null,null,0]
[null,null,null,null,null,{"$f":"IFERROR(VLOOKUP(E521,Insumos!A:C,2,FALSE),\"\")","v":""},null,null,null,0]
[null,null,null,null,null,{"$f":"IFERROR(VLOOKUP(E522,Insumos!A:C,2,FALSE),\"\")","v":""},null,null,null,0]
[null,null,null,null,null,{"$f":"IFERROR(VLOOKUP(E523,Insumos!A:C,2,FALSE),\"\")","v":""},null,null,null,0]
[null,null,null,null,null,{"$f":"IFERROR(VLOOKUP(E524,Insumos!A:C,2,FALSE),\"\")","v":""},null,null,null,0]
[null,null,null,null,null,{"$f":"IFERROR(VLOOKUP(E525,Insumos!A:C,2,FALSE),\"\")","v":""},null,null,null,0]
[null,null,null,null,null,{"$f":"IFERROR(VLOOKUP(E526,Insumos!A:C,2,FALSE),\"\")","v":""},null,null,null,0]
[null,null,null,null,null,{"$f":"IFERROR(VLOOKUP(E527,Insumos!A:C,2,FALSE),\"\")","v":""},null,null,null,0]
[null,null,null,null,null,{"$f":"IFERROR(VLOOKUP(E528,Insumos!A:C,2,FALSE),\"\")","v":""},null,null,null,0]
[null,null,null,null,null,{"$f":"IFERROR(VLOOKUP(E529,Insumos!A:C,2,FALSE),\"\")","v":""},null,null,null,0]
[null,null,null,null,null,{"$f":"IFERROR(VLOOKUP(E530,Insumos!A:C,2,FALSE),\"\")","v":""},null,null,null,0]
[null,null,null,null,null,{"$f":"IFERROR(VLOOKUP(E531,Insumos!A:C,2,FALSE),\"\")","v":""},null,null,null,0]
[null,null,null,null,null,{"$f":"IFERROR(VLOOKUP(E532,Insumos!A:C,2,FALSE),\"\")","v":""},null,null,null,0]
[null,null,null,null,null,{"$f":"IFERROR(VLOOKUP(E533,Insumos!A:C,2,FALSE),\"\")","v":""},null,null,null,0]
[null,null,null,null,null,{"$f":"IFERROR(VLOOKUP(E534,Insumos!A:C,2,FALSE),\"\")","v":""},null,null,null,0]
[null,null,null,null,null,{"$f":"IFERROR(VLOOKUP(E535,Insumos!A:C,2,FALSE),\"\")","v":""},null,null,null,0]
[null,null,null,null,null,{"$f":"IFERROR(VLOOKUP(E536,Insumos!A:C,2,FALSE),\"\")","v":""},null,null,null,0]
[null,null,null,null,null,{"$f":"IFERROR(VLOOKUP(E537,Insumos!A:C,2,FALSE),\"\")","v":""},null,null,null,0]
[null,null,null,null,null,{"$f":"IFERROR(VLOOKUP(E538,Insumos!A:C,2,FALSE),\"\")","v":""},null,null,null,0]
[null,null,null,null,null,{"$f":"IFERROR(VLOOKUP(E539,Insumos!A:C,2,FALSE),\"\")","v":""},null,null,null,0]
[null,null,null,null,null,{"$f":"IFERROR(VLOOKUP(E540,Insumos!A:C,2,FALSE),\"\")","v":""},null,null,null,0]
[null,null,null,null,null,{"$f":"IFERROR(VLOOKUP(E541,Insumos!A:C,2,FALSE),\"\")","v":""},null,null,null,0]
[null,null,null,null,null,{"$f":"IFERROR(VLOOKUP(E542,Insumos!A:C,2,FALSE),\"\")","v":""},null,null,null,0]
[null,null,null,null,null,{"$f":"IFERROR(VLOOKUP(E543,Insumos!A:C,2,FALSE),\"\")","v":""},null,null,null,0]
[null,null,null,null,null,{"$f":"IFERROR(VLOOKUP(E544,Insumos!A:C,2,FALSE),\"\")","v":""},null,null,null,0]
[null,null,null,null,null,{"$f":"IFERROR(VLOOKUP(E545,Insumos!A:C,2,FALSE),\"\")","v":""},null,null,null,0]
[null,null,null,null,null,{"$f":"IFERROR(VLOOKUP(E546,Insumos!A:C,2,FALSE),\"\")","v":""},null,null,null,0]
[null,null,null,null,null,{"$f":"IFERROR(VLOOKUP(E547,Insumos!A:C,2,FALSE),\"\")","v":""},null,null,null,0]
[null,null,null,null,null,{"$f":"IFERROR(VLOOKUP(E548,Insumos!A:C,2,FALSE),\"\")","v":""},null,null,null,0]
[null,null,null,null,null,{"$f":"IFERROR(VLOOKUP(E549,Insumos!A:C,2,FALSE),\"\")","v":""},null,null,null,0]
[null,null,null,null,null,{"$f":"IFERROR(VLOOKUP(E550,Insumos!A:C,2,FALSE),\"\")","v":""},null,null,null,0]
[null,null,null,null,null,{"$f":"IFERROR(VLOOKUP(E551,Insumos!A:C,2,FALSE),\"\")","v":""},null,null,null,0]
[null,null,null,null,null,{"$f":"IFERROR(VLOOKUP(E552,Insumos!A:C,2,FALSE),\"\")","v":""},null,null,null,0]
[null,null,null,null,null,{"$f":"IFERROR(VLOOKUP(E553,Insumos!A:C,2,FALSE),\"\")","v":""},null,null,null,0]
[null,null,null,null,null,{"$f":"IFERROR(VLOOKUP(E554,Insumos!A:C,2,FALSE),\"\")","v":""},null,null,null,0]
[null,null,null,null,null,{"$f":"IFERROR(VLOOKUP(E555,Insumos!A:C,2,FALSE),\"\")","v":""},null,null,null,0]
[null,null,null,null,null,{"$f":"IFERROR(VLOOKUP(E556,Insumos!A:C,2,FALSE),\"\")","v":""},null,null,null,0]
[null,null,null,null,null,{"$f":"IFERROR(VLOOKUP(E557,Insumos!A:C,2,FALSE),\"\")","v":""},null,null,null,0]
[null,null,null,null,null,{"$f":"IFERROR(VLOOKUP(E558,Insumos!A:C,2,FALSE),\"\")","v":""},null,null,null,0]
[null,null,null,null,null,{"$f":"IFERROR(VLOOKUP(E559,Insumos!A:C,2,FALSE),\"\")","v":""},null,null,null,0]
[null,null,null,null,null,{"$f":"IFERROR(VLOOKUP(E560,Insumos!A:C,2,FALSE),\"\")","v":""},null,null,null,0]
[null,null,null,null,null,{"$f":"IFERROR(VLOOKUP(E561,Insumos!A:C,2,FALSE),\"\")","v":""},null,null,null,0]
[null,null,null,null,null,{"$f":"IFERROR(VLOOKUP(E562,Insumos!A:C,2,FALSE),\"\")","v":""},null,null,null,0]
[null,null,null,null,null,{"$f":"IFERROR(VLOOKUP(E563,Insumos!A:C,2,FALSE),\"\")","v":""},null,null,null,0]
[null,null,null,null,null,{"$f":"IFERROR(VLOOKUP(E564,Insumos!A:C,2,FALSE),\"\")","v":""},null,null,null,0]
[null,null,null,null,null,{"$f":"IFERROR(VLOOKUP(E565,Insumos!A:C,2,FALSE),\"\")","v":""},null,null,null,0]
[null,null,null,null,null,{"$f":"IFERROR(VLOOKUP(E566,Insumos!A:C,2,FALSE),\"\")","v":""},null,null,null,0]
[null,null,null,null,null,{"$f":"IFERROR(VLOOKUP(E567,Insumos!A:C,2,FALSE),\"\")","v":""},null,null,null,0]
[null,null,null,null,null,{"$f":"IFERROR(VLOOKUP(E568,Insumos!A:C,2,FALSE),\"\")","v":""},null,null,null,0]
[null,null,null,null,null,{"$f":"IFERROR(VLOOKUP(E569,Insumos!A:C,2,FALSE),\"\")","v":""},null,null,null,0]
[null,null,null,null,null,{"$f":"IFERROR(VLOOKUP(E570,Insumos!A:C,2,FALSE),\"\")","v":""},null,null,null,0]
[null,null,null,null,null,{"$f":"IFERROR(VLOOKUP(E571,Insumos!A:C,2,FALSE),\"\")","v":""},null,null,null,0]
[null,null,null,null,null,{"$f":"IFERROR(VLOOKUP(E572,Insumos!A:C,2,FALSE),\"\")","v":""},null,null,null,0]
[null,null,null,null,null,{"$f":"IFERROR(VLOOKUP(E573,Insumos!A:C,2,FALSE),\"\")","v":""},null,null,null,0]
[null,null,null,null,null,{"$f":"IFERROR(VLOOKUP(E574,Insumos!A:C,2,FALSE),\"\")","v":""},null,null,null,0]
[null,null,null,null,null,{"$f":"IFERROR(VLOOKUP(E575,Insumos!A:C,2,FALSE),\"\")","v":""},null,null,null,0]
[null,null,null,null,null,{"$f":"IFERROR(VLOOKUP(E576,Insumos!A:C,2,FALSE),\"\")","v":""},null,null,null,0]
[null,null,null,null,null,{"$f":"IFERROR(VLOOKUP(E577,Insumos!A:C,2,FALSE),\"\")","v":""},null,null,null,0]
[null,null,null,null,null,{"$f":"IFERROR(VLOOKUP(E578,Insumos!A:C,2,FALSE),\"\")","v":""},null,null,null,0]
[null,null,null,null,null,{"$f":"IFERROR(VLOOKUP(E579,Insumos!A:C,2,FALSE),\"\")","v":""},null,null,null,0]
[null,null,null,null,null,{"$f":"IFERROR(VLOOKUP(E580,Insumos!A:C,2,FALSE),\"\")","v":""},null,null,null,0]
[null,null,null,null,null,{"$f":"IFERROR(VLOOKUP(E581,Insumos!A:C,2,FALSE),\"\")","v":""},null,null,null,{"$f":"IFERROR(H581*I581,\"\")","v":0}]
[null,null,null,null,null,{"$f":"IFERROR(VLOOKUP(E582,Insumos!A:C,2,FALSE),\"\")","v":""},null,null,null,0]
[null,null,null,null,null,{"$f":"IFERROR(VLOOKUP(E583,Insumos!A:C,2,FALSE),\"\")","v":""},null,null,null,0]
[null,null,null,null,null,{"$f":"IFERROR(VLOOKUP(E584,Insumos!A:C,2,FALSE),\"\")","v":""},null,null,null,0]
[null,null,null,null,null,{"$f":"IFERROR(VLOOKUP(E585,Insumos!A:C,2,FALSE),\"\")","v":""},null,null,null,0]
[null,null,null,null,null,{"$f":"IFERROR(VLOOKUP(E586,Insumos!A:C,2,FALSE),\"\")","v":""},null,null,null,0]
[null,null,null,null,null,{"$f":"IFERROR(VLOOKUP(E587,Insumos!A:C,2,FALSE),\"\")","v":""},null,null,null,0]
[null,null,null,null,null,{"$f":"IFERROR(VLOOKUP(E588,Insumos!A:C,2,FALSE),\"\")","v":""},null,null,null,0]
[null,null,null,null,null,{"$f":"IFERROR(VLOOKUP(E589,Insumos!A:C,2,FALSE),\"\")","v":""},null,null,null,0]
[null,null,null,null,null,{"$f":"IFERROR(VLOOKUP(E590,Insumos!A:C,2,FALSE),\"\")","v":""},null,null,null,0]
[null,null,null,null,null,{"$f":"IFERROR(VLOOKUP(E591,Insumos!A:C,2,FALSE),\"\")","v":""},null,null,null,0]
[null,null,null,null,null,{"$f":"IFERROR(VLOOKUP(E592,Insumos!A:C,2,FALSE),\"\")","v":""},null,null,null,0]
[null,null,null,null,null,{"$f":"IFERROR(VLOOKUP(E593,Insumos!A:C,2,FALSE),\"\")","v":""},null,null,null,0]
[null,null,null,null,null,{"$f":"IFERROR(VLOOKUP(E594,Insumos!A:C,2,FALSE),\"\")","v":""},null,null,null,0]
[null,null,null,null,null,{"$f":"IFERROR(VLOOKUP(E595,Insumos!A:C,2,FALSE),\"\")","v":""},null,null,null,0]
[null,null,null,null,null,{"$f":"IFERROR(VLOOKUP(E596,Insumos!A:C,2,FALSE),\"\")","v":""},null,null,null,0]
[null,null,null,null,null,{"$f":"IFERROR(VLOOKUP(E597,Insumos!A:C,2,FALSE),\"\")","v":""},null,null,null,0]
[null,null,null,null,null,{"$f":"IFERROR(VLOOKUP(E598,Insumos!A:C,2,FALSE),\"\")","v":""},null,null,null,0]
[null,null,null,null,null,{"$f":"IFERROR(VLOOKUP(E599,Insumos!A:C,2,FALSE),\"\")","v":""},null,null,null,0]
[null,null,null,null,null,{"$f":"IFERROR(VLOOKUP(E600,Insumos!A:C,2,FALSE),\"\")","v":""},null,null,null,0]
[null,null,null,null,null,{"$f":"IFERROR(VLOOKUP(E601,Insumos!A:C,2,FALSE),\"\")","v":""},null,null,null,0]
[null,null,null,null,null,{"$f":"IFERROR(VLOOKUP(E602,Insumos!A:C,2,FALSE),\"\")","v":""},null,null,null,0]
[null,null,null,null,null,{"$f":"IFERROR(VLOOKUP(E603,Insumos!A:C,2,FALSE),\"\")","v":""},null,null,null,0]
[null,null,null,null,null,{"$f":"IFERROR(VLOOKUP(E604,Insumos!A:C,2,FALSE),\"\")","v":""},null,null,null,0]
[null,null,null,null,null,{"$f":"IFERROR(VLOOKUP(E605,Insumos!A:C,2,FALSE),\"\")","v":""},null,null,null,0]
[null,null,null,null,null,{"$f":"IFERROR(VLOOKUP(E606,Insumos!A:C,2,FALSE),\"\")","v":""},null,null,null,0]
[null,null,null,null,null,{"$f":"IFERROR(VLOOKUP(E607,Insumos!A:C,2,FALSE),\"\")","v":""},null,null,null,0]
[null,null,null,null,null,{"$f":"IFERROR(VLOOKUP(E608,Insumos!A:C,2,FALSE),\"\")","v":""},null,null,null,0]
[null,null,null,null,null,{"$f":"IFERROR(VLOOKUP(E609,Insumos!A:C,2,FALSE),\"\")","v":""},null,null,null,0]
[null,null,null,null,null,{"$f":"IFERROR(VLOOKUP(E610,Insumos!A:C,2,FALSE),\"\")","v":""},null,null,null,0]
[null,null,null,null,null,{"$f":"IFERROR(VLOOKUP(E611,Insumos!A:C,2,FALSE),\"\")","v":""},null,null,null,0]
[null,null,null,null,null,{"$f":"IFERROR(VLOOKUP(E612,Insumos!A:C,2,FALSE),\"\")","v":""},null,null,null,0]
[null,null,null,null,null,{"$f":"IFERROR(VLOOKUP(E613,Insumos!A:C,2,FALSE),\"\")","v":""},null,null,null,0]
[null,null,null,null,null,{"$f":"IFERROR(VLOOKUP(E614,Insumos!A:C,2,FALSE),\"\")","v":""},null,null,null,0]
[null,null,null,null,null,{"$f":"IFERROR(VLOOKUP(E615,Insumos!A:C,2,FALSE),\"\")","v":""},null,null,null,0]
[null,null,null,null,null,{"$f":"IFERROR(VLOOKUP(E616,Insumos!A:C,2,FALSE),\"\")","v":""},null,null,null,0]
[null,null,null,null,null,{"$f":"IFERROR(VLOOKUP(E617,Insumos!A:C,2,FALSE),\"\")","v":""},null,null,null,0]
[null,null,null,null,null,{"$f":"IFERROR(VLOOKUP(E618,Insumos!A:C,2,FALSE),\"\")","v":""},null,null,null,0]
[null,null,null,null,null,{"$f":"IFERROR(VLOOKUP(E619,Insumos!A:C,2,FALSE),\"\")","v":""},null,null,null,0]
[null,null,null,null,null,{"$f":"IFERROR(VLOOKUP(E620,Insumos!A:C,2,FALSE),\"\")","v":""},null,null,null,0]
[null,null,null,null,null,{"$f":"IFERROR(VLOOKUP(E621,Insumos!A:C,2,FALSE),\"\")","v":""},null,null,null,0]
[null,null,null,null,null,{"$f":"IFERROR(VLOOKUP(E622,Insumos!A:C,2,FALSE),\"\")","v":""},null,null,null,0]
[null,null,null,null,null,{"$f":"IFERROR(VLOOKUP(E623,Insumos!A:C,2,FALSE),\"\")","v":""},null,null,null,0]
[null,null,null,null,null,{"$f":"IFERROR(VLOOKUP(E624,Insumos!A:C,2,FALSE),\"\")","v":""},null,null,null,0]
[null,null,null,null,null,{"$f":"IFERROR(VLOOKUP(E625,Insumos!A:C,2,FALSE),\"\")","v":""},null,null,null,0]
[null,null,null,null,null,{"$f":"IFERROR(VLOOKUP(E626,Insumos!A:C,2,FALSE),\"\")","v":""},null,null,null,0]
[null,null,null,null,null,{"$f":"IFERROR(VLOOKUP(E627,Insumos!A:C,2,FALSE),\"\")","v":""},null,null,null,0]
[null,null,null,null,null,{"$f":"IFERROR(VLOOKUP(E628,Insumos!A:C,2,FALSE),\"\")","v":""},null,null,null,0]
[null,null,null,null,null,{"$f":"IFERROR(VLOOKUP(E629,Insumos!A:C,2,FALSE),\"\")","v":""},null,null,null,0]
[null,null,null,null,null,{"$f":"IFERROR(VLOOKUP(E630,Insumos!A:C,2,FALSE),\"\")","v":""},null,null,null,0]
[null,null,null,null,null,{"$f":"IFERROR(VLOOKUP(E631,Insumos!A:C,2,FALSE),\"\")","v":""},null,null,null,0]
[null,null,null,null,null,{"$f":"IFERROR(VLOOKUP(E632,Insumos!A:C,2,FALSE),\"\")","v":""},null,null,null,0]
[null,null,null,null,null,{"$f":"IFERROR(VLOOKUP(E633,Insumos!A:C,2,FALSE),\"\")","v":""},null,null,null,0]
[null,null,null,null,null,{"$f":"IFERROR(VLOOKUP(E634,Insumos!A:C,2,FALSE),\"\")","v":""},null,null,null,0]
[null,null,null,null,null,{"$f":"IFERROR(VLOOKUP(E635,Insumos!A:C,2,FALSE),\"\")","v":""},null,null,null,0]
[null,null,null,null,null,{"$f":"IFERROR(VLOOKUP(E636,Insumos!A:C,2,FALSE),\"\")","v":""},null,null,null,0]
[null,null,null,null,null,{"$f":"IFERROR(VLOOKUP(E637,Insumos!A:C,2,FALSE),\"\")","v":""},null,null,null,0]
[null,null,null,null,null,{"$f":"IFERROR(VLOOKUP(E638,Insumos!A:C,2,FALSE),\"\")","v":""},null,null,null,0]
[null,null,null,null,null,{"$f":"IFERROR(VLOOKUP(E639,Insumos!A:C,2,FALSE),\"\")","v":""},null,null,null,0]
[null,null,null,null,null,{"$f":"IFERROR(VLOOKUP(E640,Insumos!A:C,2,FALSE),\"\")","v":""},null,null,null,0]
[null,null,null,null,null,{"$f":"IFERROR(VLOOKUP(E641,Insumos!A:C,2,FALSE),\"\")","v":""},null,null,null,0]
[null,null,null,null,null,{"$f":"IFERROR(VLOOKUP(E642,Insumos!A:C,2,FALSE),\"\")","v":""},null,null,null,0]
[null,null,null,null,null,{"$f":"IFERROR(VLOOKUP(E643,Insumos!A:C,2,FALSE),\"\")","v":""},null,null,null,0]
[null,null,null,null,null,{"$f":"IFERROR(VLOOKUP(E644,Insumos!A:C,2,FALSE),\"\")","v":""},null,null,null,0]
[null,null,null,null,null,{"$f":"IFERROR(VLOOKUP(E645,Insumos!A:C,2,FALSE),\"\")","v":""},null,null,null,{"$f":"IFERROR(H645*I645,\"\")","v":0}]
[null,null,null,null,null,{"$f":"IFERROR(VLOOKUP(E646,Insumos!A:C,2,FALSE),\"\")","v":""},null,null,null,0]
[null,null,null,null,null,{"$f":"IFERROR(VLOOKUP(E647,Insumos!A:C,2,FALSE),\"\")","v":""},null,null,null,0]
[null,null,null,null,null,{"$f":"IFERROR(VLOOKUP(E648,Insumos!A:C,2,FALSE),\"\")","v":""},null,null,null,0]
[null,null,null,null,null,{"$f":"IFERROR(VLOOKUP(E649,Insumos!A:C,2,FALSE),\"\")","v":""},null,null,null,0]
[null,null,null,null,null,{"$f":"IFERROR(VLOOKUP(E650,Insumos!A:C,2,FALSE),\"\")","v":""},null,null,null,0]
[null,null,null,null,null,{"$f":"IFERROR(VLOOKUP(E651,Insumos!A:C,2,FALSE),\"\")","v":""},null,null,null,0]
[null,null,null,null,null,{"$f":"IFERROR(VLOOKUP(E652,Insumos!A:C,2,FALSE),\"\")","v":""},null,null,null,0]
[null,null,null,null,null,{"$f":"IFERROR(VLOOKUP(E653,Insumos!A:C,2,FALSE),\"\")","v":""},null,null,null,0]
[null,null,null,null,null,{"$f":"IFERROR(VLOOKUP(E654,Insumos!A:C,2,FALSE),\"\")","v":""},null,null,null,0]
[null,null,null,null,null,{"$f":"IFERROR(VLOOKUP(E655,Insumos!A:C,2,FALSE),\"\")","v":""},null,null,null,0]
[null,null,null,null,null,{"$f":"IFERROR(VLOOKUP(E656,Insumos!A:C,2,FALSE),\"\")","v":""},null,null,null,0]
[null,null,null,null,null,{"$f":"IFERROR(VLOOKUP(E657,Insumos!A:C,2,FALSE),\"\")","v":""},null,null,null,0]
[null,null,null,null,null,{"$f":"IFERROR(VLOOKUP(E658,Insumos!A:C,2,FALSE),\"\")","v":""},null,null,null,0]
[null,null,null,null,null,{"$f":"IFERROR(VLOOKUP(E659,Insumos!A:C,2,FALSE),\"\")","v":""},null,null,null,0]
[null,null,null,null,null,{"$f":"IFERROR(VLOOKUP(E660,Insumos!A:C,2,FALSE),\"\")","v":""},null,null,null,0]
[null,null,null,null,null,{"$f":"IFERROR(VLOOKUP(E661,Insumos!A:C,2,FALSE),\"\")","v":""},null,null,null,0]
[null,null,null,null,null,{"$f":"IFERROR(VLOOKUP(E662,Insumos!A:C,2,FALSE),\"\")","v":""},null,null,null,0]
[null,null,null,null,null,{"$f":"IFERROR(VLOOKUP(E663,Insumos!A:C,2,FALSE),\"\")","v":""},null,null,null,0]
[null,null,null,null,null,{"$f":"IFERROR(VLOOKUP(E664,Insumos!A:C,2,FALSE),\"\")","v":""},null,null,null,0]
[null,null,null,null,null,{"$f":"IFERROR(VLOOKUP(E665,Insumos!A:C,2,FALSE),\"\")","v":""},null,null,null,0]
[null,null,null,null,null,{"$f":"IFERROR(VLOOKUP(E666,Insumos!A:C,2,FALSE),\"\")","v":""},null,null,null,0]
[null,null,null,null,null,{"$f":"IFERROR(VLOOKUP(E667,Insumos!A:C,2,FALSE),\"\")","v":""},null,null,null,0]
[null,null,null,null,null,{"$f":"IFERROR(VLOOKUP(E668,Insumos!A:C,2,FALSE),\"\")","v":""},null,null,null,0]
[null,null,null,null,null,{"$f":"IFERROR(VLOOKUP(E669,Insumos!A:C,2,FALSE),\"\")","v":""},null,null,null,0]
[null,null,null,null,null,{"$f":"IFERROR(VLOOKUP(E670,Insumos!A:C,2,FALSE),\"\")","v":""},null,null,null,0]
[null,null,null,null,null,{"$f":"IFERROR(VLOOKUP(E671,Insumos!A:C,2,FALSE),\"\")","v":""},null,null,null,0]
[null,null,null,null,null,{"$f":"IFERROR(VLOOKUP(E672,Insumos!A:C,2,FALSE),\"\")","v":""},null,null,null,0]
[null,null,null,null,null,{"$f":"IFERROR(VLOOKUP(E673,Insumos!A:C,2,FALSE),\"\")","v":""},null,null,null,0]
[null,null,null,null,null,{"$f":"IFERROR(VLOOKUP(E674,Insumos!A:C,2,FALSE),\"\")","v":""},null,null,null,0]
[null,null,null,null,null,{"$f":"IFERROR(VLOOKUP(E675,Insumos!A:C,2,FALSE),\"\")","v":""},null,null,null,0]
[null,null,null,null,null,{"$f":"IFERROR(VLOOKUP(E676,Insumos!A:C,2,FALSE),\"\")","v":""},null,null,null,0]
[null,null,null,null,null,{"$f":"IFERROR(VLOOKUP(E677,Insumos!A:C,2,FALSE),\"\")","v":""},null,null,null,0]
[null,null,null,null,null,{"$f":"IFERROR(VLOOKUP(E678,Insumos!A:C,2,FALSE),\"\")","v":""},null,null,null,0]
[null,null,null,null,null,{"$f":"IFERROR(VLOOKUP(E679,Insumos!A:C,2,FALSE),\"\")","v":""},null,null,null,0]
[null,null,null,null,null,{"$f":"IFERROR(VLOOKUP(E680,Insumos!A:C,2,FALSE),\"\")","v":""},null,null,null,0]
[null,null,null,null,null,{"$f":"IFERROR(VLOOKUP(E681,Insumos!A:C,2,FALSE),\"\")","v":""},null,null,null,0]
[null,null,null,null,null,{"$f":"IFERROR(VLOOKUP(E682,Insumos!A:C,2,FALSE),\"\")","v":""},null,null,null,0]
[null,null,null,null,null,{"$f":"IFERROR(VLOOKUP(E683,Insumos!A:C,2,FALSE),\"\")","v":""},null,null,null,0]
[null,null,null,null,null,{"$f":"IFERROR(VLOOKUP(E684,Insumos!A:C,2,FALSE),\"\")","v":""},null,null,null,0]
[null,null,null,null,null,{"$f":"IFERROR(VLOOKUP(E685,Insumos!A:C,2,FALSE),\"\")","v":""},null,null,null,0]
[null,null,null,null,null,{"$f":"IFERROR(VLOOKUP(E686,Insumos!A:C,2,FALSE),\"\")","v":""},null,null,null,0]
[null,null,null,null,null,{"$f":"IFERROR(VLOOKUP(E687,Insumos!A:C,2,FALSE),\"\")","v":""},null,null,null,0]
[null,null,null,null,null,{"$f":"IFERROR(VLOOKUP(E688,Insumos!A:C,2,FALSE),\"\")","v":""},null,null,null,0]
[null,null,null,null,null,{"$f":"IFERROR(VLOOKUP(E689,Insumos!A:C,2,FALSE),\"\")","v":""},null,null,null,0]
[null,null,null,null,null,{"$f":"IFERROR(VLOOKUP(E690,Insumos!A:C,2,FALSE),\"\")","v":""},null,null,null,0]
[null,null,null,null,null,{"$f":"IFERROR(VLOOKUP(E691,Insumos!A:C,2,FALSE),\"\")","v":""},null,null,null,0]
[null,null,null,null,null,{"$f":"IFERROR(VLOOKUP(E692,Insumos!A:C,2,FALSE),\"\")","v":""},null,null,null,0]
[null,null,null,null,null,{"$f":"IFERROR(VLOOKUP(E693,Insumos!A:C,2,FALSE),\"\")","v":""},null,null,null,0]
[null,null,null,null,null,{"$f":"IFERROR(VLOOKUP(E694,Insumos!A:C,2,FALSE),\"\")","v":""},null,null,null,0]
[null,null,null,null,null,{"$f":"IFERROR(VLOOKUP(E695,Insumos!A:C,2,FALSE),\"\")","v":""},null,null,null,0]
[null,null,null,null,null,{"$f":"IFERROR(VLOOKUP(E696,Insumos!A:C,2,FALSE),\"\")","v":""},null,null,null,0]
[null,null,null,null,null,{"$f":"IFERROR(VLOOKUP(E697,Insumos!A:C,2,FALSE),\"\")","v":""},null,null,null,0]
[null,null,null,null,null,{"$f":"IFERROR(VLOOKUP(E698,Insumos!A:C,2,FALSE),\"\")","v":""},null,null,null,0]
[null,null,null,null,null,{"$f":"IFERROR(VLOOKUP(E699,Insumos!A:C,2,FALSE),\"\")","v":""},null,null,null,0]
[null,null,null,null,null,{"$f":"IFERROR(VLOOKUP(E700,Insumos!A:C,2,FALSE),\"\")","v":""},null,null,null,0]
[null,null,null,null,null,{"$f":"IFERROR(VLOOKUP(E701,Insumos!A:C,2,FALSE),\"\")","v":""},null,null,null,0]
[null,null,null,null,null,{"$f":"IFERROR(VLOOKUP(E702,Insumos!A:C,2,FALSE),\"\")","v":""},null,null,null,0]
[null,null,null,null,null,{"$f":"IFERROR(VLOOKUP(E703,Insumos!A:C,2,FALSE),\"\")","v":""},null,null,null,0]
[null,null,null,null,null,{"$f":"IFERROR(VLOOKUP(E704,Insumos!A:C,2,FALSE),\"\")","v":""},null,null,null,0]
[null,null,null,null,null,{"$f":"IFERROR(VLOOKUP(E705,Insumos!A:C,2,FALSE),\"\")","v":""},null,null,null,0]
[null,null,null,null,null,{"$f":"IFERROR(VLOOKUP(E706,Insumos!A:C,2,FALSE),\"\")","v":""},null,null,null,0]
[null,null,null,null,null,{"$f":"IFERROR(VLOOKUP(E707,Insumos!A:C,2,FALSE),\"\")","v":""},null,null,null,0]
[null,null,null,null,null,{"$f":"IFERROR(VLOOKUP(E708,Insumos!A:C,2,FALSE),\"\")","v":""},null,null,null,0]
[null,null,null,null,null,{"$f":"IFERROR(VLOOKUP(E709,Insumos!A:C,2,FALSE),\"\")","v":""},null,null,null,{"$f":"IFERROR(H709*I709,\"\")","v":0}]
[null,null,null,null,null,{"$f":"IFERROR(VLOOKUP(E710,Insumos!A:C,2,FALSE),\"\")","v":""},null,null,null,0]
[null,null,null,null,null,{"$f":"IFERROR(VLOOKUP(E711,Insumos!A:C,2,FALSE),\"\")","v":""},null,null,null,0]
[null,null,null,null,null,{"$f":"IFERROR(VLOOKUP(E712,Insumos!A:C,2,FALSE),\"\")","v":""},null,null,null,0]
[null,null,null,null,null,{"$f":"IFERROR(VLOOKUP(E713,Insumos!A:C,2,FALSE),\"\")","v":""},null,null,null,0]
[null,null,null,null,null,{"$f":"IFERROR(VLOOKUP(E714,Insumos!A:C,2,FALSE),\"\")","v":""},null,null,null,0]
[null,null,null,null,null,{"$f":"IFERROR(VLOOKUP(E715,Insumos!A:C,2,FALSE),\"\")","v":""},null,null,null,0]
[null,null,null,null,null,{"$f":"IFERROR(VLOOKUP(E716,Insumos!A:C,2,FALSE),\"\")","v":""},null,null,null,0]
[null,null,null,null,null,{"$f":"IFERROR(VLOOKUP(E717,Insumos!A:C,2,FALSE),\"\")","v":""},null,null,null,0]
[null,null,null,null,null,{"$f":"IFERROR(VLOOKUP(E718,Insumos!A:C,2,FALSE),\"\")","v":""},null,null,null,0]
[null,null,null,null,null,{"$f":"IFERROR(VLOOKUP(E719,Insumos!A:C,2,FALSE),\"\")","v":""},null,null,null,0]
[null,null,null,null,null,{"$f":"IFERROR(VLOOKUP(E720,Insumos!A:C,2,FALSE),\"\")","v":""},null,null,null,0]
[null,null,null,null,null,{"$f":"IFERROR(VLOOKUP(E721,Insumos!A:C,2,FALSE),\"\")","v":""},null,null,null,0]
[null,null,null,null,null,{"$f":"IFERROR(VLOOKUP(E722,Insumos!A:C,2,FALSE),\"\")","v":""},null,null,null,0]
[null,null,null,null,null,{"$f":"IFERROR(VLOOKUP(E723,Insumos!A:C,2,FALSE),\"\")","v":""},null,null,null,0]
[null,null,null,null,null,{"$f":"IFERROR(VLOOKUP(E724,Insumos!A:C,2,FALSE),\"\")","v":""},null,null,null,0]
[null,null,null,null,null,{"$f":"IFERROR(VLOOKUP(E725,Insumos!A:C,2,FALSE),\"\")","v":""},null,null,null,0]
[null,null,null,null,null,{"$f":"IFERROR(VLOOKUP(E726,Insumos!A:C,2,FALSE),\"\")","v":""},null,null,null,0]
[null,null,null,null,null,{"$f":"IFERROR(VLOOKUP(E727,Insumos!A:C,2,FALSE),\"\")","v":""},null,null,null,0]
[null,null,null,null,null,{"$f":"IFERROR(VLOOKUP(E728,Insumos!A:C,2,FALSE),\"\")","v":""},null,null,null,0]
[null,null,null,null,null,{"$f":"IFERROR(VLOOKUP(E729,Insumos!A:C,2,FALSE),\"\")","v":""},null,null,null,0]
[null,null,null,null,null,{"$f":"IFERROR(VLOOKUP(E730,Insumos!A:C,2,FALSE),\"\")","v":""},null,null,null,0]
[null,null,null,null,null,{"$f":"IFERROR(VLOOKUP(E731,Insumos!A:C,2,FALSE),\"\")","v":""},null,null,null,0]
[null,null,null,null,null,{"$f":"IFERROR(VLOOKUP(E732,Insumos!A:C,2,FALSE),\"\")","v":""},null,null,null,0]
[null,null,null,null,null,{"$f":"IFERROR(VLOOKUP(E733,Insumos!A:C,2,FALSE),\"\")","v":""},null,null,null,0]
[null,null,null,null,null,{"$f":"IFERROR(VLOOKUP(E734,Insumos!A:C,2,FALSE),\"\")","v":""},null,null,null,0]
[null,null,null,null,null,{"$f":"IFERROR(VLOOKUP(E735,Insumos!A:C,2,FALSE),\"\")","v":""},null,null,null,0]
[null,null,null,null,null,{"$f":"IFERROR(VLOOKUP(E736,Insumos!A:C,2,FALSE),\"\")","v":""},null,null,null,0]
[null,null,null,null,null,{"$f":"IFERROR(VLOOKUP(E737,Insumos!A:C,2,FALSE),\"\")","v":""},null,null,null,0]
[null,null,null,null,null,{"$f":"IFERROR(VLOOKUP(E738,Insumos!A:C,2,FALSE),\"\")","v":""},null,null,null,0]
[null,null,null,null,null,{"$f":"IFERROR(VLOOKUP(E739,Insumos!A:C,2,FALSE),\"\")","v":""},null,null,null,0]
[null,null,null,null,null,{"$f":"IFERROR(VLOOKUP(E740,Insumos!A:C,2,FALSE),\"\")","v":""},null,null,null,0]
[null,null,null,null,null,{"$f":"IFERROR(VLOOKUP(E741,Insumos!A:C,2,FALSE),\"\")","v":""},null,null,null,0]
[null,null,null,null,null,{"$f":"IFERROR(VLOOKUP(E742,Insumos!A:C,2,FALSE),\"\")","v":""},null,null,null,0]
[null,null,null,null,null,{"$f":"IFERROR(VLOOKUP(E743,Insumos!A:C,2,FALSE),\"\")","v":""},null,null,null,0]
[null,null,null,null,null,{"$f":"IFERROR(VLOOKUP(E744,Insumos!A:C,2,FALSE),\"\")","v":""},null,null,null,0]
[null,null,null,null,null,{"$f":"IFERROR(VLOOKUP(E745,Insumos!A:C,2,FALSE),\"\")","v":""},null,null,null,0]
[null,null,null,null,null,{"$f":"IFERROR(VLOOKUP(E746,Insumos!A:C,2,FALSE),\"\")","v":""},null,null,null,0]
[null,null,null,null,null,{"$f":"IFERROR(VLOOKUP(E747,Insumos!A:C,2,FALSE),\"\")","v":""},null,null,null,0]
[null,null,null,null,null,{"$f":"IFERROR(VLOOKUP(E748,Insumos!A:C,2,FALSE),\"\")","v":""},null,null,null,0]
[null,null,null,null,null,{"$f":"IFERROR(VLOOKUP(E749,Insumos!A:C,2,FALSE),\"\")","v":""},null,null,null,0]
[null,null,null,null,null,{"$f":"IFERROR(VLOOKUP(E750,Insumos!A:C,2,FALSE),\"\")","v":""},null,null,null,0]
[null,null,null,null,null,{"$f":"IFERROR(VLOOKUP(E751,Insumos!A:C,2,FALSE),\"\")","v":""},null,null,null,0]
[null,null,null,null,null,{"$f":"IFERROR(VLOOKUP(E752,Insumos!A:C,2,FALSE),\"\")","v":""},null,null,null,0]
[null,null,null,null,null,{"$f":"IFERROR(VLOOKUP(E753,Insumos!A:C,2,FALSE),\"\")","v":""},null,null,null,0]
[null,null,null,null,null,{"$f":"IFERROR(VLOOKUP(E754,Insumos!A:C,2,FALSE),\"\")","v":""},null,null,null,0]
[null,null,null,null,null,{"$f":"IFERROR(VLOOKUP(E755,Insumos!A:C,2,FALSE),\"\")","v":""},null,null,null,0]
[null,null,null,null,null,{"$f":"IFERROR(VLOOKUP(E756,Insumos!A:C,2,FALSE),\"\")","v":""},null,null,null,0]
[null,null,null,null,null,{"$f":"IFERROR(VLOOKUP(E757,Insumos!A:C,2,FALSE),\"\")","v":""},null,null,null,0]
[null,null,null,null,null,{"$f":"IFERROR(VLOOKUP(E758,Insumos!A:C,2,FALSE),\"\")","v":""},null,null,null,0]
[null,null,null,null,null,{"$f":"IFERROR(VLOOKUP(E759,Insumos!A:C,2,FALSE),\"\")","v":""},null,null,null,0]
[null,null,null,null,null,{"$f":"IFERROR(VLOOKUP(E760,Insumos!A:C,2,FALSE),\"\")","v":""},null,null,null,0]
[null,null,null,null,null,{"$f":"IFERROR(VLOOKUP(E761,Insumos!A:C,2,FALSE),\"\")","v":""},null,null,null,0]
[null,null,null,null,null,{"$f":"IFERROR(VLOOKUP(E762,Insumos!A:C,2,FALSE),\"\")","v":""},null,null,null,0]
[null,null,null,null,null,{"$f":"IFERROR(VLOOKUP(E763,Insumos!A:C,2,FALSE),\"\")","v":""},null,null,null,0]
[null,null,null,null,null,{"$f":"IFERROR(VLOOKUP(E764,Insumos!A:C,2,FALSE),\"\")","v":""},null,null,null,0]
[null,null,null,null,null,{"$f":"IFERROR(VLOOKUP(E765,Insumos!A:C,2,FALSE),\"\")","v":""},null,null,null,0]
[null,null,null,null,null,{"$f":"IFERROR(VLOOKUP(E766,Insumos!A:C,2,FALSE),\"\")","v":""},null,null,null,0]
[null,null,null,null,null,{"$f":"IFERROR(VLOOKUP(E767,Insumos!A:C,2,FALSE),\"\")","v":""},null,null,null,0]
[null,null,null,null,null,{"$f":"IFERROR(VLOOKUP(E768,Insumos!A:C,2,FALSE),\"\")","v":""},null,null,null,0]
[null,null,null,null,null,{"$f":"IFERROR(VLOOKUP(E769,Insumos!A:C,2,FALSE),\"\")","v":""},null,null,null,0]
[null,null,null,null,null,{"$f":"IFERROR(VLOOKUP(E770,Insumos!A:C,2,FALSE),\"\")","v":""},null,null,null,0]
[null,null,null,null,null,{"$f":"IFERROR(VLOOKUP(E771,Insumos!A:C,2,FALSE),\"\")","v":""},null,null,null,0]
[null,null,null,null,null,{"$f":"IFERROR(VLOOKUP(E772,Insumos!A:C,2,FALSE),\"\")","v":""},null,null,null,0]
[null,null,null,null,null,{"$f":"IFERROR(VLOOKUP(E773,Insumos!A:C,2,FALSE),\"\")","v":""},null,null,null,{"$f":"IFERROR(H773*I773,\"\")","v":0}]
[null,null,null,null,null,{"$f":"IFERROR(VLOOKUP(E774,Insumos!A:C,2,FALSE),\"\")","v":""},null,null,null,0]
[null,null,null,null,null,{"$f":"IFERROR(VLOOKUP(E775,Insumos!A:C,2,FALSE),\"\")","v":""},null,null,null,0]
[null,null,null,null,null,{"$f":"IFERROR(VLOOKUP(E776,Insumos!A:C,2,FALSE),\"\")","v":""},null,null,null,0]
[null,null,null,null,null,{"$f":"IFERROR(VLOOKUP(E777,Insumos!A:C,2,FALSE),\"\")","v":""},null,null,null,0]
[null,null,null,null,null,{"$f":"IFERROR(VLOOKUP(E778,Insumos!A:C,2,FALSE),\"\")","v":""},null,null,null,0]
[null,null,null,null,null,{"$f":"IFERROR(VLOOKUP(E779,Insumos!A:C,2,FALSE),\"\")","v":""},null,null,null,0]
[null,null,null,null,null,{"$f":"IFERROR(VLOOKUP(E780,Insumos!A:C,2,FALSE),\"\")","v":""},null,null,null,0]
[null,null,null,null,null,{"$f":"IFERROR(VLOOKUP(E781,Insumos!A:C,2,FALSE),\"\")","v":""},null,null,null,0]
[null,null,null,null,null,{"$f":"IFERROR(VLOOKUP(E782,Insumos!A:C,2,FALSE),\"\")","v":""},null,null,null,0]
[null,null,null,null,null,{"$f":"IFERROR(VLOOKUP(E783,Insumos!A:C,2,FALSE),\"\")","v":""},null,null,null,0]
[null,null,null,null,null,{"$f":"IFERROR(VLOOKUP(E784,Insumos!A:C,2,FALSE),\"\")","v":""},null,null,null,0]
[null,null,null,null,null,{"$f":"IFERROR(VLOOKUP(E785,Insumos!A:C,2,FALSE),\"\")","v":""},null,null,null,0]
[null,null,null,null,null,{"$f":"IFERROR(VLOOKUP(E786,Insumos!A:C,2,FALSE),\"\")","v":""},null,null,null,0]
[null,null,null,null,null,{"$f":"IFERROR(VLOOKUP(E787,Insumos!A:C,2,FALSE),\"\")","v":""},null,null,null,0]
[null,null,null,null,null,{"$f":"IFERROR(VLOOKUP(E788,Insumos!A:C,2,FALSE),\"\")","v":""},null,null,null,0]
[null,null,null,null,null,{"$f":"IFERROR(VLOOKUP(E789,Insumos!A:C,2,FALSE),\"\")","v":""},null,null,null,0]
[null,null,null,null,null,{"$f":"IFERROR(VLOOKUP(E790,Insumos!A:C,2,FALSE),\"\")","v":""},null,null,null,0]
[null,null,null,null,null,{"$f":"IFERROR(VLOOKUP(E791,Insumos!A:C,2,FALSE),\"\")","v":""},null,null,null,0]
[null,null,null,null,null,{"$f":"IFERROR(VLOOKUP(E792,Insumos!A:C,2,FALSE),\"\")","v":""},null,null,null,0]
[null,null,null,null,null,{"$f":"IFERROR(VLOOKUP(E793,Insumos!A:C,2,FALSE),\"\")","v":""},null,null,null,0]
[null,null,null,null,null,{"$f":"IFERROR(VLOOKUP(E794,Insumos!A:C,2,FALSE),\"\")","v":""},null,null,null,0]
[null,null,null,null,null,{"$f":"IFERROR(VLOOKUP(E795,Insumos!A:C,2,FALSE),\"\")","v":""},null,null,null,0]
[null,null,null,null,null,{"$f":"IFERROR(VLOOKUP(E796,Insumos!A:C,2,FALSE),\"\")","v":""},null,null,null,0]
[null,null,null,null,null,{"$f":"IFERROR(VLOOKUP(E797,Insumos!A:C,2,FALSE),\"\")","v":""},null,null,null,0]
[null,null,null,null,null,{"$f":"IFERROR(VLOOKUP(E798,Insumos!A:C,2,FALSE),\"\")","v":""},null,null,null,0]
[null,null,null,null,null,{"$f":"IFERROR(VLOOKUP(E799,Insumos!A:C,2,FALSE),\"\")","v":""},null,null,null,0]
[null,null,null,null,null,{"$f":"IFERROR(VLOOKUP(E800,Insumos!A:C,2,FALSE),\"\")","v":""},null,null,null,0]
[null,null,null,null,null,{"$f":"IFERROR(VLOOKUP(E801,Insumos!A:C,2,FALSE),\"\")","v":""},null,null,null,0]
[null,null,null,null,null,{"$f":"IFERROR(VLOOKUP(E802,Insumos!A:C,2,FALSE),\"\")","v":""},null,null,null,0]
[null,null,null,null,null,{"$f":"IFERROR(VLOOKUP(E803,Insumos!A:C,2,FALSE),\"\")","v":""},null,null,null,0]
[null,null,null,null,null,{"$f":"IFERROR(VLOOKUP(E804,Insumos!A:C,2,FALSE),\"\")","v":""},null,null,null,0]
[null,null,null,null,null,{"$f":"IFERROR(VLOOKUP(E805,Insumos!A:C,2,FALSE),\"\")","v":""},null,null,null,0]
[null,null,null,null,null,{"$f":"IFERROR(VLOOKUP(E806,Insumos!A:C,2,FALSE),\"\")","v":""},null,null,null,0]
[null,null,null,null,null,{"$f":"IFERROR(VLOOKUP(E807,Insumos!A:C,2,FALSE),\"\")","v":""},null,null,null,0]
[null,null,null,null,null,{"$f":"IFERROR(VLOOKUP(E808,Insumos!A:C,2,FALSE),\"\")","v":""},null,null,null,0]
[null,null,null,null,null,{"$f":"IFERROR(VLOOKUP(E809,Insumos!A:C,2,FALSE),\"\")","v":""},null,null,null,0]
[null,null,null,null,null,{"$f":"IFERROR(VLOOKUP(E810,Insumos!A:C,2,FALSE),\"\")","v":""},null,null,null,0]
[null,null,null,null,null,{"$f":"IFERROR(VLOOKUP(E811,Insumos!A:C,2,FALSE),\"\")","v":""},null,null,null,0]
[null,null,null,null,null,{"$f":"IFERROR(VLOOKUP(E812,Insumos!A:C,2,FALSE),\"\")","v":""},null,null,null,0]
[null,null,null,null,null,{"$f":"IFERROR(VLOOKUP(E813,Insumos!A:C,2,FALSE),\"\")","v":""},null,null,null,0]
[null,null,null,null,null,{"$f":"IFERROR(VLOOKUP(E814,Insumos!A:C,2,FALSE),\"\")","v":""},null,null,null,0]
[null,null,null,null,null,{"$f":"IFERROR(VLOOKUP(E815,Insumos!A:C,2,FALSE),\"\")","v":""},null,null,null,0]
[null,null,null,null,null,{"$f":"IFERROR(VLOOKUP(E816,Insumos!A:C,2,FALSE),\"\")","v":""},null,null,null,0]
[null,null,null,null,null,{"$f":"IFERROR(VLOOKUP(E817,Insumos!A:C,2,FALSE),\"\")","v":""},null,null,null,0]
[null,null,null,null,null,{"$f":"IFERROR(VLOOKUP(E818,Insumos!A:C,2,FALSE),\"\")","v":""},null,null,null,0]
[null,null,null,null,null,{"$f":"IFERROR(VLOOKUP(E819,Insumos!A:C,2,FALSE),\"\")","v":""},null,null,null,0]
[null,null,null,null,null,{"$f":"IFERROR(VLOOKUP(E820,Insumos!A:C,2,FALSE),\"\")","v":""},null,null,null,0]
[null,null,null,null,null,{"$f":"IFERROR(VLOOKUP(E821,Insumos!A:C,2,FALSE),\"\")","v":""},null,null,null,0]
[null,null,null,null,null,{"$f":"IFERROR(VLOOKUP(E822,Insumos!A:C,2,FALSE),\"\")","v":""},null,null,null,0]
[null,null,null,null,null,{"$f":"IFERROR(VLOOKUP(E823,Insumos!A:C,2,FALSE),\"\")","v":""},null,null,null,0]
[null,null,null,null,null,{"$f":"IFERROR(VLOOKUP(E824,Insumos!A:C,2,FALSE),\"\")","v":""},null,null,null,0]
[null,null,null,null,null,{"$f":"IFERROR(VLOOKUP(E825,Insumos!A:C,2,FALSE),\"\")","v":""},null,null,null,0]
[null,null,null,null,null,{"$f":"IFERROR(VLOOKUP(E826,Insumos!A:C,2,FALSE),\"\")","v":""},null,null,null,0]
[null,null,null,null,null,{"$f":"IFERROR(VLOOKUP(E827,Insumos!A:C,2,FALSE),\"\")","v":""},null,null,null,0]
[null,null,null,null,null,{"$f":"IFERROR(VLOOKUP(E828,Insumos!A:C,2,FALSE),\"\")","v":""},null,null,null,0]
[null,null,null,null,null,{"$f":"IFERROR(VLOOKUP(E829,Insumos!A:C,2,FALSE),\"\")","v":""},null,null,null,0]
[null,null,null,null,null,{"$f":"IFERROR(VLOOKUP(E830,Insumos!A:C,2,FALSE),\"\")","v":""},null,null,null,0]
[null,null,null,null,null,{"$f":"IFERROR(VLOOKUP(E831,Insumos!A:C,2,FALSE),\"\")","v":""},null,null,null,0]
[null,null,null,null,null,{"$f":"IFERROR(VLOOKUP(E832,Insumos!A:C,2,FALSE),\"\")","v":""},null,null,null,0]
[null,null,null,null,null,{"$f":"IFERROR(VLOOKUP(E833,Insumos!A:C,2,FALSE),\"\")","v":""},null,null,null,0]
[null,null,null,null,null,{"$f":"IFERROR(VLOOKUP(E834,Insumos!A:C,2,FALSE),\"\")","v":""},null,null,null,0]
[null,null,null,null,null,{"$f":"IFERROR(VLOOKUP(E835,Insumos!A:C,2,FALSE),\"\")","v":""},null,null,null,0]
[null,null,null,null,null,{"$f":"IFERROR(VLOOKUP(E836,Insumos!A:C,2,FALSE),\"\")","v":""},null,null,null,0]
[null,null,null,null,null,{"$f":"IFERROR(VLOOKUP(E837,Insumos!A:C,2,FALSE),\"\")","v":""},null,null,null,{"$f":"IFERROR(H837*I837,\"\")","v":0}]
[null,null,null,null,null,{"$f":"IFERROR(VLOOKUP(E838,Insumos!A:C,2,FALSE),\"\")","v":""},null,null,null,0]
[null,null,null,null,null,{"$f":"IFERROR(VLOOKUP(E839,Insumos!A:C,2,FALSE),\"\")","v":""},null,null,null,0]
[null,null,null,null,null,{"$f":"IFERROR(VLOOKUP(E840,Insumos!A:C,2,FALSE),\"\")","v":""},null,null,null,0]
[null,null,null,null,null,{"$f":"IFERROR(VLOOKUP(E841,Insumos!A:C,2,FALSE),\"\")","v":""},null,null,null,0]
[null,null,null,null,null,{"$f":"IFERROR(VLOOKUP(E842,Insumos!A:C,2,FALSE),\"\")","v":""},null,null,null,0]
[null,null,null,null,null,{"$f":"IFERROR(VLOOKUP(E843,Insumos!A:C,2,FALSE),\"\")","v":""},null,null,null,0]
[null,null,null,null,null,{"$f":"IFERROR(VLOOKUP(E844,Insumos!A:C,2,FALSE),\"\")","v":""},null,null,null,0]
[null,null,null,null,null,{"$f":"IFERROR(VLOOKUP(E845,Insumos!A:C,2,FALSE),\"\")","v":""},null,null,null,0]
[null,null,null,null,null,{"$f":"IFERROR(VLOOKUP(E846,Insumos!A:C,2,FALSE),\"\")","v":""},null,null,null,0]
[null,null,null,null,null,{"$f":"IFERROR(VLOOKUP(E847,Insumos!A:C,2,FALSE),\"\")","v":""},null,null,null,0]
[null,null,null,null,null,{"$f":"IFERROR(VLOOKUP(E848,Insumos!A:C,2,FALSE),\"\")","v":""},null,null,null,0]
[null,null,null,null,null,{"$f":"IFERROR(VLOOKUP(E849,Insumos!A:C,2,FALSE),\"\")","v":""},null,null,null,0]
[null,null,null,null,null,{"$f":"IFERROR(VLOOKUP(E850,Insumos!A:C,2,FALSE),\"\")","v":""},null,null,null,0]
[null,null,null,null,null,{"$f":"IFERROR(VLOOKUP(E851,Insumos!A:C,2,FALSE),\"\")","v":""},null,null,null,0]
[null,null,null,null,null,{"$f":"IFERROR(VLOOKUP(E852,Insumos!A:C,2,FALSE),\"\")","v":""},null,null,null,0]
[null,null,null,null,null,{"$f":"IFERROR(VLOOKUP(E853,Insumos!A:C,2,FALSE),\"\")","v":""},null,null,null,0]
[null,null,null,null,null,{"$f":"IFERROR(VLOOKUP(E854,Insumos!A:C,2,FALSE),\"\")","v":""},null,null,null,0]
[null,null,null,null,null,{"$f":"IFERROR(VLOOKUP(E855,Insumos!A:C,2,FALSE),\"\")","v":""},null,null,null,0]
[null,null,null,null,null,{"$f":"IFERROR(VLOOKUP(E856,Insumos!A:C,2,FALSE),\"\")","v":""},null,null,null,0]
[null,null,null,null,null,{"$f":"IFERROR(VLOOKUP(E857,Insumos!A:C,2,FALSE),\"\")","v":""},null,null,null,0]
[null,null,null,null,null,{"$f":"IFERROR(VLOOKUP(E858,Insumos!A:C,2,FALSE),\"\")","v":""},null,null,null,0]
[null,null,null,null,null,{"$f":"IFERROR(VLOOKUP(E859,Insumos!A:C,2,FALSE),\"\")","v":""},null,null,null,0]
[null,null,null,null,null,{"$f":"IFERROR(VLOOKUP(E860,Insumos!A:C,2,FALSE),\"\")","v":""},null,null,null,0]
[null,null,null,null,null,{"$f":"IFERROR(VLOOKUP(E861,Insumos!A:C,2,FALSE),\"\")","v":""},null,null,null,0]
[null,null,null,null,null,{"$f":"IFERROR(VLOOKUP(E862,Insumos!A:C,2,FALSE),\"\")","v":""},null,null,null,0]
[null,null,null,null,null,{"$f":"IFERROR(VLOOKUP(E863,Insumos!A:C,2,FALSE),\"\")","v":""},null,null,null,0]
[null,null,null,null,null,{"$f":"IFERROR(VLOOKUP(E864,Insumos!A:C,2,FALSE),\"\")","v":""},null,null,null,0]
[null,null,null,null,null,{"$f":"IFERROR(VLOOKUP(E865,Insumos!A:C,2,FALSE),\"\")","v":""},null,null,null,0]
[null,null,null,null,null,{"$f":"IFERROR(VLOOKUP(E866,Insumos!A:C,2,FALSE),\"\")","v":""},null,null,null,0]
[null,null,null,null,null,{"$f":"IFERROR(VLOOKUP(E867,Insumos!A:C,2,FALSE),\"\")","v":""},null,null,null,0]
[null,null,null,null,null,{"$f":"IFERROR(VLOOKUP(E868,Insumos!A:C,2,FALSE),\"\")","v":""},null,null,null,0]
[null,null,null,null,null,{"$f":"IFERROR(VLOOKUP(E869,Insumos!A:C,2,FALSE),\"\")","v":""},null,null,null,0]
[null,null,null,null,null,{"$f":"IFERROR(VLOOKUP(E870,Insumos!A:C,2,FALSE),\"\")","v":""},null,null,null,0]
[null,null,null,null,null,{"$f":"IFERROR(VLOOKUP(E871,Insumos!A:C,2,FALSE),\"\")","v":""},null,null,null,0]
[null,null,null,null,null,{"$f":"IFERROR(VLOOKUP(E872,Insumos!A:C,2,FALSE),\"\")","v":""},null,null,null,0]
[null,null,null,null,null,{"$f":"IFERROR(VLOOKUP(E873,Insumos!A:C,2,FALSE),\"\")","v":""},null,null,null,0]
[null,null,null,null,null,{"$f":"IFERROR(VLOOKUP(E874,Insumos!A:C,2,FALSE),\"\")","v":""},null,null,null,0]
[null,null,null,null,null,{"$f":"IFERROR(VLOOKUP(E875,Insumos!A:C,2,FALSE),\"\")","v":""},null,null,null,0]
[null,null,null,null,null,{"$f":"IFERROR(VLOOKUP(E876,Insumos!A:C,2,FALSE),\"\")","v":""},null,null,null,0]
[null,null,null,null,null,{"$f":"IFERROR(VLOOKUP(E877,Insumos!A:C,2,FALSE),\"\")","v":""},null,null,null,0]
[null,null,null,null,null,{"$f":"IFERROR(VLOOKUP(E878,Insumos!A:C,2,FALSE),\"\")","v":""},null,null,null,0]
[null,null,null,null,null,{"$f":"IFERROR(VLOOKUP(E879,Insumos!A:C,2,FALSE),\"\")","v":""},null,null,null,0]
[null,null,null,null,null,{"$f":"IFERROR(VLOOKUP(E880,Insumos!A:C,2,FALSE),\"\")","v":""},null,null,null,0]
[null,null,null,null,null,{"$f":"IFERROR(VLOOKUP(E881,Insumos!A:C,2,FALSE),\"\")","v":""},null,null,null,0]
[null,null,null,null,null,{"$f":"IFERROR(VLOOKUP(E882,Insumos!A:C,2,FALSE),\"\")","v":""},null,null,null,0]
[null,null,null,null,null,{"$f":"IFERROR(VLOOKUP(E883,Insumos!A:C,2,FALSE),\"\")","v":""},null,null,null,0]
[null,null,null,null,null,{"$f":"IFERROR(VLOOKUP(E884,Insumos!A:C,2,FALSE),\"\")","v":""},null,null,null,0]
[null,null,null,null,null,{"$f":"IFERROR(VLOOKUP(E885,Insumos!A:C,2,FALSE),\"\")","v":""},null,null,null,0]
[null,null,null,null,null,{"$f":"IFERROR(VLOOKUP(E886,Insumos!A:C,2,FALSE),\"\")","v":""},null,null,null,0]
[null,null,null,null,null,{"$f":"IFERROR(VLOOKUP(E887,Insumos!A:C,2,FALSE),\"\")","v":""},null,null,null,0]
[null,null,null,null,null,{"$f":"IFERROR(VLOOKUP(E888,Insumos!A:C,2,FALSE),\"\")","v":""},null,null,null,0]
[null,null,null,null,null,{"$f":"IFERROR(VLOOKUP(E889,Insumos!A:C,2,FALSE),\"\")","v":""},null,null,null,0]
[null,null,null,null,null,{"$f":"IFERROR(VLOOKUP(E890,Insumos!A:C,2,FALSE),\"\")","v":""},null,null,null,0]
[null,null,null,null,null,{"$f":"IFERROR(VLOOKUP(E891,Insumos!A:C,2,FALSE),\"\")","v":""},null,null,null,0]
[null,null,null,null,null,{"$f":"IFERROR(VLOOKUP(E892,Insumos!A:C,2,FALSE),\"\")","v":""},null,null,null,0]
[null,null,null,null,null,{"$f":"IFERROR(VLOOKUP(E893,Insumos!A:C,2,FALSE),\"\")","v":""},null,null,null,0]
[null,null,null,null,null,{"$f":"IFERROR(VLOOKUP(E894,Insumos!A:C,2,FALSE),\"\")","v":""},null,null,null,0]
[null,null,null,null,null,{"$f":"IFERROR(VLOOKUP(E895,Insumos!A:C,2,FALSE),\"\")","v":""},null,null,null,0]
[null,null,null,null,null,{"$f":"IFERROR(VLOOKUP(E896,Insumos!A:C,2,FALSE),\"\")","v":""},null,null,null,0]
[null,null,null,null,null,{"$f":"IFERROR(VLOOKUP(E897,Insumos!A:C,2,FALSE),\"\")","v":""},null,null,null,0]
[null,null,null,null,null,{"$f":"IFERROR(VLOOKUP(E898,Insumos!A:C,2,FALSE),\"\")","v":""},null,null,null,0]
[null,null,null,null,null,{"$f":"IFERROR(VLOOKUP(E899,Insumos!A:C,2,FALSE),\"\")","v":""},null,null,null,0]
[null,null,null,null,null,{"$f":"IFERROR(VLOOKUP(E900,Insumos!A:C,2,FALSE),\"\")","v":""},null,null,null,0]
[null,null,null,null,null,{"$f":"IFERROR(VLOOKUP(E901,Insumos!A:C,2,FALSE),\"\")","v":""},null,null,null,{"$f":"IFERROR(H901*I901,\"\")","v":0}]
[null,null,null,null,null,{"$f":"IFERROR(VLOOKUP(E902,Insumos!A:C,2,FALSE),\"\")","v":""},null,null,null,0]
[null,null,null,null,null,{"$f":"IFERROR(VLOOKUP(E903,Insumos!A:C,2,FALSE),\"\")","v":""},null,null,null,0]
[null,null,null,null,null,{"$f":"IFERROR(VLOOKUP(E904,Insumos!A:C,2,FALSE),\"\")","v":""},null,null,null,0]
[null,null,null,null,null,{"$f":"IFERROR(VLOOKUP(E905,Insumos!A:C,2,FALSE),\"\")","v":""},null,null,null,0]
[null,null,null,null,null,{"$f":"IFERROR(VLOOKUP(E906,Insumos!A:C,2,FALSE),\"\")","v":""},null,null,null,0]
[null,null,null,null,null,{"$f":"IFERROR(VLOOKUP(E907,Insumos!A:C,2,FALSE),\"\")","v":""},null,null,null,0]
[null,null,null,null,null,{"$f":"IFERROR(VLOOKUP(E908,Insumos!A:C,2,FALSE),\"\")","v":""},null,null,null,0]
[null,null,null,null,null,{"$f":"IFERROR(VLOOKUP(E909,Insumos!A:C,2,FALSE),\"\")","v":""},null,null,null,0]
[null,null,null,null,null,{"$f":"IFERROR(VLOOKUP(E910,Insumos!A:C,2,FALSE),\"\")","v":""},null,null,null,0]
[null,null,null,null,null,{"$f":"IFERROR(VLOOKUP(E911,Insumos!A:C,2,FALSE),\"\")","v":""},null,null,null,0]
[null,null,null,null,null,{"$f":"IFERROR(VLOOKUP(E912,Insumos!A:C,2,FALSE),\"\")","v":""},null,null,null,0]
[null,null,null,null,null,{"$f":"IFERROR(VLOOKUP(E913,Insumos!A:C,2,FALSE),\"\")","v":""},null,null,null,0]
[null,null,null,null,null,{"$f":"IFERROR(VLOOKUP(E914,Insumos!A:C,2,FALSE),\"\")","v":""},null,null,null,0]
[null,null,null,null,null,{"$f":"IFERROR(VLOOKUP(E915,Insumos!A:C,2,FALSE),\"\")","v":""},null,null,null,0]
[null,null,null,null,null,{"$f":"IFERROR(VLOOKUP(E916,Insumos!A:C,2,FALSE),\"\")","v":""},null,null,null,0]
[null,null,null,null,null,{"$f":"IFERROR(VLOOKUP(E917,Insumos!A:C,2,FALSE),\"\")","v":""},null,null,null,0]
[null,null,null,null,null,{"$f":"IFERROR(VLOOKUP(E918,Insumos!A:C,2,FALSE),\"\")","v":""},null,null,null,0]
[null,null,null,null,null,{"$f":"IFERROR(VLOOKUP(E919,Insumos!A:C,2,FALSE),\"\")","v":""},null,null,null,0]
[null,null,null,null,null,{"$f":"IFERROR(VLOOKUP(E920,Insumos!A:C,2,FALSE),\"\")","v":""},null,null,null,0]
[null,null,null,null,null,{"$f":"IFERROR(VLOOKUP(E921,Insumos!A:C,2,FALSE),\"\")","v":""},null,null,null,0]
[null,null,null,null,null,{"$f":"IFERROR(VLOOKUP(E922,Insumos!A:C,2,FALSE),\"\")","v":""},null,null,null,0]
[null,null,null,null,null,{"$f":"IFERROR(VLOOKUP(E923,Insumos!A:C,2,FALSE),\"\")","v":""},null,null,null,0]
[null,null,null,null,null,{"$f":"IFERROR(VLOOKUP(E924,Insumos!A:C,2,FALSE),\"\")","v":""},null,null,null,0]
[null,null,null,null,null,{"$f":"IFERROR(VLOOKUP(E925,Insumos!A:C,2,FALSE),\"\")","v":""},null,null,null,0]
[null,null,null,null,null,{"$f":"IFERROR(VLOOKUP(E926,Insumos!A:C,2,FALSE),\"\")","v":""},null,null,null,0]
[null,null,null,null,null,{"$f":"IFERROR(VLOOKUP(E927,Insumos!A:C,2,FALSE),\"\")","v":""},null,null,null,0]
[null,null,null,null,null,{"$f":"IFERROR(VLOOKUP(E928,Insumos!A:C,2,FALSE),\"\")","v":""},null,null,null,0]
[null,null,null,null,null,{"$f":"IFERROR(VLOOKUP(E929,Insumos!A:C,2,FALSE),\"\")","v":""},null,null,null,0]
[null,null,null,null,null,{"$f":"IFERROR(VLOOKUP(E930,Insumos!A:C,2,FALSE),\"\")","v":""},null,null,null,0]
[null,null,null,null,null,{"$f":"IFERROR(VLOOKUP(E931,Insumos!A:C,2,FALSE),\"\")","v":""},null,null,null,0]
[null,null,null,null,null,{"$f":"IFERROR(VLOOKUP(E932,Insumos!A:C,2,FALSE),\"\")","v":""},null,null,null,0]
[null,null,null,null,null,{"$f":"IFERROR(VLOOKUP(E933,Insumos!A:C,2,FALSE),\"\")","v":""},null,null,null,0]
[null,null,null,null,null,{"$f":"IFERROR(VLOOKUP(E934,Insumos!A:C,2,FALSE),\"\")","v":""},null,null,null,0]
[null,null,null,null,null,{"$f":"IFERROR(VLOOKUP(E935,Insumos!A:C,2,FALSE),\"\")","v":""},null,null,null,0]
[null,null,null,null,null,{"$f":"IFERROR(VLOOKUP(E936,Insumos!A:C,2,FALSE),\"\")","v":""},null,null,null,0]
[null,null,null,null,null,{"$f":"IFERROR(VLOOKUP(E937,Insumos!A:C,2,FALSE),\"\")","v":""},null,null,null,0]
[null,null,null,null,null,{"$f":"IFERROR(VLOOKUP(E938,Insumos!A:C,2,FALSE),\"\")","v":""},null,null,null,0]
[null,null,null,null,null,{"$f":"IFERROR(VLOOKUP(E939,Insumos!A:C,2,FALSE),\"\")","v":""},null,null,null,0]
[null,null,null,null,null,{"$f":"IFERROR(VLOOKUP(E940,Insumos!A:C,2,FALSE),\"\")","v":""},null,null,null,0]
[null,null,null,null,null,{"$f":"IFERROR(VLOOKUP(E941,Insumos!A:C,2,FALSE),\"\")","v":""},null,null,null,0]
[null,null,null,null,null,{"$f":"IFERROR(VLOOKUP(E942,Insumos!A:C,2,FALSE),\"\")","v":""},null,null,null,0]
[null,null,null,null,null,{"$f":"IFERROR(VLOOKUP(E943,Insumos!A:C,2,FALSE),\"\")","v":""},null,null,null,0]
[null,null,null,null,null,{"$f":"IFERROR(VLOOKUP(E944,Insumos!A:C,2,FALSE),\"\")","v":""},null,null,null,0]
[null,null,null,null,null,{"$f":"IFERROR(VLOOKUP(E945,Insumos!A:C,2,FALSE),\"\")","v":""},null,null,null,0]
[null,null,null,null,null,{"$f":"IFERROR(VLOOKUP(E946,Insumos!A:C,2,FALSE),\"\")","v":""},null,null,null,0]
[null,null,null,null,null,{"$f":"IFERROR(VLOOKUP(E947,Insumos!A:C,2,FALSE),\"\")","v":""},null,null,null,0]
[null,null,null,null,null,{"$f":"IFERROR(VLOOKUP(E948,Insumos!A:C,2,FALSE),\"\")","v":""},null,null,null,0]
[null,null,null,null,null,{"$f":"IFERROR(VLOOKUP(E949,Insumos!A:C,2,FALSE),\"\")","v":""},null,null,null,0]
[null,null,null,null,null,{"$f":"IFERROR(VLOOKUP(E950,Insumos!A:C,2,FALSE),\"\")","v":""},null,null,null,0]
[null,null,null,null,null,{"$f":"IFERROR(VLOOKUP(E951,Insumos!A:C,2,FALSE),\"\")","v":""},null,null,null,0]
[null,null,null,null,null,{"$f":"IFERROR(VLOOKUP(E952,Insumos!A:C,2,FALSE),\"\")","v":""},null,null,null,0]
[null,null,null,null,null,{"$f":"IFERROR(VLOOKUP(E953,Insumos!A:C,2,FALSE),\"\")","v":""},null,null,null,0]
[null,null,null,null,null,{"$f":"IFERROR(VLOOKUP(E954,Insumos!A:C,2,FALSE),\"\")","v":""},null,null,null,0]
[null,null,null,null,null,{"$f":"IFERROR(VLOOKUP(E955,Insumos!A:C,2,FALSE),\"\")","v":""},null,null,null,0]
[null,null,null,null,null,{"$f":"IFERROR(VLOOKUP(E956,Insumos!A:C,2,FALSE),\"\")","v":""},null,null,null,0]
[null,null,null,null,null,{"$f":"IFERROR(VLOOKUP(E957,Insumos!A:C,2,FALSE),\"\")","v":""},null,null,null,0]
[null,null,null,null,null,{"$f":"IFERROR(VLOOKUP(E958,Insumos!A:C,2,FALSE),\"\")","v":""},null,null,null,0]
[null,null,null,null,null,{"$f":"IFERROR(VLOOKUP(E959,Insumos!A:C,2,FALSE),\"\")","v":""},null,null,null,0]
[null,null,null,null,null,{"$f":"IFERROR(VLOOKUP(E960,Insumos!A:C,2,FALSE),\"\")","v":""},null,null,null,0]
[null,null,null,null,null,{"$f":"IFERROR(VLOOKUP(E961,Insumos!A:C,2,FALSE),\"\")","v":""},null,null,null,0]
[null,null,null,null,null,{"$f":"IFERROR(VLOOKUP(E962,Insumos!A:C,2,FALSE),\"\")","v":""},null,null,null,0]
[null,null,null,null,null,{"$f":"IFERROR(VLOOKUP(E963,Insumos!A:C,2,FALSE),\"\")","v":""},null,null,null,0]
[null,null,null,null,null,{"$f":"IFERROR(VLOOKUP(E964,Insumos!A:C,2,FALSE),\"\")","v":""},null,null,null,0]
[null,null,null,null,null,{"$f":"IFERROR(VLOOKUP(E965,Insumos!A:C,2,FALSE),\"\")","v":""},null,null,null,{"$f":"IFERROR(H965*I965,\"\")","v":0}]
[null,null,null,null,null,{"$f":"IFERROR(VLOOKUP(E966,Insumos!A:C,2,FALSE),\"\")","v":""},null,null,null,0]
[null,null,null,null,null,{"$f":"IFERROR(VLOOKUP(E967,Insumos!A:C,2,FALSE),\"\")","v":""},null,null,null,0]
[null,null,null,null,null,{"$f":"IFERROR(VLOOKUP(E968,Insumos!A:C,2,FALSE),\"\")","v":""},null,null,null,0]
[null,null,null,null,null,{"$f":"IFERROR(VLOOKUP(E969,Insumos!A:C,2,FALSE),\"\")","v":""},null,null,null,0]
[null,null,null,null,null,{"$f":"IFERROR(VLOOKUP(E970,Insumos!A:C,2,FALSE),\"\")","v":""},null,null,null,0]
[null,null,null,null,null,{"$f":"IFERROR(VLOOKUP(E971,Insumos!A:C,2,FALSE),\"\")","v":""},null,null,null,0]
[null,null,null,null,null,{"$f":"IFERROR(VLOOKUP(E972,Insumos!A:C,2,FALSE),\"\")","v":""},null,null,null,0]
[null,null,null,null,null,{"$f":"IFERROR(VLOOKUP(E973,Insumos!A:C,2,FALSE),\"\")","v":""},null,null,null,0]
[null,null,null,null,null,{"$f":"IFERROR(VLOOKUP(E974,Insumos!A:C,2,FALSE),\"\")","v":""},null,null,null,0]
[null,null,null,null,null,{"$f":"IFERROR(VLOOKUP(E975,Insumos!A:C,2,FALSE),\"\")","v":""},null,null,null,0]
[null,null,null,null,null,{"$f":"IFERROR(VLOOKUP(E976,Insumos!A:C,2,FALSE),\"\")","v":""},null,null,null,0]
[null,null,null,null,null,{"$f":"IFERROR(VLOOKUP(E977,Insumos!A:C,2,FALSE),\"\")","v":""},null,null,null,0]
[null,null,null,null,null,{"$f":"IFERROR(VLOOKUP(E978,Insumos!A:C,2,FALSE),\"\")","v":""},null,null,null,0]
[null,null,null,null,null,{"$f":"IFERROR(VLOOKUP(E979,Insumos!A:C,2,FALSE),\"\")","v":""},null,null,null,0]
[null,null,null,null,null,{"$f":"IFERROR(VLOOKUP(E980,Insumos!A:C,2,FALSE),\"\")","v":""},null,null,null,0]
[null,null,null,null,null,{"$f":"IFERROR(VLOOKUP(E981,Insumos!A:C,2,FALSE),\"\")","v":""},null,null,null,0]
[null,null,null,null,null,{"$f":"IFERROR(VLOOKUP(E982,Insumos!A:C,2,FALSE),\"\")","v":""},null,null,null,0]
[null,null,null,null,null,{"$f":"IFERROR(VLOOKUP(E983,Insumos!A:C,2,FALSE),\"\")","v":""},null,null,null,0]
[null,null,null,null,null,{"$f":"IFERROR(VLOOKUP(E984,Insumos!A:C,2,FALSE),\"\")","v":""},null,null,null,0]
[null,null,null,null,null,{"$f":"IFERROR(VLOOKUP(E985,Insumos!A:C,2,FALSE),\"\")","v":""},null,null,null,0]
[null,null,null,null,null,{"$f":"IFERROR(VLOOKUP(E986,Insumos!A:C,2,FALSE),\"\")","v":""},null,null,null,0]
[null,null,null,null,null,{"$f":"IFERROR(VLOOKUP(E987,Insumos!A:C,2,FALSE),\"\")","v":""},null,null,null,0]
[null,null,null,null,null,{"$f":"IFERROR(VLOOKUP(E988,Insumos!A:C,2,FALSE),\"\")","v":""},null,null,null,0]
[null,null,null,null,null,{"$f":"IFERROR(VLOOKUP(E989,Insumos!A:C,2,FALSE),\"\")","v":""},null,null,null,0]
[null,null,null,null,null,{"$f":"IFERROR(VLOOKUP(E990,Insumos!A:C,2,FALSE),\"\")","v":""},null,null,null,0]
[null,null,null,null,null,{"$f":"IFERROR(VLOOKUP(E991,Insumos!A:C,2,FALSE),\"\")","v":""},null,null,null,0]
[null,null,null,null,null,{"$f":"IFERROR(VLOOKUP(E992,Insumos!A:C,2,FALSE),\"\")","v":""},null,null,null,0]
[null,null,null,null,null,{"$f":"IFERROR(VLOOKUP(E993,Insumos!A:C,2,FALSE),\"\")","v":""},null,null,null,0]
[null,null,null,null,null,{"$f":"IFERROR(VLOOKUP(E994,Insumos!A:C,2,FALSE),\"\")","v":""},null,null,null,0]
[null,null,null,null,null,{"$f":"IFERROR(VLOOKUP(E995,Insumos!A:C,2,FALSE),\"\")","v":""},null,null,null,0]
[null,null,null,null,null,{"$f":"IFERROR(VLOOKUP(E996,Insumos!A:C,2,FALSE),\"\")","v":""},null,null,null,0]
[null,null,null,null,null,{"$f":"IFERROR(VLOOKUP(E997,Insumos!A:C,2,FALSE),\"\")","v":""},null,null,null,0]
[null,null,null,null,null,{"$f":"IFERROR(VLOOKUP(E998,Insumos!A:C,2,FALSE),\"\")","v":""},null,null,null,0]
[null,null,null,null,null,{"$f":"IFERROR(VLOOKUP(E999,Insumos!A:C,2,FALSE),\"\")","v":""},null,null,null,0]
[null,null,null,null,null,{"$f":"IFERROR(VLOOKUP(E1000,Insumos!A:C,2,FALSE),\"\")","v":""},null,null,null,0]
[null,null,null,null,null,{"$f":"IFERROR(VLOOKUP(E1001,Insumos!A:C,2,FALSE),\"\")","v":""},null,null,null,0]
[null,null,null,null,null,{"$f":"IFERROR(VLOOKUP(E1002,Insumos!A:C,2,FALSE),\"\")","v":""},null,null,null,0]
[null,null,null,null,null,{"$f":"IFERROR(VLOOKUP(E1003,Insumos!A:C,2,FALSE),\"\")","v":""},null,null,null,0]
[null,null,null,null,null,{"$f":"IFERROR(VLOOKUP(E1004,Insumos!A:C,2,FALSE),\"\")","v":""},null,null,null,0]
[null,null,null,null,null,{"$f":"IFERROR(VLOOKUP(E1005,Insumos!A:C,2,FALSE),\"\")","v":""},null,null,null,0]
[null,null,null,null,null,{"$f":"IFERROR(VLOOKUP(E1006,Insumos!A:C,2,FALSE),\"\")","v":""},null,null,null,0]
[null,null,null,null,null,{"$f":"IFERROR(VLOOKUP(E1007,Insumos!A:C,2,FALSE),\"\")","v":""},null,null,null,0]
[null,null,null,null,null,{"$f":"IFERROR(VLOOKUP(E1008,Insumos!A:C,2,FALSE),\"\")","v":""},null,null,null,0]
[null,null,null,null,null,{"$f":"IFERROR(VLOOKUP(E1009,Insumos!A:C,2,FALSE),\"\")","v":""},null,null,null,0]
[null,null,null,null,null,{"$f":"IFERROR(VLOOKUP(E1010,Insumos!A:C,2,FALSE),\"\")","v":""},null,null,null,0]
[null,null,null,null,null,{"$f":"IFERROR(VLOOKUP(E1011,Insumos!A:C,2,FALSE),\"\")","v":""},null,null,null,0]
[null,null,null,null,null,{"$f":"IFERROR(VLOOKUP(E1012,Insumos!A:C,2,FALSE),\"\")","v":""},null,null,null,0]
[null,null,null,null,null,{"$f":"IFERROR(VLOOKUP(E1013,Insumos!A:C,2,FALSE),\"\")","v":""},null,null,null,0]
[null,null,null,null,null,{"$f":"IFERROR(VLOOKUP(E1014,Insumos!A:C,2,FALSE),\"\")","v":""},null,null,null,0]
[null,null,null,null,null,{"$f":"IFERROR(VLOOKUP(E1015,Insumos!A:C,2,FALSE),\"\")","v":""},null,null,null,0]
[null,null,null,null,null,{"$f":"IFERROR(VLOOKUP(E1016,Insumos!A:C,2,FALSE),\"\")","v":""},null,null,null,0]
[null,null,null,null,null,{"$f":"IFERROR(VLOOKUP(E1017,Insumos!A:C,2,FALSE),\"\")","v":""},null,null,null,0]
[null,null,null,null,null,{"$f":"IFERROR(VLOOKUP(E1018,Insumos!A:C,2,FALSE),\"\")","v":""},null,null,null,0]
[null,null,null,null,null,{"$f":"IFERROR(VLOOKUP(E1019,Insumos!A:C,2,FALSE),\"\")","v":""},null,null,null,0]
[null,null,null,null,null,{"$f":"IFERROR(VLOOKUP(E1020,Insumos!A:C,2,FALSE),\"\")","v":""},null,null,null,0]
[null,null,null,null,null,{"$f":"IFERROR(VLOOKUP(E1021,Insumos!A:C,2,FALSE),\"\")","v":""},null,null,null,0]
[null,null,null,null,null,{"$f":"IFERROR(VLOOKUP(E1022,Insumos!A:C,2,FALSE),\"\")","v":""},null,null,null,0]
[null,null,null,null,null,{"$f":"IFERROR(VLOOKUP(E1023,Insumos!A:C,2,FALSE),\"\")","v":""},null,null,null,0]
[null,null,null,null,null,{"$f":"IFERROR(VLOOKUP(E1024,Insumos!A:C,2,FALSE),\"\")","v":""},null,null,null,0]
[null,null,null,null,null,{"$f":"IFERROR(VLOOKUP(E1025,Insumos!A:C,2,FALSE),\"\")","v":""},null,null,null,0]
[null,null,null,null,null,{"$f":"IFERROR(VLOOKUP(E1026,Insumos!A:C,2,FALSE),\"\")","v":""},null,null,null,0]
[null,null,null,null,null,{"$f":"IFERROR(VLOOKUP(E1027,Insumos!A:C,2,FALSE),\"\")","v":""},null,null,null,0]
[null,null,null,null,null,{"$f":"IFERROR(VLOOKUP(E1028,Insumos!A:C,2,FALSE),\"\")","v":""},null,null,null,0]
[null,null,null,null,null,{"$f":"IFERROR(VLOOKUP(E1029,Insumos!A:C,2,FALSE),\"\")","v":""},null,null,null,{"$f":"IFERROR(H1029*I1029,\"\")","v":0}]
[null,null,null,null,null,{"$f":"IFERROR(VLOOKUP(E1030,Insumos!A:C,2,FALSE),\"\")","v":""},null,null,null,0]
[null,null,null,null,null,{"$f":"IFERROR(VLOOKUP(E1031,Insumos!A:C,2,FALSE),\"\")","v":""},null,null,null,0]
[null,null,null,null,null,{"$f":"IFERROR(VLOOKUP(E1032,Insumos!A:C,2,FALSE),\"\")","v":""},null,null,null,0]
[null,null,null,null,null,{"$f":"IFERROR(VLOOKUP(E1033,Insumos!A:C,2,FALSE),\"\")","v":""},null,null,null,0]
[null,null,null,null,null,{"$f":"IFERROR(VLOOKUP(E1034,Insumos!A:C,2,FALSE),\"\")","v":""},null,null,null,0]
[null,null,null,null,null,{"$f":"IFERROR(VLOOKUP(E1035,Insumos!A:C,2,FALSE),\"\")","v":""},null,null,null,0]
[null,null,null,null,null,{"$f":"IFERROR(VLOOKUP(E1036,Insumos!A:C,2,FALSE),\"\")","v":""},null,null,null,0]
[null,null,null,null,null,{"$f":"IFERROR(VLOOKUP(E1037,Insumos!A:C,2,FALSE),\"\")","v":""},null,null,null,0]
[null,null,null,null,null,{"$f":"IFERROR(VLOOKUP(E1038,Insumos!A:C,2,FALSE),\"\")","v":""},null,null,null,0]
[null,null,null,null,null,{"$f":"IFERROR(VLOOKUP(E1039,Insumos!A:C,2,FALSE),\"\")","v":""},null,null,null,0]
[null,null,null,null,null,{"$f":"IFERROR(VLOOKUP(E1040,Insumos!A:C,2,FALSE),\"\")","v":""},null,null,null,0]
[null,null,null,null,null,{"$f":"IFERROR(VLOOKUP(E1041,Insumos!A:C,2,FALSE),\"\")","v":""},null,null,null,0]
[null,null,null,null,null,{"$f":"IFERROR(VLOOKUP(E1042,Insumos!A:C,2,FALSE),\"\")","v":""},null,null,null,0]
[null,null,null,null,null,{"$f":"IFERROR(VLOOKUP(E1043,Insumos!A:C,2,FALSE),\"\")","v":""},null,null,null,0]
[null,null,null,null,null,{"$f":"IFERROR(VLOOKUP(E1044,Insumos!A:C,2,FALSE),\"\")","v":""},null,null,null,0]
[null,null,null,null,null,{"$f":"IFERROR(VLOOKUP(E1045,Insumos!A:C,2,FALSE),\"\")","v":""},null,null,null,0]
[null,null,null,null,null,{"$f":"IFERROR(VLOOKUP(E1046,Insumos!A:C,2,FALSE),\"\")","v":""},null,null,null,0]
[null,null,null,null,null,{"$f":"IFERROR(VLOOKUP(E1047,Insumos!A:C,2,FALSE),\"\")","v":""},null,null,null,0]
[null,null,null,null,null,{"$f":"IFERROR(VLOOKUP(E1048,Insumos!A:C,2,FALSE),\"\")","v":""},null,null,null,0]
[null,null,null,null,null,{"$f":"IFERROR(VLOOKUP(E1049,Insumos!A:C,2,FALSE),\"\")","v":""},null,null,null,0]
[null,null,null,null,null,{"$f":"IFERROR(VLOOKUP(E1050,Insumos!A:C,2,FALSE),\"\")","v":""},null,null,null,0]
[null,null,null,null,null,{"$f":"IFERROR(VLOOKUP(E1051,Insumos!A:C,2,FALSE),\"\")","v":""},null,null,null,0]
[null,null,null,null,null,{"$f":"IFERROR(VLOOKUP(E1052,Insumos!A:C,2,FALSE),\"\")","v":""},null,null,null,0]
[null,null,null,null,null,{"$f":"IFERROR(VLOOKUP(E1053,Insumos!A:C,2,FALSE),\"\")","v":""},null,null,null,0]
[null,null,null,null,null,{"$f":"IFERROR(VLOOKUP(E1054,Insumos!A:C,2,FALSE),\"\")","v":""},null,null,null,0]
[null,null,null,null,null,{"$f":"IFERROR(VLOOKUP(E1055,Insumos!A:C,2,FALSE),\"\")","v":""},null,null,null,0]
[null,null,null,null,null,{"$f":"IFERROR(VLOOKUP(E1056,Insumos!A:C,2,FALSE),\"\")","v":""},null,null,null,0]
[null,null,null,null,null,{"$f":"IFERROR(VLOOKUP(E1057,Insumos!A:C,2,FALSE),\"\")","v":""},null,null,null,0]
[null,null,null,null,null,{"$f":"IFERROR(VLOOKUP(E1058,Insumos!A:C,2,FALSE),\"\")","v":""},null,null,null,0]
[null,null,null,null,null,{"$f":"IFERROR(VLOOKUP(E1059,Insumos!A:C,2,FALSE),\"\")","v":""},null,null,null,0]
[null,null,null,null,null,{"$f":"IFERROR(VLOOKUP(E1060,Insumos!A:C,2,FALSE),\"\")","v":""},null,null,null,0]
[null,null,null,null,null,{"$f":"IFERROR(VLOOKUP(E1061,Insumos!A:C,2,FALSE),\"\")","v":""},null,null,null,0]
[null,null,null,null,null,{"$f":"IFERROR(VLOOKUP(E1062,Insumos!A:C,2,FALSE),\"\")","v":""},null,null,null,0]
[null,null,null,null,null,{"$f":"IFERROR(VLOOKUP(E1063,Insumos!A:C,2,FALSE),\"\")","v":""},null,null,null,0]
[null,null,null,null,null,{"$f":"IFERROR(VLOOKUP(E1064,Insumos!A:C,2,FALSE),\"\")","v":""},null,null,null,0]
[null,null,null,null,null,{"$f":"IFERROR(VLOOKUP(E1065,Insumos!A:C,2,FALSE),\"\")","v":""},null,null,null,0]
[null,null,null,null,null,{"$f":"IFERROR(VLOOKUP(E1066,Insumos!A:C,2,FALSE),\"\")","v":""},null,null,null,0]
[null,null,null,null,null,{"$f":"IFERROR(VLOOKUP(E1067,Insumos!A:C,2,FALSE),\"\")","v":""},null,null,null,0]
[null,null,null,null,null,{"$f":"IFERROR(VLOOKUP(E1068,Insumos!A:C,2,FALSE),\"\")","v":""},null,null,null,0]
[null,null,null,null,null,{"$f":"IFERROR(VLOOKUP(E1069,Insumos!A:C,2,FALSE),\"\")","v":""},null,null,null,0]
[null,null,null,null,null,{"$f":"IFERROR(VLOOKUP(E1070,Insumos!A:C,2,FALSE),\"\")","v":""},null,null,null,0]
[null,null,null,null,null,{"$f":"IFERROR(VLOOKUP(E1071,Insumos!A:C,2,FALSE),\"\")","v":""},null,null,null,0]
[null,null,null,null,null,{"$f":"IFERROR(VLOOKUP(E1072,Insumos!A:C,2,FALSE),\"\")","v":""},null,null,null,0]
[null,null,null,null,null,{"$f":"IFERROR(VLOOKUP(E1073,Insumos!A:C,2,FALSE),\"\")","v":""},null,null,null,0]
[null,null,null,null,null,{"$f":"IFERROR(VLOOKUP(E1074,Insumos!A:C,2,FALSE),\"\")","v":""},null,null,null,0]
[null,null,null,null,null,{"$f":"IFERROR(VLOOKUP(E1075,Insumos!A:C,2,FALSE),\"\")","v":""},null,null,null,0]
[null,null,null,null,null,{"$f":"IFERROR(VLOOKUP(E1076,Insumos!A:C,2,FALSE),\"\")","v":""},null,null,null,0]
[null,null,null,null,null,{"$f":"IFERROR(VLOOKUP(E1077,Insumos!A:C,2,FALSE),\"\")","v":""},null,null,null,0]
[null,null,null,null,null,{"$f":"IFERROR(VLOOKUP(E1078,Insumos!A:C,2,FALSE),\"\")","v":""},null,null,null,0]
[null,null,null,null,null,{"$f":"IFERROR(VLOOKUP(E1079,Insumos!A:C,2,FALSE),\"\")","v":""},null,null,null,0]
[null,null,null,null,null,{"$f":"IFERROR(VLOOKUP(E1080,Insumos!A:C,2,FALSE),\"\")","v":""},null,null,null,0]
[null,null,null,null,null,{"$f":"IFERROR(VLOOKUP(E1081,Insumos!A:C,2,FALSE),\"\")","v":""},null,null,null,0]
[null,null,null,null,null,{"$f":"IFERROR(VLOOKUP(E1082,Insumos!A:C,2,FALSE),\"\")","v":""},null,null,null,0]
[null,null,null,null,null,{"$f":"IFERROR(VLOOKUP(E1083,Insumos!A:C,2,FALSE),\"\")","v":""},null,null,null,0]
[null,null,null,null,null,{"$f":"IFERROR(VLOOKUP(E1084,Insumos!A:C,2,FALSE),\"\")","v":""},null,null,null,0]
[null,null,null,null,null,{"$f":"IFERROR(VLOOKUP(E1085,Insumos!A:C,2,FALSE),\"\")","v":""},null,null,null,0]
[null,null,null,null,null,{"$f":"IFERROR(VLOOKUP(E1086,Insumos!A:C,2,FALSE),\"\")","v":""},null,null,null,0]
[null,null,null,null,null,{"$f":"IFERROR(VLOOKUP(E1087,Insumos!A:C,2,FALSE),\"\")","v":""},null,null,null,0]
[null,null,null,null,null,{"$f":"IFERROR(VLOOKUP(E1088,Insumos!A:C,2,FALSE),\"\")","v":""},null,null,null,0]
[null,null,null,null,null,{"$f":"IFERROR(VLOOKUP(E1089,Insumos!A:C,2,FALSE),\"\")","v":""},null,null,null,0]
[null,null,null,null,null,{"$f":"IFERROR(VLOOKUP(E1090,Insumos!A:C,2,FALSE),\"\")","v":""},null,null,null,0]
[null,null,null,null,null,{"$f":"IFERROR(VLOOKUP(E1091,Insumos!A:C,2,FALSE),\"\")","v":""},null,null,null,0]
[null,null,null,null,null,{"$f":"IFERROR(VLOOKUP(E1092,Insumos!A:C,2,FALSE),\"\")","v":""},null,null,null,0]
[null,null,null,null,null,{"$f":"IFERROR(VLOOKUP(E1093,Insumos!A:C,2,FALSE),\"\")","v":""},null,null,null,{"$f":"IFERROR(H1093*I1093,\"\")","v":0}]
[null,null,null,null,null,{"$f":"IFERROR(VLOOKUP(E1094,Insumos!A:C,2,FALSE),\"\")","v":""},null,null,null,0]
[null,null,null,null,null,{"$f":"IFERROR(VLOOKUP(E1095,Insumos!A:C,2,FALSE),\"\")","v":""},null,null,null,0]
[null,null,null,null,null,{"$f":"IFERROR(VLOOKUP(E1096,Insumos!A:C,2,FALSE),\"\")","v":""},null,null,null,0]
[null,null,null,null,null,{"$f":"IFERROR(VLOOKUP(E1097,Insumos!A:C,2,FALSE),\"\")","v":""},null,null,null,0]
[null,null,null,null,null,{"$f":"IFERROR(VLOOKUP(E1098,Insumos!A:C,2,FALSE),\"\")","v":""},null,null,null,0]
[null,null,null,null,null,{"$f":"IFERROR(VLOOKUP(E1099,Insumos!A:C,2,FALSE),\"\")","v":""},null,null,null,0]
[null,null,null,null,null,{"$f":"IFERROR(VLOOKUP(E1100,Insumos!A:C,2,FALSE),\"\")","v":""},null,null,null,0]
[null,null,null,null,null,{"$f":"IFERROR(VLOOKUP(E1101,Insumos!A:C,2,FALSE),\"\")","v":""},null,null,null,0]
[null,null,null,null,null,{"$f":"IFERROR(VLOOKUP(E1102,Insumos!A:C,2,FALSE),\"\")","v":""},null,null,null,0]
[null,null,null,null,null,{"$f":"IFERROR(VLOOKUP(E1103,Insumos!A:C,2,FALSE),\"\")","v":""},null,null,null,0]
[null,null,null,null,null,{"$f":"IFERROR(VLOOKUP(E1104,Insumos!A:C,2,FALSE),\"\")","v":""},null,null,null,0]
[null,null,null,null,null,{"$f":"IFERROR(VLOOKUP(E1105,Insumos!A:C,2,FALSE),\"\")","v":""},null,null,null,0]
[null,null,null,null,null,{"$f":"IFERROR(VLOOKUP(E1106,Insumos!A:C,2,FALSE),\"\")","v":""},null,null,null,0]
[null,null,null,null,null,{"$f":"IFERROR(VLOOKUP(E1107,Insumos!A:C,2,FALSE),\"\")","v":""},null,null,null,0]
[null,null,null,null,null,{"$f":"IFERROR(VLOOKUP(E1108,Insumos!A:C,2,FALSE),\"\")","v":""},null,null,null,0]
[null,null,null,null,null,{"$f":"IFERROR(VLOOKUP(E1109,Insumos!A:C,2,FALSE),\"\")","v":""},null,null,null,0]
[null,null,null,null,null,{"$f":"IFERROR(VLOOKUP(E1110,Insumos!A:C,2,FALSE),\"\")","v":""},null,null,null,0]
[null,null,null,null,null,{"$f":"IFERROR(VLOOKUP(E1111,Insumos!A:C,2,FALSE),\"\")","v":""},null,null,null,0]
[null,null,null,null,null,{"$f":"IFERROR(VLOOKUP(E1112,Insumos!A:C,2,FALSE),\"\")","v":""},null,null,null,0]
[null,null,null,null,null,{"$f":"IFERROR(VLOOKUP(E1113,Insumos!A:C,2,FALSE),\"\")","v":""},null,null,null,0]
[null,null,null,null,null,{"$f":"IFERROR(VLOOKUP(E1114,Insumos!A:C,2,FALSE),\"\")","v":""},null,null,null,0]
[null,null,null,null,null,{"$f":"IFERROR(VLOOKUP(E1115,Insumos!A:C,2,FALSE),\"\")","v":""},null,null,null,0]
[null,null,null,null,null,{"$f":"IFERROR(VLOOKUP(E1116,Insumos!A:C,2,FALSE),\"\")","v":""},null,null,null,0]
[null,null,null,null,null,{"$f":"IFERROR(VLOOKUP(E1117,Insumos!A:C,2,FALSE),\"\")","v":""},null,null,null,0]
[null,null,null,null,null,{"$f":"IFERROR(VLOOKUP(E1118,Insumos!A:C,2,FALSE),\"\")","v":""},null,null,null,0]
[null,null,null,null,null,{"$f":"IFERROR(VLOOKUP(E1119,Insumos!A:C,2,FALSE),\"\")","v":""},null,null,null,0]
[null,null,null,null,null,{"$f":"IFERROR(VLOOKUP(E1120,Insumos!A:C,2,FALSE),\"\")","v":""},null,null,null,0]
[null,null,null,null,null,{"$f":"IFERROR(VLOOKUP(E1121,Insumos!A:C,2,FALSE),\"\")","v":""},null,null,null,0]
[null,null,null,null,null,{"$f":"IFERROR(VLOOKUP(E1122,Insumos!A:C,2,FALSE),\"\")","v":""},null,null,null,0]
[null,null,null,null,null,{"$f":"IFERROR(VLOOKUP(E1123,Insumos!A:C,2,FALSE),\"\")","v":""},null,null,null,0]
[null,null,null,null,null,{"$f":"IFERROR(VLOOKUP(E1124,Insumos!A:C,2,FALSE),\"\")","v":""},null,null,null,0]
[null,null,null,null,null,{"$f":"IFERROR(VLOOKUP(E1125,Insumos!A:C,2,FALSE),\"\")","v":""},null,null,null,0]
[null,null,null,null,null,{"$f":"IFERROR(VLOOKUP(E1126,Insumos!A:C,2,FALSE),\"\")","v":""},null,null,null,0]
[null,null,null,null,null,{"$f":"IFERROR(VLOOKUP(E1127,Insumos!A:C,2,FALSE),\"\")","v":""},null,null,null,0]
[null,null,null,null,null,{"$f":"IFERROR(VLOOKUP(E1128,Insumos!A:C,2,FALSE),\"\")","v":""},null,null,null,0]
[null,null,null,null,null,{"$f":"IFERROR(VLOOKUP(E1129,Insumos!A:C,2,FALSE),\"\")","v":""},null,null,null,0]
[null,null,null,null,null,{"$f":"IFERROR(VLOOKUP(E1130,Insumos!A:C,2,FALSE),\"\")","v":""},null,null,null,0]
[null,null,null,null,null,{"$f":"IFERROR(VLOOKUP(E1131,Insumos!A:C,2,FALSE),\"\")","v":""},null,null,null,0]
[null,null,null,null,null,{"$f":"IFERROR(VLOOKUP(E1132,Insumos!A:C,2,FALSE),\"\")","v":""},null,null,null,0]
[null,null,null,null,null,{"$f":"IFERROR(VLOOKUP(E1133,Insumos!A:C,2,FALSE),\"\")","v":""},null,null,null,0]
[null,null,null,null,null,{"$f":"IFERROR(VLOOKUP(E1134,Insumos!A:C,2,FALSE),\"\")","v":""},null,null,null,0]
[null,null,null,null,null,{"$f":"IFERROR(VLOOKUP(E1135,Insumos!A:C,2,FALSE),\"\")","v":""},null,null,null,0]
[null,null,null,null,null,{"$f":"IFERROR(VLOOKUP(E1136,Insumos!A:C,2,FALSE),\"\")","v":""},null,null,null,0]
[null,null,null,null,null,{"$f":"IFERROR(VLOOKUP(E1137,Insumos!A:C,2,FALSE),\"\")","v":""},null,null,null,0]
[null,null,null,null,null,{"$f":"IFERROR(VLOOKUP(E1138,Insumos!A:C,2,FALSE),\"\")","v":""},null,null,null,0]
[null,null,null,null,null,{"$f":"IFERROR(VLOOKUP(E1139,Insumos!A:C,2,FALSE),\"\")","v":""},null,null,null,0]
[null,null,null,null,null,{"$f":"IFERROR(VLOOKUP(E1140,Insumos!A:C,2,FALSE),\"\")","v":""},null,null,null,0]
[null,null,null,null,null,{"$f":"IFERROR(VLOOKUP(E1141,Insumos!A:C,2,FALSE),\"\")","v":""},null,null,null,0]
[null,null,null,null,null,{"$f":"IFERROR(VLOOKUP(E1142,Insumos!A:C,2,FALSE),\"\")","v":""},null,null,null,0]
[null,null,null,null,null,{"$f":"IFERROR(VLOOKUP(E1143,Insumos!A:C,2,FALSE),\"\")","v":""},null,null,null,0]
[null,null,null,null,null,{"$f":"IFERROR(VLOOKUP(E1144,Insumos!A:C,2,FALSE),\"\")","v":""},null,null,null,0]
[null,null,null,null,null,{"$f":"IFERROR(VLOOKUP(E1145,Insumos!A:C,2,FALSE),\"\")","v":""},null,null,null,0]
[null,null,null,null,null,{"$f":"IFERROR(VLOOKUP(E1146,Insumos!A:C,2,FALSE),\"\")","v":""},null,null,null,0]
[null,null,null,null,null,{"$f":"IFERROR(VLOOKUP(E1147,Insumos!A:C,2,FALSE),\"\")","v":""},null,null,null,0]
[null,null,null,null,null,{"$f":"IFERROR(VLOOKUP(E1148,Insumos!A:C,2,FALSE),\"\")","v":""},null,null,null,0]
[null,null,null,null,null,{"$f":"IFERROR(VLOOKUP(E1149,Insumos!A:C,2,FALSE),\"\")","v":""},null,null,null,0]
[null,null,null,null,null,{"$f":"IFERROR(VLOOKUP(E1150,Insumos!A:C,2,FALSE),\"\")","v":""},null,null,null,0]
[null,null,null,null,null,{"$f":"IFERROR(VLOOKUP(E1151,Insumos!A:C,2,FALSE),\"\")","v":""},null,null,null,0]
[null,null,null,null,null,{"$f":"IFERROR(VLOOKUP(E1152,Insumos!A:C,2,FALSE),\"\")","v":""},null,null,null,0]
[null,null,null,null,null,{"$f":"IFERROR(VLOOKUP(E1153,Insumos!A:C,2,FALSE),\"\")","v":""},null,null,null,0]
[null,null,null,null,null,{"$f":"IFERROR(VLOOKUP(E1154,Insumos!A:C,2,FALSE),\"\")","v":""},null,null,null,0]
[null,null,null,null,null,{"$f":"IFERROR(VLOOKUP(E1155,Insumos!A:C,2,FALSE),\"\")","v":""},null,null,null,0]
[null,null,null,null,null,{"$f":"IFERROR(VLOOKUP(E1156,Insumos!A:C,2,FALSE),\"\")","v":""},null,null,null,0]
[null,null,null,null,null,{"$f":"IFERROR(VLOOKUP(E1157,Insumos!A:C,2,FALSE),\"\")","v":""},null,null,null,{"$f":"IFERROR(H1157*I1157,\"\")","v":0}]
[null,null,null,null,null,{"$f":"IFERROR(VLOOKUP(E1158,Insumos!A:C,2,FALSE),\"\")","v":""},null,null,null,0]
[null,null,null,null,null,{"$f":"IFERROR(VLOOKUP(E1159,Insumos!A:C,2,FALSE),\"\")","v":""},null,null,null,0]
[null,null,null,null,null,{"$f":"IFERROR(VLOOKUP(E1160,Insumos!A:C,2,FALSE),\"\")","v":""},null,null,null,0]
[null,null,null,null,null,{"$f":"IFERROR(VLOOKUP(E1161,Insumos!A:C,2,FALSE),\"\")","v":""},null,null,null,0]
[null,null,null,null,null,{"$f":"IFERROR(VLOOKUP(E1162,Insumos!A:C,2,FALSE),\"\")","v":""},null,null,null,0]
[null,null,null,null,null,{"$f":"IFERROR(VLOOKUP(E1163,Insumos!A:C,2,FALSE),\"\")","v":""},null,null,null,0]
[null,null,null,null,null,{"$f":"IFERROR(VLOOKUP(E1164,Insumos!A:C,2,FALSE),\"\")","v":""},null,null,null,0]
[null,null,null,null,null,{"$f":"IFERROR(VLOOKUP(E1165,Insumos!A:C,2,FALSE),\"\")","v":""},null,null,null,0]
[null,null,null,null,null,{"$f":"IFERROR(VLOOKUP(E1166,Insumos!A:C,2,FALSE),\"\")","v":""},null,null,null,0]
[null,null,null,null,null,{"$f":"IFERROR(VLOOKUP(E1167,Insumos!A:C,2,FALSE),\"\")","v":""},null,null,null,0]
[null,null,null,null,null,{"$f":"IFERROR(VLOOKUP(E1168,Insumos!A:C,2,FALSE),\"\")","v":""},null,null,null,0]
[null,null,null,null,null,{"$f":"IFERROR(VLOOKUP(E1169,Insumos!A:C,2,FALSE),\"\")","v":""},null,null,null,0]
[null,null,null,null,null,{"$f":"IFERROR(VLOOKUP(E1170,Insumos!A:C,2,FALSE),\"\")","v":""},null,null,null,0]
[null,null,null,null,null,{"$f":"IFERROR(VLOOKUP(E1171,Insumos!A:C,2,FALSE),\"\")","v":""},null,null,null,0]
[null,null,null,null,null,{"$f":"IFERROR(VLOOKUP(E1172,Insumos!A:C,2,FALSE),\"\")","v":""},null,null,null,0]
[null,null,null,null,null,{"$f":"IFERROR(VLOOKUP(E1173,Insumos!A:C,2,FALSE),\"\")","v":""},null,null,null,0]
[null,null,null,null,null,{"$f":"IFERROR(VLOOKUP(E1174,Insumos!A:C,2,FALSE),\"\")","v":""},null,null,null,0]
[null,null,null,null,null,{"$f":"IFERROR(VLOOKUP(E1175,Insumos!A:C,2,FALSE),\"\")","v":""},null,null,null,0]
[null,null,null,null,null,{"$f":"IFERROR(VLOOKUP(E1176,Insumos!A:C,2,FALSE),\"\")","v":""},null,null,null,0]
[null,null,null,null,null,{"$f":"IFERROR(VLOOKUP(E1177,Insumos!A:C,2,FALSE),\"\")","v":""},null,null,null,0]
[null,null,null,null,null,{"$f":"IFERROR(VLOOKUP(E1178,Insumos!A:C,2,FALSE),\"\")","v":""},null,null,null,0]
[null,null,null,null,null,{"$f":"IFERROR(VLOOKUP(E1179,Insumos!A:C,2,FALSE),\"\")","v":""},null,null,null,0]
[null,null,null,null,null,{"$f":"IFERROR(VLOOKUP(E1180,Insumos!A:C,2,FALSE),\"\")","v":""},null,null,null,0]
[null,null,null,null,null,{"$f":"IFERROR(VLOOKUP(E1181,Insumos!A:C,2,FALSE),\"\")","v":""},null,null,null,0]
[null,null,null,null,null,{"$f":"IFERROR(VLOOKUP(E1182,Insumos!A:C,2,FALSE),\"\")","v":""},null,null,null,0]
[null,null,null,null,null,{"$f":"IFERROR(VLOOKUP(E1183,Insumos!A:C,2,FALSE),\"\")","v":""},null,null,null,0]
[null,null,null,null,null,{"$f":"IFERROR(VLOOKUP(E1184,Insumos!A:C,2,FALSE),\"\")","v":""},null,null,null,0]
[null,null,null,null,null,{"$f":"IFERROR(VLOOKUP(E1185,Insumos!A:C,2,FALSE),\"\")","v":""},null,null,null,0]
[null,null,null,null,null,{"$f":"IFERROR(VLOOKUP(E1186,Insumos!A:C,2,FALSE),\"\")","v":""},null,null,null,0]
[null,null,null,null,null,{"$f":"IFERROR(VLOOKUP(E1187,Insumos!A:C,2,FALSE),\"\")","v":""},null,null,null,0]
[null,null,null,null,null,{"$f":"IFERROR(VLOOKUP(E1188,Insumos!A:C,2,FALSE),\"\")","v":""},null,null,null,0]
[null,null,null,null,null,{"$f":"IFERROR(VLOOKUP(E1189,Insumos!A:C,2,FALSE),\"\")","v":""},null,null,null,0]
[null,null,null,null,null,{"$f":"IFERROR(VLOOKUP(E1190,Insumos!A:C,2,FALSE),\"\")","v":""},null,null,null,0]
[null,null,null,null,null,{"$f":"IFERROR(VLOOKUP(E1191,Insumos!A:C,2,FALSE),\"\")","v":""},null,null,null,0]
[null,null,null,null,null,{"$f":"IFERROR(VLOOKUP(E1192,Insumos!A:C,2,FALSE),\"\")","v":""},null,null,null,0]
[null,null,null,null,null,{"$f":"IFERROR(VLOOKUP(E1193,Insumos!A:C,2,FALSE),\"\")","v":""},null,null,null,0]
[null,null,null,null,null,{"$f":"IFERROR(VLOOKUP(E1194,Insumos!A:C,2,FALSE),\"\")","v":""},null,null,null,0]
[null,null,null,null,null,{"$f":"IFERROR(VLOOKUP(E1195,Insumos!A:C,2,FALSE),\"\")","v":""},null,null,null,0]
[null,null,null,null,null,{"$f":"IFERROR(VLOOKUP(E1196,Insumos!A:C,2,FALSE),\"\")","v":""},null,null,null,0]
[null,null,null,null,null,{"$f":"IFERROR(VLOOKUP(E1197,Insumos!A:C,2,FALSE),\"\")","v":""},null,null,null,0]
[null,null,null,null,null,{"$f":"IFERROR(VLOOKUP(E1198,Insumos!A:C,2,FALSE),\"\")","v":""},null,null,null,0]
[null,null,null,null,null,{"$f":"IFERROR(VLOOKUP(E1199,Insumos!A:C,2,FALSE),\"\")","v":""},null,null,null,0]
[null,null,null,null,null,{"$f":"IFERROR(VLOOKUP(E1200,Insumos!A:C,2,FALSE),\"\")","v":""},null,null,null,0]
[null,null,null,null,null,{"$f":"IFERROR(VLOOKUP(E1201,Insumos!A:C,2,FALSE),\"\")","v":""},null,null,null,0]
[null,null,null,null,null,{"$f":"IFERROR(VLOOKUP(E1202,Insumos!A:C,2,FALSE),\"\")","v":""},null,null,null,0]
[null,null,null,null,null,{"$f":"IFERROR(VLOOKUP(E1203,Insumos!A:C,2,FALSE),\"\")","v":""},null,null,null,0]
[null,null,null,null,null,{"$f":"IFERROR(VLOOKUP(E1204,Insumos!A:C,2,FALSE),\"\")","v":""},null,null,null,0]
[null,null,null,null,null,{"$f":"IFERROR(VLOOKUP(E1205,Insumos!A:C,2,FALSE),\"\")","v":""},null,null,null,0]
[null,null,null,null,null,{"$f":"IFERROR(VLOOKUP(E1206,Insumos!A:C,2,FALSE),\"\")","v":""},null,null,null,0]
[null,null,null,null,null,{"$f":"IFERROR(VLOOKUP(E1207,Insumos!A:C,2,FALSE),\"\")","v":""},null,null,null,0]
[null,null,null,null,null,{"$f":"IFERROR(VLOOKUP(E1208,Insumos!A:C,2,FALSE),\"\")","v":""},null,null,null,0]
[null,null,null,null,null,{"$f":"IFERROR(VLOOKUP(E1209,Insumos!A:C,2,FALSE),\"\")","v":""},null,null,null,0]
[null,null,null,null,null,{"$f":"IFERROR(VLOOKUP(E1210,Insumos!A:C,2,FALSE),\"\")","v":""},null,null,null,0]
[null,null,null,null,null,{"$f":"IFERROR(VLOOKUP(E1211,Insumos!A:C,2,FALSE),\"\")","v":""},null,null,null,0]
[null,null,null,null,null,{"$f":"IFERROR(VLOOKUP(E1212,Insumos!A:C,2,FALSE),\"\")","v":""},null,null,null,0]
[null,null,null,null,null,{"$f":"IFERROR(VLOOKUP(E1213,Insumos!A:C,2,FALSE),\"\")","v":""},null,null,null,0]
[null,null,null,null,null,{"$f":"IFERROR(VLOOKUP(E1214,Insumos!A:C,2,FALSE),\"\")","v":""},null,null,null,0]
[null,null,null,null,null,{"$f":"IFERROR(VLOOKUP(E1215,Insumos!A:C,2,FALSE),\"\")","v":""},null,null,null,0]
[null,null,null,null,null,{"$f":"IFERROR(VLOOKUP(E1216,Insumos!A:C,2,FALSE),\"\")","v":""},null,null,null,0]
[null,null,null,null,null,{"$f":"IFERROR(VLOOKUP(E1217,Insumos!A:C,2,FALSE),\"\")","v":""},null,null,null,0]
[null,null,null,null,null,{"$f":"IFERROR(VLOOKUP(E1218,Insumos!A:C,2,FALSE),\"\")","v":""},null,null,null,0]
[null,null,null,null,null,{"$f":"IFERROR(VLOOKUP(E1219,Insumos!A:C,2,FALSE),\"\")","v":""},null,null,null,0]
[null,null,null,null,null,{"$f":"IFERROR(VLOOKUP(E1220,Insumos!A:C,2,FALSE),\"\")","v":""},null,null,null,0]
[null,null,null,null,null,{"$f":"IFERROR(VLOOKUP(E1221,Insumos!A:C,2,FALSE),\"\")","v":""},null,null,null,{"$f":"IFERROR(H1221*I1221,\"\")","v":0}]
[null,null,null,null,null,{"$f":"IFERROR(VLOOKUP(E1222,Insumos!A:C,2,FALSE),\"\")","v":""},null,null,null,0]
[null,null,null,null,null,{"$f":"IFERROR(VLOOKUP(E1223,Insumos!A:C,2,FALSE),\"\")","v":""},null,null,null,0]
[null,null,null,null,null,{"$f":"IFERROR(VLOOKUP(E1224,Insumos!A:C,2,FALSE),\"\")","v":""},null,null,null,0]
[null,null,null,null,null,{"$f":"IFERROR(VLOOKUP(E1225,Insumos!A:C,2,FALSE),\"\")","v":""},null,null,null,0]
[null,null,null,null,null,{"$f":"IFERROR(VLOOKUP(E1226,Insumos!A:C,2,FALSE),\"\")","v":""},null,null,null,0]
[null,null,null,null,null,{"$f":"IFERROR(VLOOKUP(E1227,Insumos!A:C,2,FALSE),\"\")","v":""},null,null,null,0]
[null,null,null,null,null,{"$f":"IFERROR(VLOOKUP(E1228,Insumos!A:C,2,FALSE),\"\")","v":""},null,null,null,0]
[null,null,null,null,null,{"$f":"IFERROR(VLOOKUP(E1229,Insumos!A:C,2,FALSE),\"\")","v":""},null,null,null,0]
[null,null,null,null,null,{"$f":"IFERROR(VLOOKUP(E1230,Insumos!A:C,2,FALSE),\"\")","v":""},null,null,null,0]
[null,null,null,null,null,{"$f":"IFERROR(VLOOKUP(E1231,Insumos!A:C,2,FALSE),\"\")","v":""},null,null,null,0]
[null,null,null,null,null,{"$f":"IFERROR(VLOOKUP(E1232,Insumos!A:C,2,FALSE),\"\")","v":""},null,null,null,0]
[null,null,null,null,null,{"$f":"IFERROR(VLOOKUP(E1233,Insumos!A:C,2,FALSE),\"\")","v":""},null,null,null,0]
[null,null,null,null,null,{"$f":"IFERROR(VLOOKUP(E1234,Insumos!A:C,2,FALSE),\"\")","v":""},null,null,null,0]
[null,null,null,null,null,{"$f":"IFERROR(VLOOKUP(E1235,Insumos!A:C,2,FALSE),\"\")","v":""},null,null,null,0]
[null,null,null,null,null,{"$f":"IFERROR(VLOOKUP(E1236,Insumos!A:C,2,FALSE),\"\")","v":""},null,null,null,0]
[null,null,null,null,null,{"$f":"IFERROR(VLOOKUP(E1237,Insumos!A:C,2,FALSE),\"\")","v":""},null,null,null,0]
[null,null,null,null,null,{"$f":"IFERROR(VLOOKUP(E1238,Insumos!A:C,2,FALSE),\"\")","v":""},null,null,null,0]
[null,null,null,null,null,{"$f":"IFERROR(VLOOKUP(E1239,Insumos!A:C,2,FALSE),\"\")","v":""},null,null,null,0]
[null,null,null,null,null,{"$f":"IFERROR(VLOOKUP(E1240,Insumos!A:C,2,FALSE),\"\")","v":""},null,null,null,0]
[null,null,null,null,null,{"$f":"IFERROR(VLOOKUP(E1241,Insumos!A:C,2,FALSE),\"\")","v":""},null,null,null,0]
[null,null,null,null,null,{"$f":"IFERROR(VLOOKUP(E1242,Insumos!A:C,2,FALSE),\"\")","v":""},null,null,null,0]
[null,null,null,null,null,{"$f":"IFERROR(VLOOKUP(E1243,Insumos!A:C,2,FALSE),\"\")","v":""},null,null,null,0]
[null,null,null,null,null,{"$f":"IFERROR(VLOOKUP(E1244,Insumos!A:C,2,FALSE),\"\")","v":""},null,null,null,0]
[null,null,null,null,null,{"$f":"IFERROR(VLOOKUP(E1245,Insumos!A:C,2,FALSE),\"\")","v":""},null,null,null,0]
[null,null,null,null,null,{"$f":"IFERROR(VLOOKUP(E1246,Insumos!A:C,2,FALSE),\"\")","v":""},null,null,null,0]
[null,null,null,null,null,{"$f":"IFERROR(VLOOKUP(E1247,Insumos!A:C,2,FALSE),\"\")","v":""},null,null,null,0]
[null,null,null,null,null,{"$f":"IFERROR(VLOOKUP(E1248,Insumos!A:C,2,FALSE),\"\")","v":""},null,null,null,0]
[null,null,null,null,null,{"$f":"IFERROR(VLOOKUP(E1249,Insumos!A:C,2,FALSE),\"\")","v":""},null,null,null,0]
[null,null,null,null,null,{"$f":"IFERROR(VLOOKUP(E1250,Insumos!A:C,2,FALSE),\"\")","v":""},null,null,null,0]
[null,null,null,null,null,{"$f":"IFERROR(VLOOKUP(E1251,Insumos!A:C,2,FALSE),\"\")","v":""},null,null,null,0]
[null,null,null,null,null,{"$f":"IFERROR(VLOOKUP(E1252,Insumos!A:C,2,FALSE),\"\")","v":""},null,null,null,0]
[null,null,null,null,null,{"$f":"IFERROR(VLOOKUP(E1253,Insumos!A:C,2,FALSE),\"\")","v":""},null,null,null,0]
[null,null,null,null,null,{"$f":"IFERROR(VLOOKUP(E1254,Insumos!A:C,2,FALSE),\"\")","v":""},null,null,null,0]
[null,null,null,null,null,{"$f":"IFERROR(VLOOKUP(E1255,Insumos!A:C,2,FALSE),\"\")","v":""},null,null,null,0]
[null,null,null,null,null,{"$f":"IFERROR(VLOOKUP(E1256,Insumos!A:C,2,FALSE),\"\")","v":""},null,null,null,0]
[null,null,null,null,null,{"$f":"IFERROR(VLOOKUP(E1257,Insumos!A:C,2,FALSE),\"\")","v":""},null,null,null,0]
[null,null,null,null,null,{"$f":"IFERROR(VLOOKUP(E1258,Insumos!A:C,2,FALSE),\"\")","v":""},null,null,null,0]
[null,null,null,null,null,{"$f":"IFERROR(VLOOKUP(E1259,Insumos!A:C,2,FALSE),\"\")","v":""},null,null,null,0]
[null,null,null,null,null,{"$f":"IFERROR(VLOOKUP(E1260,Insumos!A:C,2,FALSE),\"\")","v":""},null,null,null,0]
[null,null,null,null,null,{"$f":"IFERROR(VLOOKUP(E1261,Insumos!A:C,2,FALSE),\"\")","v":""},null,null,null,0]
[null,null,null,null,null,{"$f":"IFERROR(VLOOKUP(E1262,Insumos!A:C,2,FALSE),\"\")","v":""},null,null,null,0]
[null,null,null,null,null,{"$f":"IFERROR(VLOOKUP(E1263,Insumos!A:C,2,FALSE),\"\")","v":""},null,null,null,0]
[null,null,null,null,null,{"$f":"IFERROR(VLOOKUP(E1264,Insumos!A:C,2,FALSE),\"\")","v":""},null,null,null,0]
[null,null,null,null,null,{"$f":"IFERROR(VLOOKUP(E1265,Insumos!A:C,2,FALSE),\"\")","v":""},null,null,null,0]
[null,null,null,null,null,{"$f":"IFERROR(VLOOKUP(E1266,Insumos!A:C,2,FALSE),\"\")","v":""},null,null,null,0]
[null,null,null,null,null,{"$f":"IFERROR(VLOOKUP(E1267,Insumos!A:C,2,FALSE),\"\")","v":""},null,null,null,0]
[null,null,null,null,null,{"$f":"IFERROR(VLOOKUP(E1268,Insumos!A:C,2,FALSE),\"\")","v":""},null,null,null,0]
[null,null,null,null,null,{"$f":"IFERROR(VLOOKUP(E1269,Insumos!A:C,2,FALSE),\"\")","v":""},null,null,null,0]
[null,null,null,null,null,{"$f":"IFERROR(VLOOKUP(E1270,Insumos!A:C,2,FALSE),\"\")","v":""},null,null,null,0]
[null,null,null,null,null,{"$f":"IFERROR(VLOOKUP(E1271,Insumos!A:C,2,FALSE),\"\")","v":""},null,null,null,0]
[null,null,null,null,null,{"$f":"IFERROR(VLOOKUP(E1272,Insumos!A:C,2,FALSE),\"\")","v":""},null,null,null,0]
[null,null,null,null,null,{"$f":"IFERROR(VLOOKUP(E1273,Insumos!A:C,2,FALSE),\"\")","v":""},null,null,null,0]
[null,null,null,null,null,{"$f":"IFERROR(VLOOKUP(E1274,Insumos!A:C,2,FALSE),\"\")","v":""},null,null,null,0]
[null,null,null,null,null,{"$f":"IFERROR(VLOOKUP(E1275,Insumos!A:C,2,FALSE),\"\")","v":""},null,null,null,0]
[null,null,null,null,null,{"$f":"IFERROR(VLOOKUP(E1276,Insumos!A:C,2,FALSE),\"\")","v":""},null,null,null,0]
[null,null,null,null,null,{"$f":"IFERROR(VLOOKUP(E1277,Insumos!A:C,2,FALSE),\"\")","v":""},null,null,null,0]
[null,null,null,null,null,{"$f":"IFERROR(VLOOKUP(E1278,Insumos!A:C,2,FALSE),\"\")","v":""},null,null,null,0]
[null,null,null,null,null,{"$f":"IFERROR(VLOOKUP(E1279,Insumos!A:C,2,FALSE),\"\")","v":""},null,null,null,0]
[null,null,null,null,null,{"$f":"IFERROR(VLOOKUP(E1280,Insumos!A:C,2,FALSE),\"\")","v":""},null,null,null,0]
[null,null,null,null,null,{"$f":"IFERROR(VLOOKUP(E1281,Insumos!A:C,2,FALSE),\"\")","v":""},null,null,null,0]
[null,null,null,null,null,{"$f":"IFERROR(VLOOKUP(E1282,Insumos!A:C,2,FALSE),\"\")","v":""},null,null,null,0]
[null,null,null,null,null,{"$f":"IFERROR(VLOOKUP(E1283,Insumos!A:C,2,FALSE),\"\")","v":""},null,null,null,0]
[null,null,null,null,null,{"$f":"IFERROR(VLOOKUP(E1284,Insumos!A:C,2,FALSE),\"\")","v":""},null,null,null,0]
[null,null,null,null,null,{"$f":"IFERROR(VLOOKUP(E1285,Insumos!A:C,2,FALSE),\"\")","v":""},null,null,null,{"$f":"IFERROR(H1285*I1285,\"\")","v":0}]
[null,null,null,null,null,{"$f":"IFERROR(VLOOKUP(E1286,Insumos!A:C,2,FALSE),\"\")","v":""},null,null,null,0]
[null,null,null,null,null,{"$f":"IFERROR(VLOOKUP(E1287,Insumos!A:C,2,FALSE),\"\")","v":""},null,null,null,0]
[null,null,null,null,null,{"$f":"IFERROR(VLOOKUP(E1288,Insumos!A:C,2,FALSE),\"\")","v":""},null,null,null,0]
[null,null,null,null,null,{"$f":"IFERROR(VLOOKUP(E1289,Insumos!A:C,2,FALSE),\"\")","v":""},null,null,null,0]
[null,null,null,null,null,{"$f":"IFERROR(VLOOKUP(E1290,Insumos!A:C,2,FALSE),\"\")","v":""},null,null,null,0]
[null,null,null,null,null,{"$f":"IFERROR(VLOOKUP(E1291,Insumos!A:C,2,FALSE),\"\")","v":""},null,null,null,0]
[null,null,null,null,null,{"$f":"IFERROR(VLOOKUP(E1292,Insumos!A:C,2,FALSE),\"\")","v":""},null,null,null,0]
[null,null,null,null,null,{"$f":"IFERROR(VLOOKUP(E1293,Insumos!A:C,2,FALSE),\"\")","v":""},null,null,null,0]
[null,null,null,null,null,{"$f":"IFERROR(VLOOKUP(E1294,Insumos!A:C,2,FALSE),\"\")","v":""},null,null,null,0]
[null,null,null,null,null,{"$f":"IFERROR(VLOOKUP(E1295,Insumos!A:C,2,FALSE),\"\")","v":""},null,null,null,0]
[null,null,null,null,null,{"$f":"IFERROR(VLOOKUP(E1296,Insumos!A:C,2,FALSE),\"\")","v":""},null,null,null,0]
[null,null,null,null,null,{"$f":"IFERROR(VLOOKUP(E1297,Insumos!A:C,2,FALSE),\"\")","v":""},null,null,null,0]
[null,null,null,null,null,{"$f":"IFERROR(VLOOKUP(E1298,Insumos!A:C,2,FALSE),\"\")","v":""},null,null,null,0]
[null,null,null,null,null,{"$f":"IFERROR(VLOOKUP(E1299,Insumos!A:C,2,FALSE),\"\")","v":""},null,null,null,0]
[null,null,null,null,null,{"$f":"IFERROR(VLOOKUP(E1300,Insumos!A:C,2,FALSE),\"\")","v":""},null,null,null,0]
[null,null,null,null,null,{"$f":"IFERROR(VLOOKUP(E1301,Insumos!A:C,2,FALSE),\"\")","v":""},null,null,null,0]
[null,null,null,null,null,{"$f":"IFERROR(VLOOKUP(E1302,Insumos!A:C,2,FALSE),\"\")","v":""},null,null,null,0]
[null,null,null,null,null,{"$f":"IFERROR(VLOOKUP(E1303,Insumos!A:C,2,FALSE),\"\")","v":""},null,null,null,0]
[null,null,null,null,null,{"$f":"IFERROR(VLOOKUP(E1304,Insumos!A:C,2,FALSE),\"\")","v":""},null,null,null,0]
[null,null,null,null,null,{"$f":"IFERROR(VLOOKUP(E1305,Insumos!A:C,2,FALSE),\"\")","v":""},null,null,null,0]
[null,null,null,null,null,{"$f":"IFERROR(VLOOKUP(E1306,Insumos!A:C,2,FALSE),\"\")","v":""},null,null,null,0]
[null,null,null,null,null,{"$f":"IFERROR(VLOOKUP(E1307,Insumos!A:C,2,FALSE),\"\")","v":""},null,null,null,0]
[null,null,null,null,null,{"$f":"IFERROR(VLOOKUP(E1308,Insumos!A:C,2,FALSE),\"\")","v":""},null,null,null,0]
[null,null,null,null,null,{"$f":"IFERROR(VLOOKUP(E1309,Insumos!A:C,2,FALSE),\"\")","v":""},null,null,null,0]
[null,null,null,null,null,{"$f":"IFERROR(VLOOKUP(E1310,Insumos!A:C,2,FALSE),\"\")","v":""},null,null,null,0]
[null,null,null,null,null,{"$f":"IFERROR(VLOOKUP(E1311,Insumos!A:C,2,FALSE),\"\")","v":""},null,null,null,0]
[null,null,null,null,null,{"$f":"IFERROR(VLOOKUP(E1312,Insumos!A:C,2,FALSE),\"\")","v":""},null,null,null,0]
[null,null,null,null,null,{"$f":"IFERROR(VLOOKUP(E1313,Insumos!A:C,2,FALSE),\"\")","v":""},null,null,null,0]
[null,null,null,null,null,{"$f":"IFERROR(VLOOKUP(E1314,Insumos!A:C,2,FALSE),\"\")","v":""},null,null,null,0]
[null,null,null,null,null,{"$f":"IFERROR(VLOOKUP(E1315,Insumos!A:C,2,FALSE),\"\")","v":""},null,null,null,0]
[null,null,null,null,null,{"$f":"IFERROR(VLOOKUP(E1316,Insumos!A:C,2,FALSE),\"\")","v":""},null,null,null,0]
[null,null,null,null,null,{"$f":"IFERROR(VLOOKUP(E1317,Insumos!A:C,2,FALSE),\"\")","v":""},null,null,null,0]
[null,null,null,null,null,{"$f":"IFERROR(VLOOKUP(E1318,Insumos!A:C,2,FALSE),\"\")","v":""},null,null,null,0]
[null,null,null,null,null,{"$f":"IFERROR(VLOOKUP(E1319,Insumos!A:C,2,FALSE),\"\")","v":""},null,null,null,0]
[null,null,null,null,null,{"$f":"IFERROR(VLOOKUP(E1320,Insumos!A:C,2,FALSE),\"\")","v":""},null,null,null,0]
[null,null,null,null,null,{"$f":"IFERROR(VLOOKUP(E1321,Insumos!A:C,2,FALSE),\"\")","v":""},null,null,null,0]
[null,null,null,null,null,{"$f":"IFERROR(VLOOKUP(E1322,Insumos!A:C,2,FALSE),\"\")","v":""},null,null,null,0]
[null,null,null,null,null,{"$f":"IFERROR(VLOOKUP(E1323,Insumos!A:C,2,FALSE),\"\")","v":""},null,null,null,0]
[null,null,null,null,null,{"$f":"IFERROR(VLOOKUP(E1324,Insumos!A:C,2,FALSE),\"\")","v":""},null,null,null,0]
[null,null,null,null,null,{"$f":"IFERROR(VLOOKUP(E1325,Insumos!A:C,2,FALSE),\"\")","v":""},null,null,null,0]
[null,null,null,null,null,{"$f":"IFERROR(VLOOKUP(E1326,Insumos!A:C,2,FALSE),\"\")","v":""},null,null,null,0]
[null,null,null,null,null,{"$f":"IFERROR(VLOOKUP(E1327,Insumos!A:C,2,FALSE),\"\")","v":""},null,null,null,0]
[null,null,null,null,null,{"$f":"IFERROR(VLOOKUP(E1328,Insumos!A:C,2,FALSE),\"\")","v":""},null,null,null,0]
[null,null,null,null,null,{"$f":"IFERROR(VLOOKUP(E1329,Insumos!A:C,2,FALSE),\"\")","v":""},null,null,null,0]
[null,null,null,null,null,{"$f":"IFERROR(VLOOKUP(E1330,Insumos!A:C,2,FALSE),\"\")","v":""},null,null,null,0]
[null,null,null,null,null,{"$f":"IFERROR(VLOOKUP(E1331,Insumos!A:C,2,FALSE),\"\")","v":""},null,null,null,0]
[null,null,null,null,null,{"$f":"IFERROR(VLOOKUP(E1332,Insumos!A:C,2,FALSE),\"\")","v":""},null,null,null,0]
[null,null,null,null,null,{"$f":"IFERROR(VLOOKUP(E1333,Insumos!A:C,2,FALSE),\"\")","v":""},null,null,null,0]
[null,null,null,null,null,{"$f":"IFERROR(VLOOKUP(E1334,Insumos!A:C,2,FALSE),\"\")","v":""},null,null,null,0]
[null,null,null,null,null,{"$f":"IFERROR(VLOOKUP(E1335,Insumos!A:C,2,FALSE),\"\")","v":""},null,null,null,0]
[null,null,null,null,null,{"$f":"IFERROR(VLOOKUP(E1336,Insumos!A:C,2,FALSE),\"\")","v":""},null,null,null,0]
[null,null,null,null,null,{"$f":"IFERROR(VLOOKUP(E1337,Insumos!A:C,2,FALSE),\"\")","v":""},null,null,null,0]
[null,null,null,null,null,{"$f":"IFERROR(VLOOKUP(E1338,Insumos!A:C,2,FALSE),\"\")","v":""},null,null,null,0]
[null,null,null,null,null,{"$f":"IFERROR(VLOOKUP(E1339,Insumos!A:C,2,FALSE),\"\")","v":""},null,null,null,0]
[null,null,null,null,null,{"$f":"IFERROR(VLOOKUP(E1340,Insumos!A:C,2,FALSE),\"\")","v":""},null,null,null,0]
[null,null,null,null,null,{"$f":"IFERROR(VLOOKUP(E1341,Insumos!A:C,2,FALSE),\"\")","v":""},null,null,null,0]
[null,null,null,null,null,{"$f":"IFERROR(VLOOKUP(E1342,Insumos!A:C,2,FALSE),\"\")","v":""},null,null,null,0]
[null,null,null,null,null,{"$f":"IFERROR(VLOOKUP(E1343,Insumos!A:C,2,FALSE),\"\")","v":""},null,null,null,0]
[null,null,null,null,null,{"$f":"IFERROR(VLOOKUP(E1344,Insumos!A:C,2,FALSE),\"\")","v":""},null,null,null,0]
[null,null,null,null,null,{"$f":"IFERROR(VLOOKUP(E1345,Insumos!A:C,2,FALSE),\"\")","v":""},null,null,null,0]
[null,null,null,null,null,{"$f":"IFERROR(VLOOKUP(E1346,Insumos!A:C,2,FALSE),\"\")","v":""},null,null,null,0]
[null,null,null,null,null,{"$f":"IFERROR(VLOOKUP(E1347,Insumos!A:C,2,FALSE),\"\")","v":""},null,null,null,0]
[null,null,null,null,null,{"$f":"IFERROR(VLOOKUP(E1348,Insumos!A:C,2,FALSE),\"\")","v":""},null,null,null,0]
[null,null,null,null,null,{"$f":"IFERROR(VLOOKUP(E1349,Insumos!A:C,2,FALSE),\"\")","v":""},null,null,null,{"$f":"IFERROR(H1349*I1349,\"\")","v":0}]
[null,null,null,null,null,{"$f":"IFERROR(VLOOKUP(E1350,Insumos!A:C,2,FALSE),\"\")","v":""},null,null,null,0]
[null,null,null,null,null,{"$f":"IFERROR(VLOOKUP(E1351,Insumos!A:C,2,FALSE),\"\")","v":""},null,null,null,0]
[null,null,null,null,null,{"$f":"IFERROR(VLOOKUP(E1352,Insumos!A:C,2,FALSE),\"\")","v":""},null,null,null,0]
[null,null,null,null,null,{"$f":"IFERROR(VLOOKUP(E1353,Insumos!A:C,2,FALSE),\"\")","v":""},null,null,null,0]
[null,null,null,null,null,{"$f":"IFERROR(VLOOKUP(E1354,Insumos!A:C,2,FALSE),\"\")","v":""},null,null,null,0]
[null,null,null,null,null,{"$f":"IFERROR(VLOOKUP(E1355,Insumos!A:C,2,FALSE),\"\")","v":""},null,null,null,0]
[null,null,null,null,null,{"$f":"IFERROR(VLOOKUP(E1356,Insumos!A:C,2,FALSE),\"\")","v":""},null,null,null,0]
[null,null,null,null,null,{"$f":"IFERROR(VLOOKUP(E1357,Insumos!A:C,2,FALSE),\"\")","v":""},null,null,null,0]
[null,null,null,null,null,{"$f":"IFERROR(VLOOKUP(E1358,Insumos!A:C,2,FALSE),\"\")","v":""},null,null,null,0]
[null,null,null,null,null,{"$f":"IFERROR(VLOOKUP(E1359,Insumos!A:C,2,FALSE),\"\")","v":""},null,null,null,0]
[null,null,null,null,null,{"$f":"IFERROR(VLOOKUP(E1360,Insumos!A:C,2,FALSE),\"\")","v":""},null,null,null,0]
[null,null,null,null,null,{"$f":"IFERROR(VLOOKUP(E1361,Insumos!A:C,2,FALSE),\"\")","v":""},null,null,null,0]
[null,null,null,null,null,{"$f":"IFERROR(VLOOKUP(E1362,Insumos!A:C,2,FALSE),\"\")","v":""},null,null,null,0]
[null,null,null,null,null,{"$f":"IFERROR(VLOOKUP(E1363,Insumos!A:C,2,FALSE),\"\")","v":""},null,null,null,0]
[null,null,null,null,null,{"$f":"IFERROR(VLOOKUP(E1364,Insumos!A:C,2,FALSE),\"\")","v":""},null,null,null,0]
[null,null,null,null,null,{"$f":"IFERROR(VLOOKUP(E1365,Insumos!A:C,2,FALSE),\"\")","v":""},null,null,null,0]
[null,null,null,null,null,{"$f":"IFERROR(VLOOKUP(E1366,Insumos!A:C,2,FALSE),\"\")","v":""},null,null,null,0]
[null,null,null,null,null,{"$f":"IFERROR(VLOOKUP(E1367,Insumos!A:C,2,FALSE),\"\")","v":""},null,null,null,0]
[null,null,null,null,null,{"$f":"IFERROR(VLOOKUP(E1368,Insumos!A:C,2,FALSE),\"\")","v":""},null,null,null,0]
[null,null,null,null,null,{"$f":"IFERROR(VLOOKUP(E1369,Insumos!A:C,2,FALSE),\"\")","v":""},null,null,null,0]
[null,null,null,null,null,{"$f":"IFERROR(VLOOKUP(E1370,Insumos!A:C,2,FALSE),\"\")","v":""},null,null,null,0]
[null,null,null,null,null,{"$f":"IFERROR(VLOOKUP(E1371,Insumos!A:C,2,FALSE),\"\")","v":""},null,null,null,0]
[null,null,null,null,null,{"$f":"IFERROR(VLOOKUP(E1372,Insumos!A:C,2,FALSE),\"\")","v":""},null,null,null,0]
[null,null,null,null,null,{"$f":"IFERROR(VLOOKUP(E1373,Insumos!A:C,2,FALSE),\"\")","v":""},null,null,null,0]
[null,null,null,null,null,{"$f":"IFERROR(VLOOKUP(E1374,Insumos!A:C,2,FALSE),\"\")","v":""},null,null,null,0]
[null,null,null,null,null,{"$f":"IFERROR(VLOOKUP(E1375,Insumos!A:C,2,FALSE),\"\")","v":""},null,null,null,0]
[null,null,null,null,null,{"$f":"IFERROR(VLOOKUP(E1376,Insumos!A:C,2,FALSE),\"\")","v":""},null,null,null,0]
[null,null,null,null,null,{"$f":"IFERROR(VLOOKUP(E1377,Insumos!A:C,2,FALSE),\"\")","v":""},null,null,null,0]
[null,null,null,null,null,{"$f":"IFERROR(VLOOKUP(E1378,Insumos!A:C,2,FALSE),\"\")","v":""},null,null,null,0]
[null,null,null,null,null,{"$f":"IFERROR(VLOOKUP(E1379,Insumos!A:C,2,FALSE),\"\")","v":""},null,null,null,0]
[null,null,null,null,null,{"$f":"IFERROR(VLOOKUP(E1380,Insumos!A:C,2,FALSE),\"\")","v":""},null,null,null,0]
[null,null,null,null,null,{"$f":"IFERROR(VLOOKUP(E1381,Insumos!A:C,2,FALSE),\"\")","v":""},null,null,null,0]
[null,null,null,null,null,{"$f":"IFERROR(VLOOKUP(E1382,Insumos!A:C,2,FALSE),\"\")","v":""},null,null,null,0]
[null,null,null,null,null,{"$f":"IFERROR(VLOOKUP(E1383,Insumos!A:C,2,FALSE),\"\")","v":""},null,null,null,0]
[null,null,null,null,null,{"$f":"IFERROR(VLOOKUP(E1384,Insumos!A:C,2,FALSE),\"\")","v":""},null,null,null,0]
[null,null,null,null,null,{"$f":"IFERROR(VLOOKUP(E1385,Insumos!A:C,2,FALSE),\"\")","v":""},null,null,null,0]
[null,null,null,null,null,{"$f":"IFERROR(VLOOKUP(E1386,Insumos!A:C,2,FALSE),\"\")","v":""},null,null,null,0]
[null,null,null,null,null,{"$f":"IFERROR(VLOOKUP(E1387,Insumos!A:C,2,FALSE),\"\")","v":""},null,null,null,0]
[null,null,null,null,null,{"$f":"IFERROR(VLOOKUP(E1388,Insumos!A:C,2,FALSE),\"\")","v":""},null,null,null,0]
[null,null,null,null,null,{"$f":"IFERROR(VLOOKUP(E1389,Insumos!A:C,2,FALSE),\"\")","v":""},null,null,null,0]
[null,null,null,null,null,{"$f":"IFERROR(VLOOKUP(E1390,Insumos!A:C,2,FALSE),\"\")","v":""},null,null,null,0]
[null,null,null,null,null,{"$f":"IFERROR(VLOOKUP(E1391,Insumos!A:C,2,FALSE),\"\")","v":""},null,null,null,0]
[null,null,null,null,null,{"$f":"IFERROR(VLOOKUP(E1392,Insumos!A:C,2,FALSE),\"\")","v":""},null,null,null,0]
[null,null,null,null,null,{"$f":"IFERROR(VLOOKUP(E1393,Insumos!A:C,2,FALSE),\"\")","v":""},null,null,null,0]
[null,null,null,null,null,{"$f":"IFERROR(VLOOKUP(E1394,Insumos!A:C,2,FALSE),\"\")","v":""},null,null,null,0]
[null,null,null,null,null,{"$f":"IFERROR(VLOOKUP(E1395,Insumos!A:C,2,FALSE),\"\")","v":""},null,null,null,0]
[null,null,null,null,null,{"$f":"IFERROR(VLOOKUP(E1396,Insumos!A:C,2,FALSE),\"\")","v":""},null,null,null,0]
[null,null,null,null,null,{"$f":"IFERROR(VLOOKUP(E1397,Insumos!A:C,2,FALSE),\"\")","v":""},null,null,null,0]
[null,null,null,null,null,{"$f":"IFERROR(VLOOKUP(E1398,Insumos!A:C,2,FALSE),\"\")","v":""},null,null,null,0]
[null,null,null,null,null,{"$f":"IFERROR(VLOOKUP(E1399,Insumos!A:C,2,FALSE),\"\")","v":""},null,null,null,0]
[null,null,null,null,null,{"$f":"IFERROR(VLOOKUP(E1400,Insumos!A:C,2,FALSE),\"\")","v":""},null,null,null,0]
[null,null,null,null,null,{"$f":"IFERROR(VLOOKUP(E1401,Insumos!A:C,2,FALSE),\"\")","v":""},null,null,null,0]
[null,null,null,null,null,{"$f":"IFERROR(VLOOKUP(E1402,Insumos!A:C,2,FALSE),\"\")","v":""},null,null,null,0]
[null,null,null,null,null,{"$f":"IFERROR(VLOOKUP(E1403,Insumos!A:C,2,FALSE),\"\")","v":""},null,null,null,0]
[null,null,null,null,null,{"$f":"IFERROR(VLOOKUP(E1404,Insumos!A:C,2,FALSE),\"\")","v":""},null,null,null,0]
[null,null,null,null,null,{"$f":"IFERROR(VLOOKUP(E1405,Insumos!A:C,2,FALSE),\"\")","v":""},null,null,null,0]
[null,null,null,null,null,{"$f":"IFERROR(VLOOKUP(E1406,Insumos!A:C,2,FALSE),\"\")","v":""},null,null,null,0]
[null,null,null,null,null,{"$f":"IFERROR(VLOOKUP(E1407,Insumos!A:C,2,FALSE),\"\")","v":""},null,null,null,0]
[null,null,null,null,null,{"$f":"IFERROR(VLOOKUP(E1408,Insumos!A:C,2,FALSE),\"\")","v":""},null,null,null,0]
[null,null,null,null,null,{"$f":"IFERROR(VLOOKUP(E1409,Insumos!A:C,2,FALSE),\"\")","v":""},null,null,null,0]
[null,null,null,null,null,{"$f":"IFERROR(VLOOKUP(E1410,Insumos!A:C,2,FALSE),\"\")","v":""},null,null,null,0]
[null,null,null,null,null,{"$f":"IFERROR(VLOOKUP(E1411,Insumos!A:C,2,FALSE),\"\")","v":""},null,null,null,0]
[null,null,null,null,null,{"$f":"IFERROR(VLOOKUP(E1412,Insumos!A:C,2,FALSE),\"\")","v":""},null,null,null,0]
[null,null,null,null,null,{"$f":"IFERROR(VLOOKUP(E1413,Insumos!A:C,2,FALSE),\"\")","v":""},null,null,null,{"$f":"IFERROR(H1413*I1413,\"\")","v":0}]
[null,null,null,null,null,{"$f":"IFERROR(VLOOKUP(E1414,Insumos!A:C,2,FALSE),\"\")","v":""},null,null,null,0]
[null,null,null,null,null,{"$f":"IFERROR(VLOOKUP(E1415,Insumos!A:C,2,FALSE),\"\")","v":""},null,null,null,0]
[null,null,null,null,null,{"$f":"IFERROR(VLOOKUP(E1416,Insumos!A:C,2,FALSE),\"\")","v":""},null,null,null,0]
[null,null,null,null,null,{"$f":"IFERROR(VLOOKUP(E1417,Insumos!A:C,2,FALSE),\"\")","v":""},null,null,null,0]
[null,null,null,null,null,{"$f":"IFERROR(VLOOKUP(E1418,Insumos!A:C,2,FALSE),\"\")","v":""},null,null,null,0]
[null,null,null,null,null,{"$f":"IFERROR(VLOOKUP(E1419,Insumos!A:C,2,FALSE),\"\")","v":""},null,null,null,0]
[null,null,null,null,null,{"$f":"IFERROR(VLOOKUP(E1420,Insumos!A:C,2,FALSE),\"\")","v":""},null,null,null,0]
[null,null,null,null,null,{"$f":"IFERROR(VLOOKUP(E1421,Insumos!A:C,2,FALSE),\"\")","v":""},null,null,null,0]
[null,null,null,null,null,{"$f":"IFERROR(VLOOKUP(E1422,Insumos!A:C,2,FALSE),\"\")","v":""},null,null,null,0]
[null,null,null,null,null,{"$f":"IFERROR(VLOOKUP(E1423,Insumos!A:C,2,FALSE),\"\")","v":""},null,null,null,0]
[null,null,null,null,null,{"$f":"IFERROR(VLOOKUP(E1424,Insumos!A:C,2,FALSE),\"\")","v":""},null,null,null,0]
[null,null,null,null,null,{"$f":"IFERROR(VLOOKUP(E1425,Insumos!A:C,2,FALSE),\"\")","v":""},null,null,null,0]
[null,null,null,null,null,{"$f":"IFERROR(VLOOKUP(E1426,Insumos!A:C,2,FALSE),\"\")","v":""},null,null,null,0]
[null,null,null,null,null,{"$f":"IFERROR(VLOOKUP(E1427,Insumos!A:C,2,FALSE),\"\")","v":""},null,null,null,0]
[null,null,null,null,null,{"$f":"IFERROR(VLOOKUP(E1428,Insumos!A:C,2,FALSE),\"\")","v":""},null,null,null,0]
[null,null,null,null,null,{"$f":"IFERROR(VLOOKUP(E1429,Insumos!A:C,2,FALSE),\"\")","v":""},null,null,null,0]
[null,null,null,null,null,{"$f":"IFERROR(VLOOKUP(E1430,Insumos!A:C,2,FALSE),\"\")","v":""},null,null,null,0]
[null,null,null,null,null,{"$f":"IFERROR(VLOOKUP(E1431,Insumos!A:C,2,FALSE),\"\")","v":""},null,null,null,0]
[null,null,null,null,null,{"$f":"IFERROR(VLOOKUP(E1432,Insumos!A:C,2,FALSE),\"\")","v":""},null,null,null,0]
[null,null,null,null,null,{"$f":"IFERROR(VLOOKUP(E1433,Insumos!A:C,2,FALSE),\"\")","v":""},null,null,null,0]
[null,null,null,null,null,{"$f":"IFERROR(VLOOKUP(E1434,Insumos!A:C,2,FALSE),\"\")","v":""},null,null,null,0]
[null,null,null,null,null,{"$f":"IFERROR(VLOOKUP(E1435,Insumos!A:C,2,FALSE),\"\")","v":""},null,null,null,0]
[null,null,null,null,null,{"$f":"IFERROR(VLOOKUP(E1436,Insumos!A:C,2,FALSE),\"\")","v":""},null,null,null,0]
[null,null,null,null,null,{"$f":"IFERROR(VLOOKUP(E1437,Insumos!A:C,2,FALSE),\"\")","v":""},null,null,null,0]
[null,null,null,null,null,{"$f":"IFERROR(VLOOKUP(E1438,Insumos!A:C,2,FALSE),\"\")","v":""},null,null,null,0]
[null,null,null,null,null,{"$f":"IFERROR(VLOOKUP(E1439,Insumos!A:C,2,FALSE),\"\")","v":""},null,null,null,0]
[null,null,null,null,null,{"$f":"IFERROR(VLOOKUP(E1440,Insumos!A:C,2,FALSE),\"\")","v":""},null,null,null,0]
[null,null,null,null,null,{"$f":"IFERROR(VLOOKUP(E1441,Insumos!A:C,2,FALSE),\"\")","v":""},null,null,null,0]
[null,null,null,null,null,{"$f":"IFERROR(VLOOKUP(E1442,Insumos!A:C,2,FALSE),\"\")","v":""},null,null,null,0]
[null,null,null,null,null,{"$f":"IFERROR(VLOOKUP(E1443,Insumos!A:C,2,FALSE),\"\")","v":""},null,null,null,0]
[null,null,null,null,null,{"$f":"IFERROR(VLOOKUP(E1444,Insumos!A:C,2,FALSE),\"\")","v":""},null,null,null,0]
[null,null,null,null,null,{"$f":"IFERROR(VLOOKUP(E1445,Insumos!A:C,2,FALSE),\"\")","v":""},null,null,null,0]
[null,null,null,null,null,{"$f":"IFERROR(VLOOKUP(E1446,Insumos!A:C,2,FALSE),\"\")","v":""},null,null,null,0]
[null,null,null,null,null,{"$f":"IFERROR(VLOOKUP(E1447,Insumos!A:C,2,FALSE),\"\")","v":""},null,null,null,0]
[null,null,null,null,null,{"$f":"IFERROR(VLOOKUP(E1448,Insumos!A:C,2,FALSE),\"\")","v":""},null,null,null,0]
[null,null,null,null,null,{"$f":"IFERROR(VLOOKUP(E1449,Insumos!A:C,2,FALSE),\"\")","v":""},null,null,null,0]
[null,null,null,null,null,{"$f":"IFERROR(VLOOKUP(E1450,Insumos!A:C,2,FALSE),\"\")","v":""},null,null,null,0]
[null,null,null,null,null,{"$f":"IFERROR(VLOOKUP(E1451,Insumos!A:C,2,FALSE),\"\")","v":""},null,null,null,0]
[null,null,null,null,null,{"$f":"IFERROR(VLOOKUP(E1452,Insumos!A:C,2,FALSE),\"\")","v":""},null,null,null,0]
[null,null,null,null,null,{"$f":"IFERROR(VLOOKUP(E1453,Insumos!A:C,2,FALSE),\"\")","v":""},null,null,null,0]
[null,null,null,null,null,{"$f":"IFERROR(VLOOKUP(E1454,Insumos!A:C,2,FALSE),\"\")","v":""},null,null,null,0]
[null,null,null,null,null,{"$f":"IFERROR(VLOOKUP(E1455,Insumos!A:C,2,FALSE),\"\")","v":""},null,null,null,0]
[null,null,null,null,null,{"$f":"IFERROR(VLOOKUP(E1456,Insumos!A:C,2,FALSE),\"\")","v":""},null,null,null,0]
[null,null,null,null,null,{"$f":"IFERROR(VLOOKUP(E1457,Insumos!A:C,2,FALSE),\"\")","v":""},null,null,null,0]
[null,null,null,null,null,{"$f":"IFERROR(VLOOKUP(E1458,Insumos!A:C,2,FALSE),\"\")","v":""},null,null,null,0]
[null,null,null,null,null,{"$f":"IFERROR(VLOOKUP(E1459,Insumos!A:C,2,FALSE),\"\")","v":""},null,null,null,0]
[null,null,null,null,null,{"$f":"IFERROR(VLOOKUP(E1460,Insumos!A:C,2,FALSE),\"\")","v":""},null,null,null,0]
[null,null,null,null,null,{"$f":"IFERROR(VLOOKUP(E1461,Insumos!A:C,2,FALSE),\"\")","v":""},null,null,null,0]
[null,null,null,null,null,{"$f":"IFERROR(VLOOKUP(E1462,Insumos!A:C,2,FALSE),\"\")","v":""},null,null,null,0]
[null,null,null,null,null,{"$f":"IFERROR(VLOOKUP(E1463,Insumos!A:C,2,FALSE),\"\")","v":""},null,null,null,0]
[null,null,null,null,null,{"$f":"IFERROR(VLOOKUP(E1464,Insumos!A:C,2,FALSE),\"\")","v":""},null,null,null,0]
[null,null,null,null,null,{"$f":"IFERROR(VLOOKUP(E1465,Insumos!A:C,2,FALSE),\"\")","v":""},null,null,null,0]
[null,null,null,null,null,{"$f":"IFERROR(VLOOKUP(E1466,Insumos!A:C,2,FALSE),\"\")","v":""},null,null,null,0]
[null,null,null,null,null,{"$f":"IFERROR(VLOOKUP(E1467,Insumos!A:C,2,FALSE),\"\")","v":""},null,null,null,0]
[null,null,null,null,null,{"$f":"IFERROR(VLOOKUP(E1468,Insumos!A:C,2,FALSE),\"\")","v":""},null,null,null,0]
[null,null,null,null,null,{"$f":"IFERROR(VLOOKUP(E1469,Insumos!A:C,2,FALSE),\"\")","v":""},null,null,null,0]
[null,null,null,null,null,{"$f":"IFERROR(VLOOKUP(E1470,Insumos!A:C,2,FALSE),\"\")","v":""},null,null,null,0]
[null,null,null,null,null,{"$f":"IFERROR(VLOOKUP(E1471,Insumos!A:C,2,FALSE),\"\")","v":""},null,null,null,0]
[null,null,null,null,null,{"$f":"IFERROR(VLOOKUP(E1472,Insumos!A:C,2,FALSE),\"\")","v":""},null,null,null,0]
[null,null,null,null,null,{"$f":"IFERROR(VLOOKUP(E1473,Insumos!A:C,2,FALSE),\"\")","v":""},null,null,null,0]
[null,null,null,null,null,{"$f":"IFERROR(VLOOKUP(E1474,Insumos!A:C,2,FALSE),\"\")","v":""},null,null,null,0]
[null,null,null,null,null,{"$f":"IFERROR(VLOOKUP(E1475,Insumos!A:C,2,FALSE),\"\")","v":""},null,null,null,0]
[null,null,null,null,null,{"$f":"IFERROR(VLOOKUP(E1476,Insumos!A:C,2,FALSE),\"\")","v":""},null,null,null,0]
[null,null,null,null,null,{"$f":"IFERROR(VLOOKUP(E1477,Insumos!A:C,2,FALSE),\"\")","v":""},null,null,null,{"$f":"IFERROR(H1477*I1477,\"\")","v":0}]
[null,null,null,null,null,{"$f":"IFERROR(VLOOKUP(E1478,Insumos!A:C,2,FALSE),\"\")","v":""},null,null,null,0]
[null,null,null,null,null,{"$f":"IFERROR(VLOOKUP(E1479,Insumos!A:C,2,FALSE),\"\")","v":""},null,null,null,0]
[null,null,null,null,null,{"$f":"IFERROR(VLOOKUP(E1480,Insumos!A:C,2,FALSE),\"\")","v":""},null,null,null,0]
[null,null,null,null,null,{"$f":"IFERROR(VLOOKUP(E1481,Insumos!A:C,2,FALSE),\"\")","v":""},null,null,null,0]
[null,null,null,null,null,{"$f":"IFERROR(VLOOKUP(E1482,Insumos!A:C,2,FALSE),\"\")","v":""},null,null,null,0]
[null,null,null,null,null,{"$f":"IFERROR(VLOOKUP(E1483,Insumos!A:C,2,FALSE),\"\")","v":""},null,null,null,0]
[null,null,null,null,null,{"$f":"IFERROR(VLOOKUP(E1484,Insumos!A:C,2,FALSE),\"\")","v":""},null,null,null,0]
[null,null,null,null,null,{"$f":"IFERROR(VLOOKUP(E1485,Insumos!A:C,2,FALSE),\"\")","v":""},null,null,null,0]
[null,null,null,null,null,{"$f":"IFERROR(VLOOKUP(E1486,Insumos!A:C,2,FALSE),\"\")","v":""},null,null,null,0]
[null,null,null,null,null,{"$f":"IFERROR(VLOOKUP(E1487,Insumos!A:C,2,FALSE),\"\")","v":""},null,null,null,0]
[null,null,null,null,null,{"$f":"IFERROR(VLOOKUP(E1488,Insumos!A:C,2,FALSE),\"\")","v":""},null,null,null,0]
[null,null,null,null,null,{"$f":"IFERROR(VLOOKUP(E1489,Insumos!A:C,2,FALSE),\"\")","v":""},null,null,null,0]
[null,null,null,null,null,{"$f":"IFERROR(VLOOKUP(E1490,Insumos!A:C,2,FALSE),\"\")","v":""},null,null,null,0]
[null,null,null,null,null,{"$f":"IFERROR(VLOOKUP(E1491,Insumos!A:C,2,FALSE),\"\")","v":""},null,null,null,0]
[null,null,null,null,null,{"$f":"IFERROR(VLOOKUP(E1492,Insumos!A:C,2,FALSE),\"\")","v":""},null,null,null,0]
[null,null,null,null,null,{"$f":"IFERROR(VLOOKUP(E1493,Insumos!A:C,2,FALSE),\"\")","v":""},null,null,null,0]
[null,null,null,null,null,{"$f":"IFERROR(VLOOKUP(E1494,Insumos!A:C,2,FALSE),\"\")","v":""},null,null,null,0]
[null,null,null,null,null,{"$f":"IFERROR(VLOOKUP(E1495,Insumos!A:C,2,FALSE),\"\")","v":""},null,null,null,0]
[null,null,null,null,null,{"$f":"IFERROR(VLOOKUP(E1496,Insumos!A:C,2,FALSE),\"\")","v":""},null,null,null,0]
[null,null,null,null,null,{"$f":"IFERROR(VLOOKUP(E1497,Insumos!A:C,2,FALSE),\"\")","v":""},null,null,null,0]
[null,null,null,null,null,{"$f":"IFERROR(VLOOKUP(E1498,Insumos!A:C,2,FALSE),\"\")","v":""},null,null,null,0]
[null,null,null,null,null,{"$f":"IFERROR(VLOOKUP(E1499,Insumos!A:C,2,FALSE),\"\")","v":""},null,null,null,0]
[null,null,null,null,null,{"$f":"IFERROR(VLOOKUP(E1500,Insumos!A:C,2,FALSE),\"\")","v":""},null,null,null,0]
[null,null,null,null,null,{"$f":"IFERROR(VLOOKUP(E1501,Insumos!A:C,2,FALSE),\"\")","v":""},null,null,null,0]
[null,null,null,null,null,{"$f":"IFERROR(VLOOKUP(E1502,Insumos!A:C,2,FALSE),\"\")","v":""},null,null,null,0]
[null,null,null,null,null,{"$f":"IFERROR(VLOOKUP(E1503,Insumos!A:C,2,FALSE),\"\")","v":""},null,null,null,0]
[null,null,null,null,null,{"$f":"IFERROR(VLOOKUP(E1504,Insumos!A:C,2,FALSE),\"\")","v":""},null,null,null,0]
[null,null,null,null,null,{"$f":"IFERROR(VLOOKUP(E1505,Insumos!A:C,2,FALSE),\"\")","v":""},null,null,null,0]
[null,null,null,null,null,{"$f":"IFERROR(VLOOKUP(E1506,Insumos!A:C,2,FALSE),\"\")","v":""},null,null,null,0]
[null,null,null,null,null,{"$f":"IFERROR(VLOOKUP(E1507,Insumos!A:C,2,FALSE),\"\")","v":""},null,null,null,0]
[null,null,null,null,null,{"$f":"IFERROR(VLOOKUP(E1508,Insumos!A:C,2,FALSE),\"\")","v":""},null,null,null,0]
[null,null,null,null,null,{"$f":"IFERROR(VLOOKUP(E1509,Insumos!A:C,2,FALSE),\"\")","v":""},null,null,null,0]
[null,null,null,null,null,{"$f":"IFERROR(VLOOKUP(E1510,Insumos!A:C,2,FALSE),\"\")","v":""},null,null,null,0]
[null,null,null,null,null,{"$f":"IFERROR(VLOOKUP(E1511,Insumos!A:C,2,FALSE),\"\")","v":""},null,null,null,0]
[null,null,null,null,null,{"$f":"IFERROR(VLOOKUP(E1512,Insumos!A:C,2,FALSE),\"\")","v":""},null,null,null,0]
[null,null,null,null,null,{"$f":"IFERROR(VLOOKUP(E1513,Insumos!A:C,2,FALSE),\"\")","v":""},null,null,null,0]
[null,null,null,null,null,{"$f":"IFERROR(VLOOKUP(E1514,Insumos!A:C,2,FALSE),\"\")","v":""},null,null,null,0]
[null,null,null,null,null,{"$f":"IFERROR(VLOOKUP(E1515,Insumos!A:C,2,FALSE),\"\")","v":""},null,null,null,0]
[null,null,null,null,null,{"$f":"IFERROR(VLOOKUP(E1516,Insumos!A:C,2,FALSE),\"\")","v":""},null,null,null,0]
[null,null,null,null,null,{"$f":"IFERROR(VLOOKUP(E1517,Insumos!A:C,2,FALSE),\"\")","v":""},null,null,null,0]
[null,null,null,null,null,{"$f":"IFERROR(VLOOKUP(E1518,Insumos!A:C,2,FALSE),\"\")","v":""},null,null,null,0]
[null,null,null,null,null,{"$f":"IFERROR(VLOOKUP(E1519,Insumos!A:C,2,FALSE),\"\")","v":""},null,null,null,0]
[null,null,null,null,null,{"$f":"IFERROR(VLOOKUP(E1520,Insumos!A:C,2,FALSE),\"\")","v":""},null,null,null,0]
[null,null,null,null,null,{"$f":"IFERROR(VLOOKUP(E1521,Insumos!A:C,2,FALSE),\"\")","v":""},null,null,null,0]
[null,null,null,null,null,{"$f":"IFERROR(VLOOKUP(E1522,Insumos!A:C,2,FALSE),\"\")","v":""},null,null,null,0]
[null,null,null,null,null,{"$f":"IFERROR(VLOOKUP(E1523,Insumos!A:C,2,FALSE),\"\")","v":""},null,null,null,0]
[null,null,null,null,null,{"$f":"IFERROR(VLOOKUP(E1524,Insumos!A:C,2,FALSE),\"\")","v":""},null,null,null,0]
[null,null,null,null,null,{"$f":"IFERROR(VLOOKUP(E1525,Insumos!A:C,2,FALSE),\"\")","v":""},null,null,null,0]
[null,null,null,null,null,{"$f":"IFERROR(VLOOKUP(E1526,Insumos!A:C,2,FALSE),\"\")","v":""},null,null,null,0]
[null,null,null,null,null,{"$f":"IFERROR(VLOOKUP(E1527,Insumos!A:C,2,FALSE),\"\")","v":""},null,null,null,0]
[null,null,null,null,null,{"$f":"IFERROR(VLOOKUP(E1528,Insumos!A:C,2,FALSE),\"\")","v":""},null,null,null,0]
[null,null,null,null,null,{"$f":"IFERROR(VLOOKUP(E1529,Insumos!A:C,2,FALSE),\"\")","v":""},null,null,null,0]
[null,null,null,null,null,{"$f":"IFERROR(VLOOKUP(E1530,Insumos!A:C,2,FALSE),\"\")","v":""},null,null,null,0]
[null,null,null,null,null,{"$f":"IFERROR(VLOOKUP(E1531,Insumos!A:C,2,FALSE),\"\")","v":""},null,null,null,0]
[null,null,null,null,null,{"$f":"IFERROR(VLOOKUP(E1532,Insumos!A:C,2,FALSE),\"\")","v":""},null,null,null,0]
[null,null,null,null,null,{"$f":"IFERROR(VLOOKUP(E1533,Insumos!A:C,2,FALSE),\"\")","v":""},null,null,null,0]
[null,null,null,null,null,{"$f":"IFERROR(VLOOKUP(E1534,Insumos!A:C,2,FALSE),\"\")","v":""},null,null,null,0]
[null,null,null,null,null,{"$f":"IFERROR(VLOOKUP(E1535,Insumos!A:C,2,FALSE),\"\")","v":""},null,null,null,0]
[null,null,null,null,null,{"$f":"IFERROR(VLOOKUP(E1536,Insumos!A:C,2,FALSE),\"\")","v":""},null,null,null,0]
[null,null,null,null,null,{"$f":"IFERROR(VLOOKUP(E1537,Insumos!A:C,2,FALSE),\"\")","v":""},null,null,null,0]
[null,null,null,null,null,{"$f":"IFERROR(VLOOKUP(E1538,Insumos!A:C,2,FALSE),\"\")","v":""},null,null,null,0]
[null,null,null,null,null,{"$f":"IFERROR(VLOOKUP(E1539,Insumos!A:C,2,FALSE),\"\")","v":""},null,null,null,0]
[null,null,null,null,null,{"$f":"IFERROR(VLOOKUP(E1540,Insumos!A:C,2,FALSE),\"\")","v":""},null,null,null,0]
[null,null,null,null,null,{"$f":"IFERROR(VLOOKUP(E1541,Insumos!A:C,2,FALSE),\"\")","v":""},null,null,null,{"$f":"IFERROR(H1541*I1541,\"\")","v":0}]
[null,null,null,null,null,{"$f":"IFERROR(VLOOKUP(E1542,Insumos!A:C,2,FALSE),\"\")","v":""},null,null,null,0]
[null,null,null,null,null,{"$f":"IFERROR(VLOOKUP(E1543,Insumos!A:C,2,FALSE),\"\")","v":""},null,null,null,0]
[null,null,null,null,null,{"$f":"IFERROR(VLOOKUP(E1544,Insumos!A:C,2,FALSE),\"\")","v":""},null,null,null,0]
[null,null,null,null,null,{"$f":"IFERROR(VLOOKUP(E1545,Insumos!A:C,2,FALSE),\"\")","v":""},null,null,null,0]
[null,null,null,null,null,{"$f":"IFERROR(VLOOKUP(E1546,Insumos!A:C,2,FALSE),\"\")","v":""},null,null,null,0]
[null,null,null,null,null,{"$f":"IFERROR(VLOOKUP(E1547,Insumos!A:C,2,FALSE),\"\")","v":""},null,null,null,0]
[null,null,null,null,null,{"$f":"IFERROR(VLOOKUP(E1548,Insumos!A:C,2,FALSE),\"\")","v":""},null,null,null,0]
[null,null,null,null,null,{"$f":"IFERROR(VLOOKUP(E1549,Insumos!A:C,2,FALSE),\"\")","v":""},null,null,null,0]
[null,null,null,null,null,{"$f":"IFERROR(VLOOKUP(E1550,Insumos!A:C,2,FALSE),\"\")","v":""},null,null,null,0]
[null,null,null,null,null,{"$f":"IFERROR(VLOOKUP(E1551,Insumos!A:C,2,FALSE),\"\")","v":""},null,null,null,0]
[null,null,null,null,null,{"$f":"IFERROR(VLOOKUP(E1552,Insumos!A:C,2,FALSE),\"\")","v":""},null,null,null,0]
[null,null,null,null,null,{"$f":"IFERROR(VLOOKUP(E1553,Insumos!A:C,2,FALSE),\"\")","v":""},null,null,null,0]
[null,null,null,null,null,{"$f":"IFERROR(VLOOKUP(E1554,Insumos!A:C,2,FALSE),\"\")","v":""},null,null,null,0]
[null,null,null,null,null,{"$f":"IFERROR(VLOOKUP(E1555,Insumos!A:C,2,FALSE),\"\")","v":""},null,null,null,0]
[null,null,null,null,null,{"$f":"IFERROR(VLOOKUP(E1556,Insumos!A:C,2,FALSE),\"\")","v":""},null,null,null,0]
[null,null,null,null,null,{"$f":"IFERROR(VLOOKUP(E1557,Insumos!A:C,2,FALSE),\"\")","v":""},null,null,null,0]
[null,null,null,null,null,{"$f":"IFERROR(VLOOKUP(E1558,Insumos!A:C,2,FALSE),\"\")","v":""},null,null,null,0]
[null,null,null,null,null,{"$f":"IFERROR(VLOOKUP(E1559,Insumos!A:C,2,FALSE),\"\")","v":""},null,null,null,0]
[null,null,null,null,null,{"$f":"IFERROR(VLOOKUP(E1560,Insumos!A:C,2,FALSE),\"\")","v":""},null,null,null,0]
[null,null,null,null,null,{"$f":"IFERROR(VLOOKUP(E1561,Insumos!A:C,2,FALSE),\"\")","v":""},null,null,null,0]
[null,null,null,null,null,{"$f":"IFERROR(VLOOKUP(E1562,Insumos!A:C,2,FALSE),\"\")","v":""},null,null,null,0]
[null,null,null,null,null,{"$f":"IFERROR(VLOOKUP(E1563,Insumos!A:C,2,FALSE),\"\")","v":""},null,null,null,0]
[null,null,null,null,null,{"$f":"IFERROR(VLOOKUP(E1564,Insumos!A:C,2,FALSE),\"\")","v":""},null,null,null,0]
[null,null,null,null,null,{"$f":"IFERROR(VLOOKUP(E1565,Insumos!A:C,2,FALSE),\"\")","v":""},null,null,null,0]
[null,null,null,null,null,{"$f":"IFERROR(VLOOKUP(E1566,Insumos!A:C,2,FALSE),\"\")","v":""},null,null,null,0]
[null,null,null,null,null,{"$f":"IFERROR(VLOOKUP(E1567,Insumos!A:C,2,FALSE),\"\")","v":""},null,null,null,0]
[null,null,null,null,null,{"$f":"IFERROR(VLOOKUP(E1568,Insumos!A:C,2,FALSE),\"\")","v":""},null,null,null,0]
[null,null,null,null,null,{"$f":"IFERROR(VLOOKUP(E1569,Insumos!A:C,2,FALSE),\"\")","v":""},null,null,null,0]
[null,null,null,null,null,{"$f":"IFERROR(VLOOKUP(E1570,Insumos!A:C,2,FALSE),\"\")","v":""},null,null,null,0]
[null,null,null,null,null,{"$f":"IFERROR(VLOOKUP(E1571,Insumos!A:C,2,FALSE),\"\")","v":""},null,null,null,0]
[null,null,null,null,null,{"$f":"IFERROR(VLOOKUP(E1572,Insumos!A:C,2,FALSE),\"\")","v":""},null,null,null,0]
[null,null,null,null,null,{"$f":"IFERROR(VLOOKUP(E1573,Insumos!A:C,2,FALSE),\"\")","v":""},null,null,null,0]
[null,null,null,null,null,{"$f":"IFERROR(VLOOKUP(E1574,Insumos!A:C,2,FALSE),\"\")","v":""},null,null,null,0]
[null,null,null,null,null,{"$f":"IFERROR(VLOOKUP(E1575,Insumos!A:C,2,FALSE),\"\")","v":""},null,null,null,0]
[null,null,null,null,null,{"$f":"IFERROR(VLOOKUP(E1576,Insumos!A:C,2,FALSE),\"\")","v":""},null,null,null,0]
[null,null,null,null,null,{"$f":"IFERROR(VLOOKUP(E1577,Insumos!A:C,2,FALSE),\"\")","v":""},null,null,null,0]
[null,null,null,null,null,{"$f":"IFERROR(VLOOKUP(E1578,Insumos!A:C,2,FALSE),\"\")","v":""},null,null,null,0]
[null,null,null,null,null,{"$f":"IFERROR(VLOOKUP(E1579,Insumos!A:C,2,FALSE),\"\")","v":""},null,null,null,0]
[null,null,null,null,null,{"$f":"IFERROR(VLOOKUP(E1580,Insumos!A:C,2,FALSE),\"\")","v":""},null,null,null,0]
[null,null,null,null,null,{"$f":"IFERROR(VLOOKUP(E1581,Insumos!A:C,2,FALSE),\"\")","v":""},null,null,null,0]
[null,null,null,null,null,{"$f":"IFERROR(VLOOKUP(E1582,Insumos!A:C,2,FALSE),\"\")","v":""},null,null,null,0]
[null,null,null,null,null,{"$f":"IFERROR(VLOOKUP(E1583,Insumos!A:C,2,FALSE),\"\")","v":""},null,null,null,0]
[null,null,null,null,null,{"$f":"IFERROR(VLOOKUP(E1584,Insumos!A:C,2,FALSE),\"\")","v":""},null,null,null,0]
[null,null,null,null,null,{"$f":"IFERROR(VLOOKUP(E1585,Insumos!A:C,2,FALSE),\"\")","v":""},null,null,null,0]
[null,null,null,null,null,{"$f":"IFERROR(VLOOKUP(E1586,Insumos!A:C,2,FALSE),\"\")","v":""},null,null,null,0]
[null,null,null,null,null,{"$f":"IFERROR(VLOOKUP(E1587,Insumos!A:C,2,FALSE),\"\")","v":""},null,null,null,0]
[null,null,null,null,null,{"$f":"IFERROR(VLOOKUP(E1588,Insumos!A:C,2,FALSE),\"\")","v":""},null,null,null,0]
[null,null,null,null,null,{"$f":"IFERROR(VLOOKUP(E1589,Insumos!A:C,2,FALSE),\"\")","v":""},null,null,null,0]
[null,null,null,null,null,{"$f":"IFERROR(VLOOKUP(E1590,Insumos!A:C,2,FALSE),\"\")","v":""},null,null,null,0]
[null,null,null,null,null,{"$f":"IFERROR(VLOOKUP(E1591,Insumos!A:C,2,FALSE),\"\")","v":""},null,null,null,0]
[null,null,null,null,null,{"$f":"IFERROR(VLOOKUP(E1592,Insumos!A:C,2,FALSE),\"\")","v":""},null,null,null,0]
[null,null,null,null,null,{"$f":"IFERROR(VLOOKUP(E1593,Insumos!A:C,2,FALSE),\"\")","v":""},null,null,null,0]
[null,null,null,null,null,{"$f":"IFERROR(VLOOKUP(E1594,Insumos!A:C,2,FALSE),\"\")","v":""},null,null,null,0]
[null,null,null,null,null,{"$f":"IFERROR(VLOOKUP(E1595,Insumos!A:C,2,FALSE),\"\")","v":""},null,null,null,0]
[null,null,null,null,null,{"$f":"IFERROR(VLOOKUP(E1596,Insumos!A:C,2,FALSE),\"\")","v":""},null,null,null,0]
[null,null,null,null,null,{"$f":"IFERROR(VLOOKUP(E1597,Insumos!A:C,2,FALSE),\"\")","v":""},null,null,null,0]
[null,null,null,null,null,{"$f":"IFERROR(VLOOKUP(E1598,Insumos!A:C,2,FALSE),\"\")","v":""},null,null,null,0]
[null,null,null,null,null,{"$f":"IFERROR(VLOOKUP(E1599,Insumos!A:C,2,FALSE),\"\")","v":""},null,null,null,0]
[null,null,null,null,null,{"$f":"IFERROR(VLOOKUP(E1600,Insumos!A:C,2,FALSE),\"\")","v":""},null,null,null,0]
[null,null,null,null,null,{"$f":"IFERROR(VLOOKUP(E1601,Insumos!A:C,2,FALSE),\"\")","v":""},null,null,null,0]
[null,null,null,null,null,{"$f":"IFERROR(VLOOKUP(E1602,Insumos!A:C,2,FALSE),\"\")","v":""},null,null,null,0]
[null,null,null,null,null,{"$f":"IFERROR(VLOOKUP(E1603,Insumos!A:C,2,FALSE),\"\")","v":""},null,null,null,0]
[null,null,null,null,null,{"$f":"IFERROR(VLOOKUP(E1604,Insumos!A:C,2,FALSE),\"\")","v":""},null,null,null,0]
[null,null,null,null,null,{"$f":"IFERROR(VLOOKUP(E1605,Insumos!A:C,2,FALSE),\"\")","v":""},null,null,null,{"$f":"IFERROR(H1605*I1605,\"\")","v":0}]
[null,null,null,null,null,{"$f":"IFERROR(VLOOKUP(E1606,Insumos!A:C,2,FALSE),\"\")","v":""},null,null,null,0]
[null,null,null,null,null,{"$f":"IFERROR(VLOOKUP(E1607,Insumos!A:C,2,FALSE),\"\")","v":""},null,null,null,0]
[null,null,null,null,null,{"$f":"IFERROR(VLOOKUP(E1608,Insumos!A:C,2,FALSE),\"\")","v":""},null,null,null,0]
[null,null,null,null,null,{"$f":"IFERROR(VLOOKUP(E1609,Insumos!A:C,2,FALSE),\"\")","v":""},null,null,null,0]
[null,null,null,null,null,{"$f":"IFERROR(VLOOKUP(E1610,Insumos!A:C,2,FALSE),\"\")","v":""},null,null,null,0]
[null,null,null,null,null,{"$f":"IFERROR(VLOOKUP(E1611,Insumos!A:C,2,FALSE),\"\")","v":""},null,null,null,0]
[null,null,null,null,null,{"$f":"IFERROR(VLOOKUP(E1612,Insumos!A:C,2,FALSE),\"\")","v":""},null,null,null,0]
[null,null,null,null,null,{"$f":"IFERROR(VLOOKUP(E1613,Insumos!A:C,2,FALSE),\"\")","v":""},null,null,null,0]
[null,null,null,null,null,{"$f":"IFERROR(VLOOKUP(E1614,Insumos!A:C,2,FALSE),\"\")","v":""},null,null,null,0]
[null,null,null,null,null,{"$f":"IFERROR(VLOOKUP(E1615,Insumos!A:C,2,FALSE),\"\")","v":""},null,null,null,0]
[null,null,null,null,null,{"$f":"IFERROR(VLOOKUP(E1616,Insumos!A:C,2,FALSE),\"\")","v":""},null,null,null,0]
[null,null,null,null,null,{"$f":"IFERROR(VLOOKUP(E1617,Insumos!A:C,2,FALSE),\"\")","v":""},null,null,null,0]
[null,null,null,null,null,{"$f":"IFERROR(VLOOKUP(E1618,Insumos!A:C,2,FALSE),\"\")","v":""},null,null,null,0]
[null,null,null,null,null,{"$f":"IFERROR(VLOOKUP(E1619,Insumos!A:C,2,FALSE),\"\")","v":""},null,null,null,0]
[null,null,null,null,null,{"$f":"IFERROR(VLOOKUP(E1620,Insumos!A:C,2,FALSE),\"\")","v":""},null,null,null,0]
[null,null,null,null,null,{"$f":"IFERROR(VLOOKUP(E1621,Insumos!A:C,2,FALSE),\"\")","v":""},null,null,null,0]
[null,null,null,null,null,{"$f":"IFERROR(VLOOKUP(E1622,Insumos!A:C,2,FALSE),\"\")","v":""},null,null,null,0]
[null,null,null,null,null,{"$f":"IFERROR(VLOOKUP(E1623,Insumos!A:C,2,FALSE),\"\")","v":""},null,null,null,0]
[null,null,null,null,null,{"$f":"IFERROR(VLOOKUP(E1624,Insumos!A:C,2,FALSE),\"\")","v":""},null,null,null,0]
[null,null,null,null,null,{"$f":"IFERROR(VLOOKUP(E1625,Insumos!A:C,2,FALSE),\"\")","v":""},null,null,null,0]
[null,null,null,null,null,{"$f":"IFERROR(VLOOKUP(E1626,Insumos!A:C,2,FALSE),\"\")","v":""},null,null,null,0]
[null,null,null,null,null,{"$f":"IFERROR(VLOOKUP(E1627,Insumos!A:C,2,FALSE),\"\")","v":""},null,null,null,0]
[null,null,null,null,null,{"$f":"IFERROR(VLOOKUP(E1628,Insumos!A:C,2,FALSE),\"\")","v":""},null,null,null,0]
[null,null,null,null,null,{"$f":"IFERROR(VLOOKUP(E1629,Insumos!A:C,2,FALSE),\"\")","v":""},null,null,null,0]
[null,null,null,null,null,{"$f":"IFERROR(VLOOKUP(E1630,Insumos!A:C,2,FALSE),\"\")","v":""},null,null,null,0]
[null,null,null,null,null,{"$f":"IFERROR(VLOOKUP(E1631,Insumos!A:C,2,FALSE),\"\")","v":""},null,null,null,0]
[null,null,null,null,null,{"$f":"IFERROR(VLOOKUP(E1632,Insumos!A:C,2,FALSE),\"\")","v":""},null,null,null,0]
[null,null,null,null,null,{"$f":"IFERROR(VLOOKUP(E1633,Insumos!A:C,2,FALSE),\"\")","v":""},null,null,null,0]
[null,null,null,null,null,{"$f":"IFERROR(VLOOKUP(E1634,Insumos!A:C,2,FALSE),\"\")","v":""},null,null,null,0]
[null,null,null,null,null,{"$f":"IFERROR(VLOOKUP(E1635,Insumos!A:C,2,FALSE),\"\")","v":""},null,null,null,0]
[null,null,null,null,null,{"$f":"IFERROR(VLOOKUP(E1636,Insumos!A:C,2,FALSE),\"\")","v":""},null,null,null,0]
[null,null,null,null,null,{"$f":"IFERROR(VLOOKUP(E1637,Insumos!A:C,2,FALSE),\"\")","v":""},null,null,null,0]
[null,null,null,null,null,{"$f":"IFERROR(VLOOKUP(E1638,Insumos!A:C,2,FALSE),\"\")","v":""},null,null,null,0]
[null,null,null,null,null,{"$f":"IFERROR(VLOOKUP(E1639,Insumos!A:C,2,FALSE),\"\")","v":""},null,null,null,0]
[null,null,null,null,null,{"$f":"IFERROR(VLOOKUP(E1640,Insumos!A:C,2,FALSE),\"\")","v":""},null,null,null,0]
[null,null,null,null,null,{"$f":"IFERROR(VLOOKUP(E1641,Insumos!A:C,2,FALSE),\"\")","v":""},null,null,null,0]
[null,null,null,null,null,{"$f":"IFERROR(VLOOKUP(E1642,Insumos!A:C,2,FALSE),\"\")","v":""},null,null,null,0]
[null,null,null,null,null,{"$f":"IFERROR(VLOOKUP(E1643,Insumos!A:C,2,FALSE),\"\")","v":""},null,null,null,0]
[null,null,null,null,null,{"$f":"IFERROR(VLOOKUP(E1644,Insumos!A:C,2,FALSE),\"\")","v":""},null,null,null,0]
[null,null,null,null,null,{"$f":"IFERROR(VLOOKUP(E1645,Insumos!A:C,2,FALSE),\"\")","v":""},null,null,null,0]
[null,null,null,null,null,{"$f":"IFERROR(VLOOKUP(E1646,Insumos!A:C,2,FALSE),\"\")","v":""},null,null,null,0]
[null,null,null,null,null,{"$f":"IFERROR(VLOOKUP(E1647,Insumos!A:C,2,FALSE),\"\")","v":""},null,null,null,0]
[null,null,null,null,null,{"$f":"IFERROR(VLOOKUP(E1648,Insumos!A:C,2,FALSE),\"\")","v":""},null,null,null,0]
[null,null,null,null,null,{"$f":"IFERROR(VLOOKUP(E1649,Insumos!A:C,2,FALSE),\"\")","v":""},null,null,null,0]
[null,null,null,null,null,{"$f":"IFERROR(VLOOKUP(E1650,Insumos!A:C,2,FALSE),\"\")","v":""},null,null,null,0]
[null,null,null,null,null,{"$f":"IFERROR(VLOOKUP(E1651,Insumos!A:C,2,FALSE),\"\")","v":""},null,null,null,0]
[null,null,null,null,null,{"$f":"IFERROR(VLOOKUP(E1652,Insumos!A:C,2,FALSE),\"\")","v":""},null,null,null,0]
[null,null,null,null,null,{"$f":"IFERROR(VLOOKUP(E1653,Insumos!A:C,2,FALSE),\"\")","v":""},null,null,null,0]
[null,null,null,null,null,{"$f":"IFERROR(VLOOKUP(E1654,Insumos!A:C,2,FALSE),\"\")","v":""},null,null,null,0]
[null,null,null,null,null,{"$f":"IFERROR(VLOOKUP(E1655,Insumos!A:C,2,FALSE),\"\")","v":""},null,null,null,0]
[null,null,null,null,null,{"$f":"IFERROR(VLOOKUP(E1656,Insumos!A:C,2,FALSE),\"\")","v":""},null,null,null,0]
[null,null,null,null,null,{"$f":"IFERROR(VLOOKUP(E1657,Insumos!A:C,2,FALSE),\"\")","v":""},null,null,null,0]
[null,null,null,null,null,{"$f":"IFERROR(VLOOKUP(E1658,Insumos!A:C,2,FALSE),\"\")","v":""},null,null,null,0]
[null,null,null,null,null,{"$f":"IFERROR(VLOOKUP(E1659,Insumos!A:C,2,FALSE),\"\")","v":""},null,null,null,0]
[null,null,null,null,null,{"$f":"IFERROR(VLOOKUP(E1660,Insumos!A:C,2,FALSE),\"\")","v":""},null,null,null,0]
[null,null,null,null,null,{"$f":"IFERROR(VLOOKUP(E1661,Insumos!A:C,2,FALSE),\"\")","v":""},null,null,null,0]
[null,null,null,null,null,{"$f":"IFERROR(VLOOKUP(E1662,Insumos!A:C,2,FALSE),\"\")","v":""},null,null,null,0]
[null,null,null,null,null,{"$f":"IFERROR(VLOOKUP(E1663,Insumos!A:C,2,FALSE),\"\")","v":""},null,null,null,0]
[null,null,null,null,null,{"$f":"IFERROR(VLOOKUP(E1664,Insumos!A:C,2,FALSE),\"\")","v":""},null,null,null,0]
[null,null,null,null,null,{"$f":"IFERROR(VLOOKUP(E1665,Insumos!A:C,2,FALSE),\"\")","v":""},null,null,null,0]
[null,null,null,null,null,{"$f":"IFERROR(VLOOKUP(E1666,Insumos!A:C,2,FALSE),\"\")","v":""},null,null,null,0]
[null,null,null,null,null,{"$f":"IFERROR(VLOOKUP(E1667,Insumos!A:C,2,FALSE),\"\")","v":""},null,null,null,0]
[null,null,null,null,null,{"$f":"IFERROR(VLOOKUP(E1668,Insumos!A:C,2,FALSE),\"\")","v":""},null,null,null,0]
[null,null,null,null,null,{"$f":"IFERROR(VLOOKUP(E1669,Insumos!A:C,2,FALSE),\"\")","v":""},null,null,null,{"$f":"IFERROR(H1669*I1669,\"\")","v":0}]
[null,null,null,null,null,{"$f":"IFERROR(VLOOKUP(E1670,Insumos!A:C,2,FALSE),\"\")","v":""},null,null,null,0]
[null,null,null,null,null,{"$f":"IFERROR(VLOOKUP(E1671,Insumos!A:C,2,FALSE),\"\")","v":""},null,null,null,0]
[null,null,null,null,null,{"$f":"IFERROR(VLOOKUP(E1672,Insumos!A:C,2,FALSE),\"\")","v":""},null,null,null,0]
[null,null,null,null,null,{"$f":"IFERROR(VLOOKUP(E1673,Insumos!A:C,2,FALSE),\"\")","v":""},null,null,null,0]
[null,null,null,null,null,{"$f":"IFERROR(VLOOKUP(E1674,Insumos!A:C,2,FALSE),\"\")","v":""},null,null,null,0]
[null,null,null,null,null,{"$f":"IFERROR(VLOOKUP(E1675,Insumos!A:C,2,FALSE),\"\")","v":""},null,null,null,0]
[null,null,null,null,null,{"$f":"IFERROR(VLOOKUP(E1676,Insumos!A:C,2,FALSE),\"\")","v":""},null,null,null,0]
[null,null,null,null,null,{"$f":"IFERROR(VLOOKUP(E1677,Insumos!A:C,2,FALSE),\"\")","v":""},null,null,null,0]
[null,null,null,null,null,{"$f":"IFERROR(VLOOKUP(E1678,Insumos!A:C,2,FALSE),\"\")","v":""},null,null,null,0]
[null,null,null,null,null,{"$f":"IFERROR(VLOOKUP(E1679,Insumos!A:C,2,FALSE),\"\")","v":""},null,null,null,0]
[null,null,null,null,null,{"$f":"IFERROR(VLOOKUP(E1680,Insumos!A:C,2,FALSE),\"\")","v":""},null,null,null,0]
[null,null,null,null,null,{"$f":"IFERROR(VLOOKUP(E1681,Insumos!A:C,2,FALSE),\"\")","v":""},null,null,null,0]
[null,null,null,null,null,{"$f":"IFERROR(VLOOKUP(E1682,Insumos!A:C,2,FALSE),\"\")","v":""},null,null,null,0]
[null,null,null,null,null,{"$f":"IFERROR(VLOOKUP(E1683,Insumos!A:C,2,FALSE),\"\")","v":""},null,null,null,0]
[null,null,null,null,null,{"$f":"IFERROR(VLOOKUP(E1684,Insumos!A:C,2,FALSE),\"\")","v":""},null,null,null,0]
[null,null,null,null,null,{"$f":"IFERROR(VLOOKUP(E1685,Insumos!A:C,2,FALSE),\"\")","v":""},null,null,null,0]
[null,null,null,null,null,{"$f":"IFERROR(VLOOKUP(E1686,Insumos!A:C,2,FALSE),\"\")","v":""},null,null,null,0]
[null,null,null,null,null,{"$f":"IFERROR(VLOOKUP(E1687,Insumos!A:C,2,FALSE),\"\")","v":""},null,null,null,0]
[null,null,null,null,null,{"$f":"IFERROR(VLOOKUP(E1688,Insumos!A:C,2,FALSE),\"\")","v":""},null,null,null,0]
[null,null,null,null,null,{"$f":"IFERROR(VLOOKUP(E1689,Insumos!A:C,2,FALSE),\"\")","v":""},null,null,null,0]
[null,null,null,null,null,{"$f":"IFERROR(VLOOKUP(E1690,Insumos!A:C,2,FALSE),\"\")","v":""},null,null,null,0]
[null,null,null,null,null,{"$f":"IFERROR(VLOOKUP(E1691,Insumos!A:C,2,FALSE),\"\")","v":""},null,null,null,0]
[null,null,null,null,null,{"$f":"IFERROR(VLOOKUP(E1692,Insumos!A:C,2,FALSE),\"\")","v":""},null,null,null,0]
[null,null,null,null,null,{"$f":"IFERROR(VLOOKUP(E1693,Insumos!A:C,2,FALSE),\"\")","v":""},null,null,null,0]
[null,null,null,null,null,{"$f":"IFERROR(VLOOKUP(E1694,Insumos!A:C,2,FALSE),\"\")","v":""},null,null,null,0]
[null,null,null,null,null,{"$f":"IFERROR(VLOOKUP(E1695,Insumos!A:C,2,FALSE),\"\")","v":""},null,null,null,0]
[null,null,null,null,null,{"$f":"IFERROR(VLOOKUP(E1696,Insumos!A:C,2,FALSE),\"\")","v":""},null,null,null,0]
[null,null,null,null,null,{"$f":"IFERROR(VLOOKUP(E1697,Insumos!A:C,2,FALSE),\"\")","v":""},null,null,null,0]
[null,null,null,null,null,{"$f":"IFERROR(VLOOKUP(E1698,Insumos!A:C,2,FALSE),\"\")","v":""},null,null,null,0]
[null,null,null,null,null,{"$f":"IFERROR(VLOOKUP(E1699,Insumos!A:C,2,FALSE),\"\")","v":""},null,null,null,0]
[null,null,null,null,null,{"$f":"IFERROR(VLOOKUP(E1700,Insumos!A:C,2,FALSE),\"\")","v":""},null,null,null,0]
[null,null,null,null,null,{"$f":"IFERROR(VLOOKUP(E1701,Insumos!A:C,2,FALSE),\"\")","v":""},null,null,null,0]
[null,null,null,null,null,{"$f":"IFERROR(VLOOKUP(E1702,Insumos!A:C,2,FALSE),\"\")","v":""},null,null,null,0]
[null,null,null,null,null,{"$f":"IFERROR(VLOOKUP(E1703,Insumos!A:C,2,FALSE),\"\")","v":""},null,null,null,0]
[null,null,null,null,null,{"$f":"IFERROR(VLOOKUP(E1704,Insumos!A:C,2,FALSE),\"\")","v":""},null,null,null,0]
[null,null,null,null,null,{"$f":"IFERROR(VLOOKUP(E1705,Insumos!A:C,2,FALSE),\"\")","v":""},null,null,null,0]
[null,null,null,null,null,{"$f":"IFERROR(VLOOKUP(E1706,Insumos!A:C,2,FALSE),\"\")","v":""},null,null,null,0]
[null,null,null,null,null,{"$f":"IFERROR(VLOOKUP(E1707,Insumos!A:C,2,FALSE),\"\")","v":""},null,null,null,0]
[null,null,null,null,null,{"$f":"IFERROR(VLOOKUP(E1708,Insumos!A:C,2,FALSE),\"\")","v":""},null,null,null,0]
[null,null,null,null,null,{"$f":"IFERROR(VLOOKUP(E1709,Insumos!A:C,2,FALSE),\"\")","v":""},null,null,null,0]
[null,null,null,null,null,{"$f":"IFERROR(VLOOKUP(E1710,Insumos!A:C,2,FALSE),\"\")","v":""},null,null,null,0]
[null,null,null,null,null,{"$f":"IFERROR(VLOOKUP(E1711,Insumos!A:C,2,FALSE),\"\")","v":""},null,null,null,0]
[null,null,null,null,null,{"$f":"IFERROR(VLOOKUP(E1712,Insumos!A:C,2,FALSE),\"\")","v":""},null,null,null,0]
[null,null,null,null,null,{"$f":"IFERROR(VLOOKUP(E1713,Insumos!A:C,2,FALSE),\"\")","v":""},null,null,null,0]
[null,null,null,null,null,{"$f":"IFERROR(VLOOKUP(E1714,Insumos!A:C,2,FALSE),\"\")","v":""},null,null,null,0]
[null,null,null,null,null,{"$f":"IFERROR(VLOOKUP(E1715,Insumos!A:C,2,FALSE),\"\")","v":""},null,null,null,0]
[null,null,null,null,null,{"$f":"IFERROR(VLOOKUP(E1716,Insumos!A:C,2,FALSE),\"\")","v":""},null,null,null,0]
[null,null,null,null,null,{"$f":"IFERROR(VLOOKUP(E1717,Insumos!A:C,2,FALSE),\"\")","v":""},null,null,null,0]
[null,null,null,null,null,{"$f":"IFERROR(VLOOKUP(E1718,Insumos!A:C,2,FALSE),\"\")","v":""},null,null,null,0]
[null,null,null,null,null,{"$f":"IFERROR(VLOOKUP(E1719,Insumos!A:C,2,FALSE),\"\")","v":""},null,null,null,0]
[null,null,null,null,null,{"$f":"IFERROR(VLOOKUP(E1720,Insumos!A:C,2,FALSE),\"\")","v":""},null,null,null,0]
[null,null,null,null,null,{"$f":"IFERROR(VLOOKUP(E1721,Insumos!A:C,2,FALSE),\"\")","v":""},null,null,null,0]
[null,null,null,null,null,{"$f":"IFERROR(VLOOKUP(E1722,Insumos!A:C,2,FALSE),\"\")","v":""},null,null,null,0]
[null,null,null,null,null,{"$f":"IFERROR(VLOOKUP(E1723,Insumos!A:C,2,FALSE),\"\")","v":""},null,null,null,0]
[null,null,null,null,null,{"$f":"IFERROR(VLOOKUP(E1724,Insumos!A:C,2,FALSE),\"\")","v":""},null,null,null,0]
[null,null,null,null,null,{"$f":"IFERROR(VLOOKUP(E1725,Insumos!A:C,2,FALSE),\"\")","v":""},null,null,null,0]
[null,null,null,null,null,{"$f":"IFERROR(VLOOKUP(E1726,Insumos!A:C,2,FALSE),\"\")","v":""},null,null,null,0]
[null,null,null,null,null,{"$f":"IFERROR(VLOOKUP(E1727,Insumos!A:C,2,FALSE),\"\")","v":""},null,null,null,0]
[null,null,null,null,null,{"$f":"IFERROR(VLOOKUP(E1728,Insumos!A:C,2,FALSE),\"\")","v":""},null,null,null,0]
[null,null,null,null,null,{"$f":"IFERROR(VLOOKUP(E1729,Insumos!A:C,2,FALSE),\"\")","v":""},null,null,null,0]
[null,null,null,null,null,{"$f":"IFERROR(VLOOKUP(E1730,Insumos!A:C,2,FALSE),\"\")","v":""},null,null,null,0]
[null,null,null,null,null,{"$f":"IFERROR(VLOOKUP(E1731,Insumos!A:C,2,FALSE),\"\")","v":""},null,null,null,0]
[null,null,null,null,null,{"$f":"IFERROR(VLOOKUP(E1732,Insumos!A:C,2,FALSE),\"\")","v":""},null,null,null,0]
[null,null,null,null,null,{"$f":"IFERROR(VLOOKUP(E1733,Insumos!A:C,2,FALSE),\"\")","v":""},null,null,null,{"$f":"IFERROR(H1733*I1733,\"\")","v":0}]
[null,null,null,null,null,{"$f":"IFERROR(VLOOKUP(E1734,Insumos!A:C,2,FALSE),\"\")","v":""},null,null,null,0]
[null,null,null,null,null,{"$f":"IFERROR(VLOOKUP(E1735,Insumos!A:C,2,FALSE),\"\")","v":""},null,null,null,0]
[null,null,null,null,null,{"$f":"IFERROR(VLOOKUP(E1736,Insumos!A:C,2,FALSE),\"\")","v":""},null,null,null,0]
[null,null,null,null,null,{"$f":"IFERROR(VLOOKUP(E1737,Insumos!A:C,2,FALSE),\"\")","v":""},null,null,null,0]
[null,null,null,null,null,{"$f":"IFERROR(VLOOKUP(E1738,Insumos!A:C,2,FALSE),\"\")","v":""},null,null,null,0]
[null,null,null,null,null,{"$f":"IFERROR(VLOOKUP(E1739,Insumos!A:C,2,FALSE),\"\")","v":""},null,null,null,0]
[null,null,null,null,null,{"$f":"IFERROR(VLOOKUP(E1740,Insumos!A:C,2,FALSE),\"\")","v":""},null,null,null,0]
[null,null,null,null,null,{"$f":"IFERROR(VLOOKUP(E1741,Insumos!A:C,2,FALSE),\"\")","v":""},null,null,null,0]
[null,null,null,null,null,{"$f":"IFERROR(VLOOKUP(E1742,Insumos!A:C,2,FALSE),\"\")","v":""},null,null,null,0]
[null,null,null,null,null,{"$f":"IFERROR(VLOOKUP(E1743,Insumos!A:C,2,FALSE),\"\")","v":""},null,null,null,0]
[null,null,null,null,null,{"$f":"IFERROR(VLOOKUP(E1744,Insumos!A:C,2,FALSE),\"\")","v":""},null,null,null,0]
[null,null,null,null,null,{"$f":"IFERROR(VLOOKUP(E1745,Insumos!A:C,2,FALSE),\"\")","v":""},null,null,null,0]
[null,null,null,null,null,{"$f":"IFERROR(VLOOKUP(E1746,Insumos!A:C,2,FALSE),\"\")","v":""},null,null,null,0]
[null,null,null,null,null,{"$f":"IFERROR(VLOOKUP(E1747,Insumos!A:C,2,FALSE),\"\")","v":""},null,null,null,0]
[null,null,null,null,null,{"$f":"IFERROR(VLOOKUP(E1748,Insumos!A:C,2,FALSE),\"\")","v":""},null,null,null,0]
[null,null,null,null,null,{"$f":"IFERROR(VLOOKUP(E1749,Insumos!A:C,2,FALSE),\"\")","v":""},null,null,null,0]
[null,null,null,null,null,{"$f":"IFERROR(VLOOKUP(E1750,Insumos!A:C,2,FALSE),\"\")","v":""},null,null,null,0]
[null,null,null,null,null,{"$f":"IFERROR(VLOOKUP(E1751,Insumos!A:C,2,FALSE),\"\")","v":""},null,null,null,0]
[null,null,null,null,null,{"$f":"IFERROR(VLOOKUP(E1752,Insumos!A:C,2,FALSE),\"\")","v":""},null,null,null,0]
[null,null,null,null,null,{"$f":"IFERROR(VLOOKUP(E1753,Insumos!A:C,2,FALSE),\"\")","v":""},null,null,null,0]
[null,null,null,null,null,{"$f":"IFERROR(VLOOKUP(E1754,Insumos!A:C,2,FALSE),\"\")","v":""},null,null,null,0]
[null,null,null,null,null,{"$f":"IFERROR(VLOOKUP(E1755,Insumos!A:C,2,FALSE),\"\")","v":""},null,null,null,0]
[null,null,null,null,null,{"$f":"IFERROR(VLOOKUP(E1756,Insumos!A:C,2,FALSE),\"\")","v":""},null,null,null,0]
[null,null,null,null,null,{"$f":"IFERROR(VLOOKUP(E1757,Insumos!A:C,2,FALSE),\"\")","v":""},null,null,null,0]
[null,null,null,null,null,{"$f":"IFERROR(VLOOKUP(E1758,Insumos!A:C,2,FALSE),\"\")","v":""},null,null,null,0]
[null,null,null,null,null,{"$f":"IFERROR(VLOOKUP(E1759,Insumos!A:C,2,FALSE),\"\")","v":""},null,null,null,0]
[null,null,null,null,null,{"$f":"IFERROR(VLOOKUP(E1760,Insumos!A:C,2,FALSE),\"\")","v":""},null,null,null,0]
[null,null,null,null,null,{"$f":"IFERROR(VLOOKUP(E1761,Insumos!A:C,2,FALSE),\"\")","v":""},null,null,null,0]
[null,null,null,null,null,{"$f":"IFERROR(VLOOKUP(E1762,Insumos!A:C,2,FALSE),\"\")","v":""},null,null,null,0]
[null,null,null,null,null,{"$f":"IFERROR(VLOOKUP(E1763,Insumos!A:C,2,FALSE),\"\")","v":""},null,null,null,0]
[null,null,null,null,null,{"$f":"IFERROR(VLOOKUP(E1764,Insumos!A:C,2,FALSE),\"\")","v":""},null,null,null,0]
[null,null,null,null,null,{"$f":"IFERROR(VLOOKUP(E1765,Insumos!A:C,2,FALSE),\"\")","v":""},null,null,null,0]
[null,null,null,null,null,{"$f":"IFERROR(VLOOKUP(E1766,Insumos!A:C,2,FALSE),\"\")","v":""},null,null,null,0]
[null,null,null,null,null,{"$f":"IFERROR(VLOOKUP(E1767,Insumos!A:C,2,FALSE),\"\")","v":""},null,null,null,0]
[null,null,null,null,null,{"$f":"IFERROR(VLOOKUP(E1768,Insumos!A:C,2,FALSE),\"\")","v":""},null,null,null,0]
[null,null,null,null,null,{"$f":"IFERROR(VLOOKUP(E1769,Insumos!A:C,2,FALSE),\"\")","v":""},null,null,null,0]
[null,null,null,null,null,{"$f":"IFERROR(VLOOKUP(E1770,Insumos!A:C,2,FALSE),\"\")","v":""},null,null,null,0]
[null,null,null,null,null,{"$f":"IFERROR(VLOOKUP(E1771,Insumos!A:C,2,FALSE),\"\")","v":""},null,null,null,0]
[null,null,null,null,null,{"$f":"IFERROR(VLOOKUP(E1772,Insumos!A:C,2,FALSE),\"\")","v":""},null,null,null,0]
[null,null,null,null,null,{"$f":"IFERROR(VLOOKUP(E1773,Insumos!A:C,2,FALSE),\"\")","v":""},null,null,null,0]
[null,null,null,null,null,{"$f":"IFERROR(VLOOKUP(E1774,Insumos!A:C,2,FALSE),\"\")","v":""},null,null,null,0]
[null,null,null,null,null,{"$f":"IFERROR(VLOOKUP(E1775,Insumos!A:C,2,FALSE),\"\")","v":""},null,null,null,0]
[null,null,null,null,null,{"$f":"IFERROR(VLOOKUP(E1776,Insumos!A:C,2,FALSE),\"\")","v":""},null,null,null,0]
[null,null,null,null,null,{"$f":"IFERROR(VLOOKUP(E1777,Insumos!A:C,2,FALSE),\"\")","v":""},null,null,null,0]
[null,null,null,null,null,{"$f":"IFERROR(VLOOKUP(E1778,Insumos!A:C,2,FALSE),\"\")","v":""},null,null,null,0]
[null,null,null,null,null,{"$f":"IFERROR(VLOOKUP(E1779,Insumos!A:C,2,FALSE),\"\")","v":""},null,null,null,0]
[null,null,null,null,null,{"$f":"IFERROR(VLOOKUP(E1780,Insumos!A:C,2,FALSE),\"\")","v":""},null,null,null,0]
[null,null,null,null,null,{"$f":"IFERROR(VLOOKUP(E1781,Insumos!A:C,2,FALSE),\"\")","v":""},null,null,null,0]
[null,null,null,null,null,{"$f":"IFERROR(VLOOKUP(E1782,Insumos!A:C,2,FALSE),\"\")","v":""},null,null,null,0]
[null,null,null,null,null,{"$f":"IFERROR(VLOOKUP(E1783,Insumos!A:C,2,FALSE),\"\")","v":""},null,null,null,0]
[null,null,null,null,null,{"$f":"IFERROR(VLOOKUP(E1784,Insumos!A:C,2,FALSE),\"\")","v":""},null,null,null,0]
[null,null,null,null,null,{"$f":"IFERROR(VLOOKUP(E1785,Insumos!A:C,2,FALSE),\"\")","v":""},null,null,null,0]
[null,null,null,null,null,{"$f":"IFERROR(VLOOKUP(E1786,Insumos!A:C,2,FALSE),\"\")","v":""},null,null,null,0]
[null,null,null,null,null,{"$f":"IFERROR(VLOOKUP(E1787,Insumos!A:C,2,FALSE),\"\")","v":""},null,null,null,0]
[null,null,null,null,null,{"$f":"IFERROR(VLOOKUP(E1788,Insumos!A:C,2,FALSE),\"\")","v":""},null,null,null,0]
[null,null,null,null,null,{"$f":"IFERROR(VLOOKUP(E1789,Insumos!A:C,2,FALSE),\"\")","v":""},null,null,null,0]
[null,null,null,null,null,{"$f":"IFERROR(VLOOKUP(E1790,Insumos!A:C,2,FALSE),\"\")","v":""},null,null,null,0]
[null,null,null,null,null,{"$f":"IFERROR(VLOOKUP(E1791,Insumos!A:C,2,FALSE),\"\")","v":""},null,null,null,0]
[null,null,null,null,null,{"$f":"IFERROR(VLOOKUP(E1792,Insumos!A:C,2,FALSE),\"\")","v":""},null,null,null,0]
[null,null,null,null,null,{"$f":"IFERROR(VLOOKUP(E1793,Insumos!A:C,2,FALSE),\"\")","v":""},null,null,null,0]
[null,null,null,null,null,{"$f":"IFERROR(VLOOKUP(E1794,Insumos!A:C,2,FALSE),\"\")","v":""},null,null,null,0]
[null,null,null,null,null,{"$f":"IFERROR(VLOOKUP(E1795,Insumos!A:C,2,FALSE),\"\")","v":""},null,null,null,0]
[null,null,null,null,null,{"$f":"IFERROR(VLOOKUP(E1796,Insumos!A:C,2,FALSE),\"\")","v":""},null,null,null,0]
[null,null,null,null,null,{"$f":"IFERROR(VLOOKUP(E1797,Insumos!A:C,2,FALSE),\"\")","v":""},null,null,null,{"$f":"IFERROR(H1797*I1797,\"\")","v":0}]
[null,null,null,null,null,{"$f":"IFERROR(VLOOKUP(E1798,Insumos!A:C,2,FALSE),\"\")","v":""},null,null,null,0]
[null,null,null,null,null,{"$f":"IFERROR(VLOOKUP(E1799,Insumos!A:C,2,FALSE),\"\")","v":""},null,null,null,0]
[null,null,null,null,null,{"$f":"IFERROR(VLOOKUP(E1800,Insumos!A:C,2,FALSE),\"\")","v":""},null,null,null,0]
[null,null,null,null,null,{"$f":"IFERROR(VLOOKUP(E1801,Insumos!A:C,2,FALSE),\"\")","v":""},null,null,null,0]
[null,null,null,null,null,{"$f":"IFERROR(VLOOKUP(E1802,Insumos!A:C,2,FALSE),\"\")","v":""},null,null,null,0]
[null,null,null,null,null,{"$f":"IFERROR(VLOOKUP(E1803,Insumos!A:C,2,FALSE),\"\")","v":""},null,null,null,0]
[null,null,null,null,null,{"$f":"IFERROR(VLOOKUP(E1804,Insumos!A:C,2,FALSE),\"\")","v":""},null,null,null,0]
[null,null,null,null,null,{"$f":"IFERROR(VLOOKUP(E1805,Insumos!A:C,2,FALSE),\"\")","v":""},null,null,null,0]
[null,null,null,null,null,{"$f":"IFERROR(VLOOKUP(E1806,Insumos!A:C,2,FALSE),\"\")","v":""},null,null,null,0]
[null,null,null,null,null,{"$f":"IFERROR(VLOOKUP(E1807,Insumos!A:C,2,FALSE),\"\")","v":""},null,null,null,0]
[null,null,null,null,null,{"$f":"IFERROR(VLOOKUP(E1808,Insumos!A:C,2,FALSE),\"\")","v":""},null,null,null,0]
[null,null,null,null,null,{"$f":"IFERROR(VLOOKUP(E1809,Insumos!A:C,2,FALSE),\"\")","v":""},null,null,null,0]
[null,null,null,null,null,{"$f":"IFERROR(VLOOKUP(E1810,Insumos!A:C,2,FALSE),\"\")","v":""},null,null,null,0]
[null,null,null,null,null,{"$f":"IFERROR(VLOOKUP(E1811,Insumos!A:C,2,FALSE),\"\")","v":""},null,null,null,0]
[null,null,null,null,null,{"$f":"IFERROR(VLOOKUP(E1812,Insumos!A:C,2,FALSE),\"\")","v":""},null,null,null,0]
[null,null,null,null,null,{"$f":"IFERROR(VLOOKUP(E1813,Insumos!A:C,2,FALSE),\"\")","v":""},null,null,null,0]
[null,null,null,null,null,{"$f":"IFERROR(VLOOKUP(E1814,Insumos!A:C,2,FALSE),\"\")","v":""},null,null,null,0]
[null,null,null,null,null,{"$f":"IFERROR(VLOOKUP(E1815,Insumos!A:C,2,FALSE),\"\")","v":""},null,null,null,0]
[null,null,null,null,null,{"$f":"IFERROR(VLOOKUP(E1816,Insumos!A:C,2,FALSE),\"\")","v":""},null,null,null,0]
[null,null,null,null,null,{"$f":"IFERROR(VLOOKUP(E1817,Insumos!A:C,2,FALSE),\"\")","v":""},null,null,null,0]
[null,null,null,null,null,{"$f":"IFERROR(VLOOKUP(E1818,Insumos!A:C,2,FALSE),\"\")","v":""},null,null,null,0]
[null,null,null,null,null,{"$f":"IFERROR(VLOOKUP(E1819,Insumos!A:C,2,FALSE),\"\")","v":""},null,null,null,0]
[null,null,null,null,null,{"$f":"IFERROR(VLOOKUP(E1820,Insumos!A:C,2,FALSE),\"\")","v":""},null,null,null,0]
[null,null,null,null,null,{"$f":"IFERROR(VLOOKUP(E1821,Insumos!A:C,2,FALSE),\"\")","v":""},null,null,null,0]
[null,null,null,null,null,{"$f":"IFERROR(VLOOKUP(E1822,Insumos!A:C,2,FALSE),\"\")","v":""},null,null,null,0]
[null,null,null,null,null,{"$f":"IFERROR(VLOOKUP(E1823,Insumos!A:C,2,FALSE),\"\")","v":""},null,null,null,0]
[null,null,null,null,null,{"$f":"IFERROR(VLOOKUP(E1824,Insumos!A:C,2,FALSE),\"\")","v":""},null,null,null,0]
[null,null,null,null,null,{"$f":"IFERROR(VLOOKUP(E1825,Insumos!A:C,2,FALSE),\"\")","v":""},null,null,null,0]
[null,null,null,null,null,{"$f":"IFERROR(VLOOKUP(E1826,Insumos!A:C,2,FALSE),\"\")","v":""},null,null,null,0]
[null,null,null,null,null,{"$f":"IFERROR(VLOOKUP(E1827,Insumos!A:C,2,FALSE),\"\")","v":""},null,null,null,0]
[null,null,null,null,null,{"$f":"IFERROR(VLOOKUP(E1828,Insumos!A:C,2,FALSE),\"\")","v":""},null,null,null,0]
[null,null,null,null,null,{"$f":"IFERROR(VLOOKUP(E1829,Insumos!A:C,2,FALSE),\"\")","v":""},null,null,null,0]
[null,null,null,null,null,{"$f":"IFERROR(VLOOKUP(E1830,Insumos!A:C,2,FALSE),\"\")","v":""},null,null,null,0]
[null,null,null,null,null,{"$f":"IFERROR(VLOOKUP(E1831,Insumos!A:C,2,FALSE),\"\")","v":""},null,null,null,0]
[null,null,null,null,null,{"$f":"IFERROR(VLOOKUP(E1832,Insumos!A:C,2,FALSE),\"\")","v":""},null,null,null,0]
[null,null,null,null,null,{"$f":"IFERROR(VLOOKUP(E1833,Insumos!A:C,2,FALSE),\"\")","v":""},null,null,null,0]
[null,null,null,null,null,{"$f":"IFERROR(VLOOKUP(E1834,Insumos!A:C,2,FALSE),\"\")","v":""},null,null,null,0]
[null,null,null,null,null,{"$f":"IFERROR(VLOOKUP(E1835,Insumos!A:C,2,FALSE),\"\")","v":""},null,null,null,0]
[null,null,null,null,null,{"$f":"IFERROR(VLOOKUP(E1836,Insumos!A:C,2,FALSE),\"\")","v":""},null,null,null,0]
[null,null,null,null,null,{"$f":"IFERROR(VLOOKUP(E1837,Insumos!A:C,2,FALSE),\"\")","v":""},null,null,null,0]
[null,null,null,null,null,{"$f":"IFERROR(VLOOKUP(E1838,Insumos!A:C,2,FALSE),\"\")","v":""},null,null,null,0]
[null,null,null,null,null,{"$f":"IFERROR(VLOOKUP(E1839,Insumos!A:C,2,FALSE),\"\")","v":""},null,null,null,0]
[null,null,null,null,null,{"$f":"IFERROR(VLOOKUP(E1840,Insumos!A:C,2,FALSE),\"\")","v":""},null,null,null,0]
[null,null,null,null,null,{"$f":"IFERROR(VLOOKUP(E1841,Insumos!A:C,2,FALSE),\"\")","v":""},null,null,null,0]
[null,null,null,null,null,{"$f":"IFERROR(VLOOKUP(E1842,Insumos!A:C,2,FALSE),\"\")","v":""},null,null,null,0]
[null,null,null,null,null,{"$f":"IFERROR(VLOOKUP(E1843,Insumos!A:C,2,FALSE),\"\")","v":""},null,null,null,0]
[null,null,null,null,null,{"$f":"IFERROR(VLOOKUP(E1844,Insumos!A:C,2,FALSE),\"\")","v":""},null,null,null,0]
[null,null,null,null,null,{"$f":"IFERROR(VLOOKUP(E1845,Insumos!A:C,2,FALSE),\"\")","v":""},null,null,null,0]
[null,null,null,null,null,{"$f":"IFERROR(VLOOKUP(E1846,Insumos!A:C,2,FALSE),\"\")","v":""},null,null,null,0]
[null,null,null,null,null,{"$f":"IFERROR(VLOOKUP(E1847,Insumos!A:C,2,FALSE),\"\")","v":""},null,null,null,0]
[null,null,null,null,null,{"$f":"IFERROR(VLOOKUP(E1848,Insumos!A:C,2,FALSE),\"\")","v":""},null,null,null,0]
[null,null,null,null,null,{"$f":"IFERROR(VLOOKUP(E1849,Insumos!A:C,2,FALSE),\"\")","v":""},null,null,null,0]
[null,null,null,null,null,{"$f":"IFERROR(VLOOKUP(E1850,Insumos!A:C,2,FALSE),\"\")","v":""},null,null,null,0]
[null,null,null,null,null,{"$f":"IFERROR(VLOOKUP(E1851,Insumos!A:C,2,FALSE),\"\")","v":""},null,null,null,0]
[null,null,null,null,null,{"$f":"IFERROR(VLOOKUP(E1852,Insumos!A:C,2,FALSE),\"\")","v":""},null,null,null,0]
[null,null,null,null,null,{"$f":"IFERROR(VLOOKUP(E1853,Insumos!A:C,2,FALSE),\"\")","v":""},null,null,null,0]
[null,null,null,null,null,{"$f":"IFERROR(VLOOKUP(E1854,Insumos!A:C,2,FALSE),\"\")","v":""},null,null,null,0]
[null,null,null,null,null,{"$f":"IFERROR(VLOOKUP(E1855,Insumos!A:C,2,FALSE),\"\")","v":""},null,null,null,0]
[null,null,null,null,null,{"$f":"IFERROR(VLOOKUP(E1856,Insumos!A:C,2,FALSE),\"\")","v":""},null,null,null,0]
[null,null,null,null,null,{"$f":"IFERROR(VLOOKUP(E1857,Insumos!A:C,2,FALSE),\"\")","v":""},null,null,null,0]
[null,null,null,null,null,{"$f":"IFERROR(VLOOKUP(E1858,Insumos!A:C,2,FALSE),\"\")","v":""},null,null,null,0]
[null,null,null,null,null,{"$f":"IFERROR(VLOOKUP(E1859,Insumos!A:C,2,FALSE),\"\")","v":""},null,null,null,0]
[null,null,null,null,null,{"$f":"IFERROR(VLOOKUP(E1860,Insumos!A:C,2,FALSE),\"\")","v":""},null,null,null,0]
[null,null,null,null,null,{"$f":"IFERROR(VLOOKUP(E1861,Insumos!A:C,2,FALSE),\"\")","v":""},null,null,null,{"$f":"IFERROR(H1861*I1861,\"\")","v":0}]
[null,null,null,null,null,{"$f":"IFERROR(VLOOKUP(E1862,Insumos!A:C,2,FALSE),\"\")","v":""},null,null,null,0]
[null,null,null,null,null,{"$f":"IFERROR(VLOOKUP(E1863,Insumos!A:C,2,FALSE),\"\")","v":""},null,null,null,0]
[null,null,null,null,null,{"$f":"IFERROR(VLOOKUP(E1864,Insumos!A:C,2,FALSE),\"\")","v":""},null,null,null,0]
[null,null,null,null,null,{"$f":"IFERROR(VLOOKUP(E1865,Insumos!A:C,2,FALSE),\"\")","v":""},null,null,null,0]
[null,null,null,null,null,{"$f":"IFERROR(VLOOKUP(E1866,Insumos!A:C,2,FALSE),\"\")","v":""},null,null,null,0]
[null,null,null,null,null,{"$f":"IFERROR(VLOOKUP(E1867,Insumos!A:C,2,FALSE),\"\")","v":""},null,null,null,0]
[null,null,null,null,null,{"$f":"IFERROR(VLOOKUP(E1868,Insumos!A:C,2,FALSE),\"\")","v":""},null,null,null,0]
[null,null,null,null,null,{"$f":"IFERROR(VLOOKUP(E1869,Insumos!A:C,2,FALSE),\"\")","v":""},null,null,null,0]
[null,null,null,null,null,{"$f":"IFERROR(VLOOKUP(E1870,Insumos!A:C,2,FALSE),\"\")","v":""},null,null,null,0]
[null,null,null,null,null,{"$f":"IFERROR(VLOOKUP(E1871,Insumos!A:C,2,FALSE),\"\")","v":""},null,null,null,0]
[null,null,null,null,null,{"$f":"IFERROR(VLOOKUP(E1872,Insumos!A:C,2,FALSE),\"\")","v":""},null,null,null,0]
[null,null,null,null,null,{"$f":"IFERROR(VLOOKUP(E1873,Insumos!A:C,2,FALSE),\"\")","v":""},null,null,null,0]
[null,null,null,null,null,{"$f":"IFERROR(VLOOKUP(E1874,Insumos!A:C,2,FALSE),\"\")","v":""},null,null,null,0]
[null,null,null,null,null,{"$f":"IFERROR(VLOOKUP(E1875,Insumos!A:C,2,FALSE),\"\")","v":""},null,null,null,0]
[null,null,null,null,null,{"$f":"IFERROR(VLOOKUP(E1876,Insumos!A:C,2,FALSE),\"\")","v":""},null,null,null,0]
[null,null,null,null,null,{"$f":"IFERROR(VLOOKUP(E1877,Insumos!A:C,2,FALSE),\"\")","v":""},null,null,null,0]
[null,null,null,null,null,{"$f":"IFERROR(VLOOKUP(E1878,Insumos!A:C,2,FALSE),\"\")","v":""},null,null,null,0]
[null,null,null,null,null,{"$f":"IFERROR(VLOOKUP(E1879,Insumos!A:C,2,FALSE),\"\")","v":""},null,null,null,0]
[null,null,null,null,null,{"$f":"IFERROR(VLOOKUP(E1880,Insumos!A:C,2,FALSE),\"\")","v":""},null,null,null,0]
[null,null,null,null,null,{"$f":"IFERROR(VLOOKUP(E1881,Insumos!A:C,2,FALSE),\"\")","v":""},null,null,null,0]
[null,null,null,null,null,{"$f":"IFERROR(VLOOKUP(E1882,Insumos!A:C,2,FALSE),\"\")","v":""},null,null,null,0]
[null,null,null,null,null,{"$f":"IFERROR(VLOOKUP(E1883,Insumos!A:C,2,FALSE),\"\")","v":""},null,null,null,0]
[null,null,null,null,null,{"$f":"IFERROR(VLOOKUP(E1884,Insumos!A:C,2,FALSE),\"\")","v":""},null,null,null,0]
[null,null,null,null,null,{"$f":"IFERROR(VLOOKUP(E1885,Insumos!A:C,2,FALSE),\"\")","v":""},null,null,null,0]
[null,null,null,null,null,{"$f":"IFERROR(VLOOKUP(E1886,Insumos!A:C,2,FALSE),\"\")","v":""},null,null,null,0]
[null,null,null,null,null,{"$f":"IFERROR(VLOOKUP(E1887,Insumos!A:C,2,FALSE),\"\")","v":""},null,null,null,0]
[null,null,null,null,null,{"$f":"IFERROR(VLOOKUP(E1888,Insumos!A:C,2,FALSE),\"\")","v":""},null,null,null,0]
[null,null,null,null,null,{"$f":"IFERROR(VLOOKUP(E1889,Insumos!A:C,2,FALSE),\"\")","v":""},null,null,null,0]
[null,null,null,null,null,{"$f":"IFERROR(VLOOKUP(E1890,Insumos!A:C,2,FALSE),\"\")","v":""},null,null,null,0]
[null,null,null,null,null,{"$f":"IFERROR(VLOOKUP(E1891,Insumos!A:C,2,FALSE),\"\")","v":""},null,null,null,0]
[null,null,null,null,null,{"$f":"IFERROR(VLOOKUP(E1892,Insumos!A:C,2,FALSE),\"\")","v":""},null,null,null,0]
[null,null,null,null,null,{"$f":"IFERROR(VLOOKUP(E1893,Insumos!A:C,2,FALSE),\"\")","v":""},null,null,null,0]
[null,null,null,null,null,{"$f":"IFERROR(VLOOKUP(E1894,Insumos!A:C,2,FALSE),\"\")","v":""},null,null,null,0]
[null,null,null,null,null,{"$f":"IFERROR(VLOOKUP(E1895,Insumos!A:C,2,FALSE),\"\")","v":""},null,null,null,0]
[null,null,null,null,null,{"$f":"IFERROR(VLOOKUP(E1896,Insumos!A:C,2,FALSE),\"\")","v":""},null,null,null,0]
[null,null,null,null,null,{"$f":"IFERROR(VLOOKUP(E1897,Insumos!A:C,2,FALSE),\"\")","v":""},null,null,null,0]
[null,null,null,null,null,{"$f":"IFERROR(VLOOKUP(E1898,Insumos!A:C,2,FALSE),\"\")","v":""},null,null,null,0]
[null,null,null,null,null,{"$f":"IFERROR(VLOOKUP(E1899,Insumos!A:C,2,FALSE),\"\")","v":""},null,null,null,0]
[null,null,null,null,null,{"$f":"IFERROR(VLOOKUP(E1900,Insumos!A:C,2,FALSE),\"\")","v":""},null,null,null,0]
[null,null,null,null,null,{"$f":"IFERROR(VLOOKUP(E1901,Insumos!A:C,2,FALSE),\"\")","v":""},null,null,null,0]
[null,null,null,null,null,{"$f":"IFERROR(VLOOKUP(E1902,Insumos!A:C,2,FALSE),\"\")","v":""},null,null,null,0]
[null,null,null,null,null,{"$f":"IFERROR(VLOOKUP(E1903,Insumos!A:C,2,FALSE),\"\")","v":""},null,null,null,0]
[null,null,null,null,null,{"$f":"IFERROR(VLOOKUP(E1904,Insumos!A:C,2,FALSE),\"\")","v":""},null,null,null,0]
[null,null,null,null,null,{"$f":"IFERROR(VLOOKUP(E1905,Insumos!A:C,2,FALSE),\"\")","v":""},null,null,null,0]
[null,null,null,null,null,{"$f":"IFERROR(VLOOKUP(E1906,Insumos!A:C,2,FALSE),\"\")","v":""},null,null,null,0]
[null,null,null,null,null,{"$f":"IFERROR(VLOOKUP(E1907,Insumos!A:C,2,FALSE),\"\")","v":""},null,null,null,0]
[null,null,null,null,null,{"$f":"IFERROR(VLOOKUP(E1908,Insumos!A:C,2,FALSE),\"\")","v":""},null,null,null,0]
[null,null,null,null,null,{"$f":"IFERROR(VLOOKUP(E1909,Insumos!A:C,2,FALSE),\"\")","v":""},null,null,null,0]
[null,null,null,null,null,{"$f":"IFERROR(VLOOKUP(E1910,Insumos!A:C,2,FALSE),\"\")","v":""},null,null,null,0]
[null,null,null,null,null,{"$f":"IFERROR(VLOOKUP(E1911,Insumos!A:C,2,FALSE),\"\")","v":""},null,null,null,0]
[null,null,null,null,null,{"$f":"IFERROR(VLOOKUP(E1912,Insumos!A:C,2,FALSE),\"\")","v":""},null,null,null,0]
[null,null,null,null,null,{"$f":"IFERROR(VLOOKUP(E1913,Insumos!A:C,2,FALSE),\"\")","v":""},null,null,null,0]
[null,null,null,null,null,{"$f":"IFERROR(VLOOKUP(E1914,Insumos!A:C,2,FALSE),\"\")","v":""},null,null,null,0]
[null,null,null,null,null,{"$f":"IFERROR(VLOOKUP(E1915,Insumos!A:C,2,FALSE),\"\")","v":""},null,null,null,0]
[null,null,null,null,null,{"$f":"IFERROR(VLOOKUP(E1916,Insumos!A:C,2,FALSE),\"\")","v":""},null,null,null,0]
[null,null,null,null,null,{"$f":"IFERROR(VLOOKUP(E1917,Insumos!A:C,2,FALSE),\"\")","v":""},null,null,null,0]
[null,null,null,null,null,{"$f":"IFERROR(VLOOKUP(E1918,Insumos!A:C,2,FALSE),\"\")","v":""},null,null,null,0]
[null,null,null,null,null,{"$f":"IFERROR(VLOOKUP(E1919,Insumos!A:C,2,FALSE),\"\")","v":""},null,null,null,0]
[null,null,null,null,null,{"$f":"IFERROR(VLOOKUP(E1920,Insumos!A:C,2,FALSE),\"\")","v":""},null,null,null,0]
[null,null,null,null,null,{"$f":"IFERROR(VLOOKUP(E1921,Insumos!A:C,2,FALSE),\"\")","v":""},null,null,null,0]
[null,null,null,null,null,{"$f":"IFERROR(VLOOKUP(E1922,Insumos!A:C,2,FALSE),\"\")","v":""},null,null,null,0]
[null,null,null,null,null,{"$f":"IFERROR(VLOOKUP(E1923,Insumos!A:C,2,FALSE),\"\")","v":""},null,null,null,0]
[null,null,null,null,null,{"$f":"IFERROR(VLOOKUP(E1924,Insumos!A:C,2,FALSE),\"\")","v":""},null,null,null,0]
[null,null,null,null,null,{"$f":"IFERROR(VLOOKUP(E1925,Insumos!A:C,2,FALSE),\"\")","v":""},null,null,null,{"$f":"IFERROR(H1925*I1925,\"\")","v":0}]
[null,null,null,null,null,{"$f":"IFERROR(VLOOKUP(E1926,Insumos!A:C,2,FALSE),\"\")","v":""},null,null,null,0]
[null,null,null,null,null,{"$f":"IFERROR(VLOOKUP(E1927,Insumos!A:C,2,FALSE),\"\")","v":""},null,null,null,0]
[null,null,null,null,null,{"$f":"IFERROR(VLOOKUP(E1928,Insumos!A:C,2,FALSE),\"\")","v":""},null,null,null,0]
[null,null,null,null,null,{"$f":"IFERROR(VLOOKUP(E1929,Insumos!A:C,2,FALSE),\"\")","v":""},null,null,null,0]
[null,null,null,null,null,{"$f":"IFERROR(VLOOKUP(E1930,Insumos!A:C,2,FALSE),\"\")","v":""},null,null,null,0]
[null,null,null,null,null,{"$f":"IFERROR(VLOOKUP(E1931,Insumos!A:C,2,FALSE),\"\")","v":""},null,null,null,0]
[null,null,null,null,null,{"$f":"IFERROR(VLOOKUP(E1932,Insumos!A:C,2,FALSE),\"\")","v":""},null,null,null,0]
[null,null,null,null,null,{"$f":"IFERROR(VLOOKUP(E1933,Insumos!A:C,2,FALSE),\"\")","v":""},null,null,null,0]
[null,null,null,null,null,{"$f":"IFERROR(VLOOKUP(E1934,Insumos!A:C,2,FALSE),\"\")","v":""},null,null,null,0]
[null,null,null,null,null,{"$f":"IFERROR(VLOOKUP(E1935,Insumos!A:C,2,FALSE),\"\")","v":""},null,null,null,0]
[null,null,null,null,null,{"$f":"IFERROR(VLOOKUP(E1936,Insumos!A:C,2,FALSE),\"\")","v":""},null,null,null,0]
[null,null,null,null,null,{"$f":"IFERROR(VLOOKUP(E1937,Insumos!A:C,2,FALSE),\"\")","v":""},null,null,null,0]
[null,null,null,null,null,{"$f":"IFERROR(VLOOKUP(E1938,Insumos!A:C,2,FALSE),\"\")","v":""},null,null,null,0]
[null,null,null,null,null,{"$f":"IFERROR(VLOOKUP(E1939,Insumos!A:C,2,FALSE),\"\")","v":""},null,null,null,0]
[null,null,null,null,null,{"$f":"IFERROR(VLOOKUP(E1940,Insumos!A:C,2,FALSE),\"\")","v":""},null,null,null,0]
[null,null,null,null,null,{"$f":"IFERROR(VLOOKUP(E1941,Insumos!A:C,2,FALSE),\"\")","v":""},null,null,null,0]
[null,null,null,null,null,{"$f":"IFERROR(VLOOKUP(E1942,Insumos!A:C,2,FALSE),\"\")","v":""},null,null,null,0]
[null,null,null,null,null,{"$f":"IFERROR(VLOOKUP(E1943,Insumos!A:C,2,FALSE),\"\")","v":""},null,null,null,0]
[null,null,null,null,null,{"$f":"IFERROR(VLOOKUP(E1944,Insumos!A:C,2,FALSE),\"\")","v":""},null,null,null,0]
[null,null,null,null,null,{"$f":"IFERROR(VLOOKUP(E1945,Insumos!A:C,2,FALSE),\"\")","v":""},null,null,null,0]
[null,null,null,null,null,{"$f":"IFERROR(VLOOKUP(E1946,Insumos!A:C,2,FALSE),\"\")","v":""},null,null,null,0]
[null,null,null,null,null,{"$f":"IFERROR(VLOOKUP(E1947,Insumos!A:C,2,FALSE),\"\")","v":""},null,null,null,0]
[null,null,null,null,null,{"$f":"IFERROR(VLOOKUP(E1948,Insumos!A:C,2,FALSE),\"\")","v":""},null,null,null,0]
[null,null,null,null,null,{"$f":"IFERROR(VLOOKUP(E1949,Insumos!A:C,2,FALSE),\"\")","v":""},null,null,null,0]
[null,null,null,null,null,{"$f":"IFERROR(VLOOKUP(E1950,Insumos!A:C,2,FALSE),\"\")","v":""},null,null,null,0]
[null,null,null,null,null,{"$f":"IFERROR(VLOOKUP(E1951,Insumos!A:C,2,FALSE),\"\")","v":""},null,null,null,0]
[null,null,null,null,null,{"$f":"IFERROR(VLOOKUP(E1952,Insumos!A:C,2,FALSE),\"\")","v":""},null,null,null,0]
[null,null,null,null,null,{"$f":"IFERROR(VLOOKUP(E1953,Insumos!A:C,2,FALSE),\"\")","v":""},null,null,null,0]
[null,null,null,null,null,{"$f":"IFERROR(VLOOKUP(E1954,Insumos!A:C,2,FALSE),\"\")","v":""},null,null,null,0]
[null,null,null,null,null,{"$f":"IFERROR(VLOOKUP(E1955,Insumos!A:C,2,FALSE),\"\")","v":""},null,null,null,0]
[null,null,null,null,null,{"$f":"IFERROR(VLOOKUP(E1956,Insumos!A:C,2,FALSE),\"\")","v":""},null,null,null,0]
[null,null,null,null,null,{"$f":"IFERROR(VLOOKUP(E1957,Insumos!A:C,2,FALSE),\"\")","v":""},null,null,null,0]
[null,null,null,null,null,{"$f":"IFERROR(VLOOKUP(E1958,Insumos!A:C,2,FALSE),\"\")","v":""},null,null,null,0]
[null,null,null,null,null,{"$f":"IFERROR(VLOOKUP(E1959,Insumos!A:C,2,FALSE),\"\")","v":""},null,null,null,0]
[null,null,null,null,null,{"$f":"IFERROR(VLOOKUP(E1960,Insumos!A:C,2,FALSE),\"\")","v":""},null,null,null,0]
[null,null,null,null,null,{"$f":"IFERROR(VLOOKUP(E1961,Insumos!A:C,2,FALSE),\"\")","v":""},null,null,null,0]
[null,null,null,null,null,{"$f":"IFERROR(VLOOKUP(E1962,Insumos!A:C,2,FALSE),\"\")","v":""},null,null,null,0]
[null,null,null,null,null,{"$f":"IFERROR(VLOOKUP(E1963,Insumos!A:C,2,FALSE),\"\")","v":""},null,null,null,0]
[null,null,null,null,null,{"$f":"IFERROR(VLOOKUP(E1964,Insumos!A:C,2,FALSE),\"\")","v":""},null,null,null,0]
[null,null,null,null,null,{"$f":"IFERROR(VLOOKUP(E1965,Insumos!A:C,2,FALSE),\"\")","v":""},null,null,null,0]
[null,null,null,null,null,{"$f":"IFERROR(VLOOKUP(E1966,Insumos!A:C,2,FALSE),\"\")","v":""},null,null,null,0]
[null,null,null,null,null,{"$f":"IFERROR(VLOOKUP(E1967,Insumos!A:C,2,FALSE),\"\")","v":""},null,null,null,0]
[null,null,null,null,null,{"$f":"IFERROR(VLOOKUP(E1968,Insumos!A:C,2,FALSE),\"\")","v":""},null,null,null,0]
[null,null,null,null,null,{"$f":"IFERROR(VLOOKUP(E1969,Insumos!A:C,2,FALSE),\"\")","v":""},null,null,null,0]
[null,null,null,null,null,{"$f":"IFERROR(VLOOKUP(E1970,Insumos!A:C,2,FALSE),\"\")","v":""},null,null,null,0]
[null,null,null,null,null,{"$f":"IFERROR(VLOOKUP(E1971,Insumos!A:C,2,FALSE),\"\")","v":""},null,null,null,0]
[null,null,null,null,null,{"$f":"IFERROR(VLOOKUP(E1972,Insumos!A:C,2,FALSE),\"\")","v":""},null,null,null,0]
[null,null,null,null,null,{"$f":"IFERROR(VLOOKUP(E1973,Insumos!A:C,2,FALSE),\"\")","v":""},null,null,null,0]
[null,null,null,null,null,{"$f":"IFERROR(VLOOKUP(E1974,Insumos!A:C,2,FALSE),\"\")","v":""},null,null,null,0]
[null,null,null,null,null,{"$f":"IFERROR(VLOOKUP(E1975,Insumos!A:C,2,FALSE),\"\")","v":""},null,null,null,0]
[null,null,null,null,null,{"$f":"IFERROR(VLOOKUP(E1976,Insumos!A:C,2,FALSE),\"\")","v":""},null,null,null,0]
[null,null,null,null,null,{"$f":"IFERROR(VLOOKUP(E1977,Insumos!A:C,2,FALSE),\"\")","v":""},null,null,null,0]
[null,null,null,null,null,{"$f":"IFERROR(VLOOKUP(E1978,Insumos!A:C,2,FALSE),\"\")","v":""},null,null,null,0]
[null,null,null,null,null,{"$f":"IFERROR(VLOOKUP(E1979,Insumos!A:C,2,FALSE),\"\")","v":""},null,null,null,0]
[null,null,null,null,null,{"$f":"IFERROR(VLOOKUP(E1980,Insumos!A:C,2,FALSE),\"\")","v":""},null,null,null,0]
[null,null,null,null,null,{"$f":"IFERROR(VLOOKUP(E1981,Insumos!A:C,2,FALSE),\"\")","v":""},null,null,null,0]
[null,null,null,null,null,{"$f":"IFERROR(VLOOKUP(E1982,Insumos!A:C,2,FALSE),\"\")","v":""},null,null,null,0]
[null,null,null,null,null,{"$f":"IFERROR(VLOOKUP(E1983,Insumos!A:C,2,FALSE),\"\")","v":""},null,null,null,0]
[null,null,null,null,null,{"$f":"IFERROR(VLOOKUP(E1984,Insumos!A:C,2,FALSE),\"\")","v":""},null,null,null,0]
[null,null,null,null,null,{"$f":"IFERROR(VLOOKUP(E1985,Insumos!A:C,2,FALSE),\"\")","v":""},null,null,null,0]
[null,null,null,null,null,{"$f":"IFERROR(VLOOKUP(E1986,Insumos!A:C,2,FALSE),\"\")","v":""},null,null,null,0]
[null,null,null,null,null,{"$f":"IFERROR(VLOOKUP(E1987,Insumos!A:C,2,FALSE),\"\")","v":""},null,null,null,0]
[null,null,null,null,null,{"$f":"IFERROR(VLOOKUP(E1988,Insumos!A:C,2,FALSE),\"\")","v":""},null,null,null,0]
[null,null,null,null,null,{"$f":"IFERROR(VLOOKUP(E1989,Insumos!A:C,2,FALSE),\"\")","v":""},null,null,null,{"$f":"IFERROR(H1989*I1989,\"\")","v":0}]
[null,null,null,null,null,{"$f":"IFERROR(VLOOKUP(E1990,Insumos!A:C,2,FALSE),\"\")","v":""},null,null,null,0]
[null,null,null,null,null,{"$f":"IFERROR(VLOOKUP(E1991,Insumos!A:C,2,FALSE),\"\")","v":""},null,null,null,0]
[null,null,null,null,null,{"$f":"IFERROR(VLOOKUP(E1992,Insumos!A:C,2,FALSE),\"\")","v":""},null,null,null,0]
[null,null,null,null,null,{"$f":"IFERROR(VLOOKUP(E1993,Insumos!A:C,2,FALSE),\"\")","v":""},null,null,null,0]
[null,null,null,null,null,{"$f":"IFERROR(VLOOKUP(E1994,Insumos!A:C,2,FALSE),\"\")","v":""},null,null,null,0]
[null,null,null,null,null,{"$f":"IFERROR(VLOOKUP(E1995,Insumos!A:C,2,FALSE),\"\")","v":""},null,null,null,0]
[null,null,null,null,null,{"$f":"IFERROR(VLOOKUP(E1996,Insumos!A:C,2,FALSE),\"\")","v":""},null,null,null,0]
[null,null,null,null,null,{"$f":"IFERROR(VLOOKUP(E1997,Insumos!A:C,2,FALSE),\"\")","v":""},null,null,null,0]
[null,null,null,null,null,{"$f":"IFERROR(VLOOKUP(E1998,Insumos!A:C,2,FALSE),\"\")","v":""},null,null,null,0]
[null,null,null,null,null,{"$f":"IFERROR(VLOOKUP(E1999,Insumos!A:C,2,FALSE),\"\")","v":""},null,null,null,0]
[null,null,null,null,null,{"$f":"IFERROR(VLOOKUP(E2000,Insumos!A:C,2,FALSE),\"\")","v":""},null,null,null,0]
[null,null,null,null,null,{"$f":"IFERROR(VLOOKUP(E2001,Insumos!A:C,2,FALSE),\"\")","v":""},null,null,null,0]
[null,null,null,null,null,{"$f":"IFERROR(VLOOKUP(E2002,Insumos!A:C,2,FALSE),\"\")","v":""},null,null,null,0]
[null,null,null,null,null,{"$f":"IFERROR(VLOOKUP(E2003,Insumos!A:C,2,FALSE),\"\")","v":""},null,null,null,0]
[null,null,null,null,null,{"$f":"IFERROR(VLOOKUP(E2004,Insumos!A:C,2,FALSE),\"\")","v":""},null,null,null,0]
[null,null,null,null,null,{"$f":"IFERROR(VLOOKUP(E2005,Insumos!A:C,2,FALSE),\"\")","v":""},null,null,null,0]
[null,null,null,null,null,{"$f":"IFERROR(VLOOKUP(E2006,Insumos!A:C,2,FALSE),\"\")","v":""},null,null,null,0]
[null,null,null,null,null,{"$f":"IFERROR(VLOOKUP(E2007,Insumos!A:C,2,FALSE),\"\")","v":""},null,null,null,0]
[null,null,null,null,null,{"$f":"IFERROR(VLOOKUP(E2008,Insumos!A:C,2,FALSE),\"\")","v":""},null,null,null,0]
[null,null,null,null,null,{"$f":"IFERROR(VLOOKUP(E2009,Insumos!A:C,2,FALSE),\"\")","v":""},null,null,null,0]
[null,null,null,null,null,{"$f":"IFERROR(VLOOKUP(E2010,Insumos!A:C,2,FALSE),\"\")","v":""},null,null,null,0]
[null,null,null,null,null,{"$f":"IFERROR(VLOOKUP(E2011,Insumos!A:C,2,FALSE),\"\")","v":""},null,null,null,0]
[null,null,null,null,null,{"$f":"IFERROR(VLOOKUP(E2012,Insumos!A:C,2,FALSE),\"\")","v":""},null,null,null,0]
[null,null,null,null,null,{"$f":"IFERROR(VLOOKUP(E2013,Insumos!A:C,2,FALSE),\"\")","v":""},null,null,null,0]
[null,null,null,null,null,{"$f":"IFERROR(VLOOKUP(E2014,Insumos!A:C,2,FALSE),\"\")","v":""},null,null,null,0]
[null,null,null,null,null,{"$f":"IFERROR(VLOOKUP(E2015,Insumos!A:C,2,FALSE),\"\")","v":""},null,null,null,0]
[null,null,null,null,null,{"$f":"IFERROR(VLOOKUP(E2016,Insumos!A:C,2,FALSE),\"\")","v":""},null,null,null,0]
[null,null,null,null,null,{"$f":"IFERROR(VLOOKUP(E2017,Insumos!A:C,2,FALSE),\"\")","v":""},null,null,null,0]
[null,null,null,null,null,{"$f":"IFERROR(VLOOKUP(E2018,Insumos!A:C,2,FALSE),\"\")","v":""},null,null,null,0]
[null,null,null,null,null,{"$f":"IFERROR(VLOOKUP(E2019,Insumos!A:C,2,FALSE),\"\")","v":""},null,null,null,0]
[null,null,null,null,null,{"$f":"IFERROR(VLOOKUP(E2020,Insumos!A:C,2,FALSE),\"\")","v":""},null,null,null,0]
[null,null,null,null,null,{"$f":"IFERROR(VLOOKUP(E2021,Insumos!A:C,2,FALSE),\"\")","v":""},null,null,null,0]
[null,null,null,null,null,{"$f":"IFERROR(VLOOKUP(E2022,Insumos!A:C,2,FALSE),\"\")","v":""},null,null,null,0]
[null,null,null,null,null,{"$f":"IFERROR(VLOOKUP(E2023,Insumos!A:C,2,FALSE),\"\")","v":""},null,null,null,0]
[null,null,null,null,null,{"$f":"IFERROR(VLOOKUP(E2024,Insumos!A:C,2,FALSE),\"\")","v":""},null,null,null,0]
[null,null,null,null,null,{"$f":"IFERROR(VLOOKUP(E2025,Insumos!A:C,2,FALSE),\"\")","v":""},null,null,null,0]
[null,null,null,null,null,{"$f":"IFERROR(VLOOKUP(E2026,Insumos!A:C,2,FALSE),\"\")","v":""},null,null,null,0]
[null,null,null,null,null,{"$f":"IFERROR(VLOOKUP(E2027,Insumos!A:C,2,FALSE),\"\")","v":""},null,null,null,0]
[null,null,null,null,null,{"$f":"IFERROR(VLOOKUP(E2028,Insumos!A:C,2,FALSE),\"\")","v":""},null,null,null,0]
[null,null,null,null,null,{"$f":"IFERROR(VLOOKUP(E2029,Insumos!A:C,2,FALSE),\"\")","v":""},null,null,null,0]
[null,null,null,null,null,{"$f":"IFERROR(VLOOKUP(E2030,Insumos!A:C,2,FALSE),\"\")","v":""},null,null,null,0]
[null,null,null,null,null,{"$f":"IFERROR(VLOOKUP(E2031,Insumos!A:C,2,FALSE),\"\")","v":""},null,null,null,0]
[null,null,null,null,null,{"$f":"IFERROR(VLOOKUP(E2032,Insumos!A:C,2,FALSE),\"\")","v":""},null,null,null,0]
[null,null,null,null,null,{"$f":"IFERROR(VLOOKUP(E2033,Insumos!A:C,2,FALSE),\"\")","v":""},null,null,null,0]
[null,null,null,null,null,{"$f":"IFERROR(VLOOKUP(E2034,Insumos!A:C,2,FALSE),\"\")","v":""},null,null,null,0]
[null,null,null,null,null,{"$f":"IFERROR(VLOOKUP(E2035,Insumos!A:C,2,FALSE),\"\")","v":""},null,null,null,0]
[null,null,null,null,null,{"$f":"IFERROR(VLOOKUP(E2036,Insumos!A:C,2,FALSE),\"\")","v":""},null,null,null,0]
[null,null,null,null,null,{"$f":"IFERROR(VLOOKUP(E2037,Insumos!A:C,2,FALSE),\"\")","v":""},null,null,null,0]
[null,null,null,null,null,{"$f":"IFERROR(VLOOKUP(E2038,Insumos!A:C,2,FALSE),\"\")","v":""},null,null,null,0]
[null,null,null,null,null,{"$f":"IFERROR(VLOOKUP(E2039,Insumos!A:C,2,FALSE),\"\")","v":""},null,null,null,0]
[null,null,null,null,null,{"$f":"IFERROR(VLOOKUP(E2040,Insumos!A:C,2,FALSE),\"\")","v":""},null,null,null,0]
[null,null,null,null,null,{"$f":"IFERROR(VLOOKUP(E2041,Insumos!A:C,2,FALSE),\"\")","v":""},null,null,null,0]
[null,null,null,null,null,{"$f":"IFERROR(VLOOKUP(E2042,Insumos!A:C,2,FALSE),\"\")","v":""},null,null,null,0]
[null,null,null,null,null,{"$f":"IFERROR(VLOOKUP(E2043,Insumos!A:C,2,FALSE),\"\")","v":""},null,null,null,0]
[null,null,null,null,null,{"$f":"IFERROR(VLOOKUP(E2044,Insumos!A:C,2,FALSE),\"\")","v":""},null,null,null,0]
[null,null,null,null,null,{"$f":"IFERROR(VLOOKUP(E2045,Insumos!A:C,2,FALSE),\"\")","v":""},null,null,null,0]
[null,null,null,null,null,{"$f":"IFERROR(VLOOKUP(E2046,Insumos!A:C,2,FALSE),\"\")","v":""},null,null,null,0]
[null,null,null,null,null,{"$f":"IFERROR(VLOOKUP(E2047,Insumos!A:C,2,FALSE),\"\")","v":""},null,null,null,0]
[null,null,null,null,null,{"$f":"IFERROR(VLOOKUP(E2048,Insumos!A:C,2,FALSE),\"\")","v":""},null,null,null,0]
[null,null,null,null,null,{"$f":"IFERROR(VLOOKUP(E2049,Insumos!A:C,2,FALSE),\"\")","v":""},null,null,null,0]
[null,null,null,null,null,{"$f":"IFERROR(VLOOKUP(E2050,Insumos!A:C,2,FALSE),\"\")","v":""},null,null,null,0]
[null,null,null,null,null,{"$f":"IFERROR(VLOOKUP(E2051,Insumos!A:C,2,FALSE),\"\")","v":""},null,null,null,0]
[null,null,null,null,null,{"$f":"IFERROR(VLOOKUP(E2052,Insumos!A:C,2,FALSE),\"\")","v":""},null,null,null,0]
[null,null,null,null,null,{"$f":"IFERROR(VLOOKUP(E2053,Insumos!A:C,2,FALSE),\"\")","v":""},null,null,null,{"$f":"IFERROR(H2053*I2053,\"\")","v":0}]
[null,null,null,null,null,{"$f":"IFERROR(VLOOKUP(E2054,Insumos!A:C,2,FALSE),\"\")","v":""},null,null,null,0]
[null,null,null,null,null,{"$f":"IFERROR(VLOOKUP(E2055,Insumos!A:C,2,FALSE),\"\")","v":""},null,null,null,0]
[null,null,null,null,null,{"$f":"IFERROR(VLOOKUP(E2056,Insumos!A:C,2,FALSE),\"\")","v":""},null,null,null,0]
[null,null,null,null,null,{"$f":"IFERROR(VLOOKUP(E2057,Insumos!A:C,2,FALSE),\"\")","v":""},null,null,null,0]
[null,null,null,null,null,{"$f":"IFERROR(VLOOKUP(E2058,Insumos!A:C,2,FALSE),\"\")","v":""},null,null,null,0]
[null,null,null,null,null,{"$f":"IFERROR(VLOOKUP(E2059,Insumos!A:C,2,FALSE),\"\")","v":""},null,null,null,0]
[null,null,null,null,null,{"$f":"IFERROR(VLOOKUP(E2060,Insumos!A:C,2,FALSE),\"\")","v":""},null,null,null,0]
[null,null,null,null,null,{"$f":"IFERROR(VLOOKUP(E2061,Insumos!A:C,2,FALSE),\"\")","v":""},null,null,null,0]
[null,null,null,null,null,{"$f":"IFERROR(VLOOKUP(E2062,Insumos!A:C,2,FALSE),\"\")","v":""},null,null,null,0]
[null,null,null,null,null,{"$f":"IFERROR(VLOOKUP(E2063,Insumos!A:C,2,FALSE),\"\")","v":""},null,null,null,0]
[null,null,null,null,null,{"$f":"IFERROR(VLOOKUP(E2064,Insumos!A:C,2,FALSE),\"\")","v":""},null,null,null,0]
[null,null,null,null,null,{"$f":"IFERROR(VLOOKUP(E2065,Insumos!A:C,2,FALSE),\"\")","v":""},null,null,null,0]
[null,null,null,null,null,{"$f":"IFERROR(VLOOKUP(E2066,Insumos!A:C,2,FALSE),\"\")","v":""},null,null,null,0]
[null,null,null,null,null,{"$f":"IFERROR(VLOOKUP(E2067,Insumos!A:C,2,FALSE),\"\")","v":""},null,null,null,0]
[null,null,null,null,null,{"$f":"IFERROR(VLOOKUP(E2068,Insumos!A:C,2,FALSE),\"\")","v":""},null,null,null,0]
[null,null,null,null,null,{"$f":"IFERROR(VLOOKUP(E2069,Insumos!A:C,2,FALSE),\"\")","v":""},null,null,null,0]
[null,null,null,null,null,{"$f":"IFERROR(VLOOKUP(E2070,Insumos!A:C,2,FALSE),\"\")","v":""},null,null,null,0]
[null,null,null,null,null,{"$f":"IFERROR(VLOOKUP(E2071,Insumos!A:C,2,FALSE),\"\")","v":""},null,null,null,0]
[null,null,null,null,null,{"$f":"IFERROR(VLOOKUP(E2072,Insumos!A:C,2,FALSE),\"\")","v":""},null,null,null,0]
[null,null,null,null,null,{"$f":"IFERROR(VLOOKUP(E2073,Insumos!A:C,2,FALSE),\"\")","v":""},null,null,null,0]
[null,null,null,null,null,{"$f":"IFERROR(VLOOKUP(E2074,Insumos!A:C,2,FALSE),\"\")","v":""},null,null,null,0]
[null,null,null,null,null,{"$f":"IFERROR(VLOOKUP(E2075,Insumos!A:C,2,FALSE),\"\")","v":""},null,null,null,0]
[null,null,null,null,null,{"$f":"IFERROR(VLOOKUP(E2076,Insumos!A:C,2,FALSE),\"\")","v":""},null,null,null,0]
[null,null,null,null,null,{"$f":"IFERROR(VLOOKUP(E2077,Insumos!A:C,2,FALSE),\"\")","v":""},null,null,null,0]
[null,null,null,null,null,{"$f":"IFERROR(VLOOKUP(E2078,Insumos!A:C,2,FALSE),\"\")","v":""},null,null,null,0]
[null,null,null,null,null,{"$f":"IFERROR(VLOOKUP(E2079,Insumos!A:C,2,FALSE),\"\")","v":""},null,null,null,0]
[null,null,null,null,null,{"$f":"IFERROR(VLOOKUP(E2080,Insumos!A:C,2,FALSE),\"\")","v":""},null,null,null,0]
[null,null,null,null,null,{"$f":"IFERROR(VLOOKUP(E2081,Insumos!A:C,2,FALSE),\"\")","v":""},null,null,null,0]
[null,null,null,null,null,{"$f":"IFERROR(VLOOKUP(E2082,Insumos!A:C,2,FALSE),\"\")","v":""},null,null,null,0]
[null,null,null,null,null,{"$f":"IFERROR(VLOOKUP(E2083,Insumos!A:C,2,FALSE),\"\")","v":""},null,null,null,0]
[null,null,null,null,null,{"$f":"IFERROR(VLOOKUP(E2084,Insumos!A:C,2,FALSE),\"\")","v":""},null,null,null,0]
[null,null,null,null,null,{"$f":"IFERROR(VLOOKUP(E2085,Insumos!A:C,2,FALSE),\"\")","v":""},null,null,null,0]
[null,null,null,null,null,{"$f":"IFERROR(VLOOKUP(E2086,Insumos!A:C,2,FALSE),\"\")","v":""},null,null,null,0]
[null,null,null,null,null,{"$f":"IFERROR(VLOOKUP(E2087,Insumos!A:C,2,FALSE),\"\")","v":""},null,null,null,0]
[null,null,null,null,null,{"$f":"IFERROR(VLOOKUP(E2088,Insumos!A:C,2,FALSE),\"\")","v":""},null,null,null,0]
[null,null,null,null,null,{"$f":"IFERROR(VLOOKUP(E2089,Insumos!A:C,2,FALSE),\"\")","v":""},null,null,null,0]
[null,null,null,null,null,{"$f":"IFERROR(VLOOKUP(E2090,Insumos!A:C,2,FALSE),\"\")","v":""},null,null,null,0]
[null,null,null,null,null,{"$f":"IFERROR(VLOOKUP(E2091,Insumos!A:C,2,FALSE),\"\")","v":""},null,null,null,0]
[null,null,null,null,null,{"$f":"IFERROR(VLOOKUP(E2092,Insumos!A:C,2,FALSE),\"\")","v":""},null,null,null,0]
[null,null,null,null,null,{"$f":"IFERROR(VLOOKUP(E2093,Insumos!A:C,2,FALSE),\"\")","v":""},null,null,null,0]
[null,null,null,null,null,{"$f":"IFERROR(VLOOKUP(E2094,Insumos!A:C,2,FALSE),\"\")","v":""},null,null,null,0]
[null,null,null,null,null,{"$f":"IFERROR(VLOOKUP(E2095,Insumos!A:C,2,FALSE),\"\")","v":""},null,null,null,0]
[null,null,null,null,null,{"$f":"IFERROR(VLOOKUP(E2096,Insumos!A:C,2,FALSE),\"\")","v":""},null,null,null,0]
[null,null,null,null,null,{"$f":"IFERROR(VLOOKUP(E2097,Insumos!A:C,2,FALSE),\"\")","v":""},null,null,null,0]
[null,null,null,null,null,{"$f":"IFERROR(VLOOKUP(E2098,Insumos!A:C,2,FALSE),\"\")","v":""},null,null,null,0]
[null,null,null,null,null,{"$f":"IFERROR(VLOOKUP(E2099,Insumos!A:C,2,FALSE),\"\")","v":""},null,null,null,0]
[null,null,null,null,null,{"$f":"IFERROR(VLOOKUP(E2100,Insumos!A:C,2,FALSE),\"\")","v":""},null,null,null,0]
[null,null,null,null,null,{"$f":"IFERROR(VLOOKUP(E2101,Insumos!A:C,2,FALSE),\"\")","v":""},null,null,null,0]
[null,null,null,null,null,{"$f":"IFERROR(VLOOKUP(E2102,Insumos!A:C,2,FALSE),\"\")","v":""},null,null,null,0]
[null,null,null,null,null,{"$f":"IFERROR(VLOOKUP(E2103,Insumos!A:C,2,FALSE),\"\")","v":""},null,null,null,0]
[null,null,null,null,null,{"$f":"IFERROR(VLOOKUP(E2104,Insumos!A:C,2,FALSE),\"\")","v":""},null,null,null,0]
[null,null,null,null,null,{"$f":"IFERROR(VLOOKUP(E2105,Insumos!A:C,2,FALSE),\"\")","v":""},null,null,null,0]
[null,null,null,null,null,{"$f":"IFERROR(VLOOKUP(E2106,Insumos!A:C,2,FALSE),\"\")","v":""},null,null,null,0]
[null,null,null,null,null,{"$f":"IFERROR(VLOOKUP(E2107,Insumos!A:C,2,FALSE),\"\")","v":""},null,null,null,0]
[null,null,null,null,null,{"$f":"IFERROR(VLOOKUP(E2108,Insumos!A:C,2,FALSE),\"\")","v":""},null,null,null,0]
[null,null,null,null,null,{"$f":"IFERROR(VLOOKUP(E2109,Insumos!A:C,2,FALSE),\"\")","v":""},null,null,null,0]
[null,null,null,null,null,{"$f":"IFERROR(VLOOKUP(E2110,Insumos!A:C,2,FALSE),\"\")","v":""},null,null,null,0]
[null,null,null,null,null,{"$f":"IFERROR(VLOOKUP(E2111,Insumos!A:C,2,FALSE),\"\")","v":""},null,null,null,0]
[null,null,null,null,null,{"$f":"IFERROR(VLOOKUP(E2112,Insumos!A:C,2,FALSE),\"\")","v":""},null,null,null,0]
[null,null,null,null,null,{"$f":"IFERROR(VLOOKUP(E2113,Insumos!A:C,2,FALSE),\"\")","v":""},null,null,null,0]
[null,null,null,null,null,{"$f":"IFERROR(VLOOKUP(E2114,Insumos!A:C,2,FALSE),\"\")","v":""},null,null,null,0]
[null,null,null,null,null,{"$f":"IFERROR(VLOOKUP(E2115,Insumos!A:C,2,FALSE),\"\")","v":""},null,null,null,0]
[null,null,null,null,null,{"$f":"IFERROR(VLOOKUP(E2116,Insumos!A:C,2,FALSE),\"\")","v":""},null,null,null,0]
[null,null,null,null,null,{"$f":"IFERROR(VLOOKUP(E2117,Insumos!A:C,2,FALSE),\"\")","v":""},null,null,null,{"$f":"IFERROR(H2117*I2117,\"\")","v":0}]
[null,null,null,null,null,{"$f":"IFERROR(VLOOKUP(E2118,Insumos!A:C,2,FALSE),\"\")","v":""},null,null,null,0]
[null,null,null,null,null,{"$f":"IFERROR(VLOOKUP(E2119,Insumos!A:C,2,FALSE),\"\")","v":""},null,null,null,0]
[null,null,null,null,null,{"$f":"IFERROR(VLOOKUP(E2120,Insumos!A:C,2,FALSE),\"\")","v":""},null,null,null,0]
[null,null,null,null,null,{"$f":"IFERROR(VLOOKUP(E2121,Insumos!A:C,2,FALSE),\"\")","v":""},null,null,null,0]
[null,null,null,null,null,{"$f":"IFERROR(VLOOKUP(E2122,Insumos!A:C,2,FALSE),\"\")","v":""},null,null,null,0]
[null,null,null,null,null,{"$f":"IFERROR(VLOOKUP(E2123,Insumos!A:C,2,FALSE),\"\")","v":""},null,null,null,0]
[null,null,null,null,null,{"$f":"IFERROR(VLOOKUP(E2124,Insumos!A:C,2,FALSE),\"\")","v":""},null,null,null,0]
[null,null,null,null,null,{"$f":"IFERROR(VLOOKUP(E2125,Insumos!A:C,2,FALSE),\"\")","v":""},null,null,null,0]
[null,null,null,null,null,{"$f":"IFERROR(VLOOKUP(E2126,Insumos!A:C,2,FALSE),\"\")","v":""},null,null,null,0]
[null,null,null,null,null,{"$f":"IFERROR(VLOOKUP(E2127,Insumos!A:C,2,FALSE),\"\")","v":""},null,null,null,0]
[null,null,null,null,null,{"$f":"IFERROR(VLOOKUP(E2128,Insumos!A:C,2,FALSE),\"\")","v":""},null,null,null,0]
[null,null,null,null,null,{"$f":"IFERROR(VLOOKUP(E2129,Insumos!A:C,2,FALSE),\"\")","v":""},null,null,null,0]
[null,null,null,null,null,{"$f":"IFERROR(VLOOKUP(E2130,Insumos!A:C,2,FALSE),\"\")","v":""},null,null,null,0]
[null,null,null,null,null,{"$f":"IFERROR(VLOOKUP(E2131,Insumos!A:C,2,FALSE),\"\")","v":""},null,null,null,0]
[null,null,null,null,null,{"$f":"IFERROR(VLOOKUP(E2132,Insumos!A:C,2,FALSE),\"\")","v":""},null,null,null,0]
[null,null,null,null,null,{"$f":"IFERROR(VLOOKUP(E2133,Insumos!A:C,2,FALSE),\"\")","v":""},null,null,null,0]
[null,null,null,null,null,{"$f":"IFERROR(VLOOKUP(E2134,Insumos!A:C,2,FALSE),\"\")","v":""},null,null,null,0]
[null,null,null,null,null,{"$f":"IFERROR(VLOOKUP(E2135,Insumos!A:C,2,FALSE),\"\")","v":""},null,null,null,0]
[null,null,null,null,null,{"$f":"IFERROR(VLOOKUP(E2136,Insumos!A:C,2,FALSE),\"\")","v":""},null,null,null,0]
[null,null,null,null,null,{"$f":"IFERROR(VLOOKUP(E2137,Insumos!A:C,2,FALSE),\"\")","v":""},null,null,null,0]
[null,null,null,null,null,{"$f":"IFERROR(VLOOKUP(E2138,Insumos!A:C,2,FALSE),\"\")","v":""},null,null,null,0]
[null,null,null,null,null,{"$f":"IFERROR(VLOOKUP(E2139,Insumos!A:C,2,FALSE),\"\")","v":""},null,null,null,0]
[null,null,null,null,null,{"$f":"IFERROR(VLOOKUP(E2140,Insumos!A:C,2,FALSE),\"\")","v":""},null,null,null,0]
[null,null,null,null,null,{"$f":"IFERROR(VLOOKUP(E2141,Insumos!A:C,2,FALSE),\"\")","v":""},null,null,null,0]
[null,null,null,null,null,{"$f":"IFERROR(VLOOKUP(E2142,Insumos!A:C,2,FALSE),\"\")","v":""},null,null,null,0]
[null,null,null,null,null,{"$f":"IFERROR(VLOOKUP(E2143,Insumos!A:C,2,FALSE),\"\")","v":""},null,null,null,0]
[null,null,null,null,null,{"$f":"IFERROR(VLOOKUP(E2144,Insumos!A:C,2,FALSE),\"\")","v":""},null,null,null,0]
[null,null,null,null,null,{"$f":"IFERROR(VLOOKUP(E2145,Insumos!A:C,2,FALSE),\"\")","v":""},null,null,null,0]
[null,null,null,null,null,{"$f":"IFERROR(VLOOKUP(E2146,Insumos!A:C,2,FALSE),\"\")","v":""},null,null,null,0]
[null,null,null,null,null,{"$f":"IFERROR(VLOOKUP(E2147,Insumos!A:C,2,FALSE),\"\")","v":""},null,null,null,0]
[null,null,null,null,null,{"$f":"IFERROR(VLOOKUP(E2148,Insumos!A:C,2,FALSE),\"\")","v":""},null,null,null,0]
[null,null,null,null,null,{"$f":"IFERROR(VLOOKUP(E2149,Insumos!A:C,2,FALSE),\"\")","v":""},null,null,null,0]
[null,null,null,null,null,{"$f":"IFERROR(VLOOKUP(E2150,Insumos!A:C,2,FALSE),\"\")","v":""},null,null,null,0]
[null,null,null,null,null,{"$f":"IFERROR(VLOOKUP(E2151,Insumos!A:C,2,FALSE),\"\")","v":""},null,null,null,0]
[null,null,null,null,null,{"$f":"IFERROR(VLOOKUP(E2152,Insumos!A:C,2,FALSE),\"\")","v":""},null,null,null,0]
[null,null,null,null,null,{"$f":"IFERROR(VLOOKUP(E2153,Insumos!A:C,2,FALSE),\"\")","v":""},null,null,null,0]
[null,null,null,null,null,{"$f":"IFERROR(VLOOKUP(E2154,Insumos!A:C,2,FALSE),\"\")","v":""},null,null,null,0]
[null,null,null,null,null,{"$f":"IFERROR(VLOOKUP(E2155,Insumos!A:C,2,FALSE),\"\")","v":""},null,null,null,0]
[null,null,null,null,null,{"$f":"IFERROR(VLOOKUP(E2156,Insumos!A:C,2,FALSE),\"\")","v":""},null,null,null,0]
[null,null,null,null,null,{"$f":"IFERROR(VLOOKUP(E2157,Insumos!A:C,2,FALSE),\"\")","v":""},null,null,null,0]
[null,null,null,null,null,{"$f":"IFERROR(VLOOKUP(E2158,Insumos!A:C,2,FALSE),\"\")","v":""},null,null,null,0]
[null,null,null,null,null,{"$f":"IFERROR(VLOOKUP(E2159,Insumos!A:C,2,FALSE),\"\")","v":""},null,null,null,0]
[null,null,null,null,null,{"$f":"IFERROR(VLOOKUP(E2160,Insumos!A:C,2,FALSE),\"\")","v":""},null,null,null,0]
[null,null,null,null,null,{"$f":"IFERROR(VLOOKUP(E2161,Insumos!A:C,2,FALSE),\"\")","v":""},null,null,null,0]
[null,null,null,null,null,{"$f":"IFERROR(VLOOKUP(E2162,Insumos!A:C,2,FALSE),\"\")","v":""},null,null,null,0]
[null,null,null,null,null,{"$f":"IFERROR(VLOOKUP(E2163,Insumos!A:C,2,FALSE),\"\")","v":""},null,null,null,0]
[null,null,null,null,null,{"$f":"IFERROR(VLOOKUP(E2164,Insumos!A:C,2,FALSE),\"\")","v":""},null,null,null,0]
[null,null,null,null,null,{"$f":"IFERROR(VLOOKUP(E2165,Insumos!A:C,2,FALSE),\"\")","v":""},null,null,null,0]
[null,null,null,null,null,{"$f":"IFERROR(VLOOKUP(E2166,Insumos!A:C,2,FALSE),\"\")","v":""},null,null,null,0]
[null,null,null,null,null,{"$f":"IFERROR(VLOOKUP(E2167,Insumos!A:C,2,FALSE),\"\")","v":""},null,null,null,0]
[null,null,null,null,null,{"$f":"IFERROR(VLOOKUP(E2168,Insumos!A:C,2,FALSE),\"\")","v":""},null,null,null,0]
[null,null,null,null,null,{"$f":"IFERROR(VLOOKUP(E2169,Insumos!A:C,2,FALSE),\"\")","v":""},null,null,null,0]
[null,null,null,null,null,{"$f":"IFERROR(VLOOKUP(E2170,Insumos!A:C,2,FALSE),\"\")","v":""},null,null,null,0]
[null,null,null,null,null,{"$f":"IFERROR(VLOOKUP(E2171,Insumos!A:C,2,FALSE),\"\")","v":""},null,null,null,0]
[null,null,null,null,null,{"$f":"IFERROR(VLOOKUP(E2172,Insumos!A:C,2,FALSE),\"\")","v":""},null,null,null,0]
[null,null,null,null,null,{"$f":"IFERROR(VLOOKUP(E2173,Insumos!A:C,2,FALSE),\"\")","v":""},null,null,null,0]
[null,null,null,null,null,{"$f":"IFERROR(VLOOKUP(E2174,Insumos!A:C,2,FALSE),\"\")","v":""},null,null,null,0]
[null,null,null,null,null,{"$f":"IFERROR(VLOOKUP(E2175,Insumos!A:C,2,FALSE),\"\")","v":""},null,null,null,0]
[null,null,null,null,null,{"$f":"IFERROR(VLOOKUP(E2176,Insumos!A:C,2,FALSE),\"\")","v":""},null,null,null,0]
[null,null,null,null,null,{"$f":"IFERROR(VLOOKUP(E2177,Insumos!A:C,2,FALSE),\"\")","v":""},null,null,null,0]
[null,null,null,null,null,{"$f":"IFERROR(VLOOKUP(E2178,Insumos!A:C,2,FALSE),\"\")","v":""},null,null,null,0]
[null,null,null,null,null,{"$f":"IFERROR(VLOOKUP(E2179,Insumos!A:C,2,FALSE),\"\")","v":""},null,null,null,0]
[null,null,null,null,null,{"$f":"IFERROR(VLOOKUP(E2180,Insumos!A:C,2,FALSE),\"\")","v":""},null,null,null,0]
[null,null,null,null,null,{"$f":"IFERROR(VLOOKUP(E2181,Insumos!A:C,2,FALSE),\"\")","v":""},null,null,null,{"$f":"IFERROR(H2181*I2181,\"\")","v":0}]
[null,null,null,null,null,{"$f":"IFERROR(VLOOKUP(E2182,Insumos!A:C,2,FALSE),\"\")","v":""},null,null,null,0]
[null,null,null,null,null,{"$f":"IFERROR(VLOOKUP(E2183,Insumos!A:C,2,FALSE),\"\")","v":""},null,null,null,0]
[null,null,null,null,null,{"$f":"IFERROR(VLOOKUP(E2184,Insumos!A:C,2,FALSE),\"\")","v":""},null,null,null,0]
[null,null,null,null,null,{"$f":"IFERROR(VLOOKUP(E2185,Insumos!A:C,2,FALSE),\"\")","v":""},null,null,null,0]
[null,null,null,null,null,{"$f":"IFERROR(VLOOKUP(E2186,Insumos!A:C,2,FALSE),\"\")","v":""},null,null,null,0]
[null,null,null,null,null,{"$f":"IFERROR(VLOOKUP(E2187,Insumos!A:C,2,FALSE),\"\")","v":""},null,null,null,0]
[null,null,null,null,null,{"$f":"IFERROR(VLOOKUP(E2188,Insumos!A:C,2,FALSE),\"\")","v":""},null,null,null,0]
[null,null,null,null,null,{"$f":"IFERROR(VLOOKUP(E2189,Insumos!A:C,2,FALSE),\"\")","v":""},null,null,null,0]
[null,null,null,null,null,{"$f":"IFERROR(VLOOKUP(E2190,Insumos!A:C,2,FALSE),\"\")","v":""},null,null,null,0]
[null,null,null,null,null,{"$f":"IFERROR(VLOOKUP(E2191,Insumos!A:C,2,FALSE),\"\")","v":""},null,null,null,0]
[null,null,null,null,null,{"$f":"IFERROR(VLOOKUP(E2192,Insumos!A:C,2,FALSE),\"\")","v":""},null,null,null,0]
[null,null,null,null,null,{"$f":"IFERROR(VLOOKUP(E2193,Insumos!A:C,2,FALSE),\"\")","v":""},null,null,null,0]
[null,null,null,null,null,{"$f":"IFERROR(VLOOKUP(E2194,Insumos!A:C,2,FALSE),\"\")","v":""},null,null,null,0]
[null,null,null,null,null,{"$f":"IFERROR(VLOOKUP(E2195,Insumos!A:C,2,FALSE),\"\")","v":""},null,null,null,0]
[null,null,null,null,null,{"$f":"IFERROR(VLOOKUP(E2196,Insumos!A:C,2,FALSE),\"\")","v":""},null,null,null,0]
[null,null,null,null,null,{"$f":"IFERROR(VLOOKUP(E2197,Insumos!A:C,2,FALSE),\"\")","v":""},null,null,null,0]
[null,null,null,null,null,{"$f":"IFERROR(VLOOKUP(E2198,Insumos!A:C,2,FALSE),\"\")","v":""},null,null,null,0]
[null,null,null,null,null,{"$f":"IFERROR(VLOOKUP(E2199,Insumos!A:C,2,FALSE),\"\")","v":""},null,null,null,0]
[null,null,null,null,null,{"$f":"IFERROR(VLOOKUP(E2200,Insumos!A:C,2,FALSE),\"\")","v":""},null,null,null,0]
[null,null,null,null,null,{"$f":"IFERROR(VLOOKUP(E2201,Insumos!A:C,2,FALSE),\"\")","v":""},null,null,null,0]
[null,null,null,null,null,{"$f":"IFERROR(VLOOKUP(E2202,Insumos!A:C,2,FALSE),\"\")","v":""},null,null,null,0]
[null,null,null,null,null,{"$f":"IFERROR(VLOOKUP(E2203,Insumos!A:C,2,FALSE),\"\")","v":""},null,null,null,0]
[null,null,null,null,null,{"$f":"IFERROR(VLOOKUP(E2204,Insumos!A:C,2,FALSE),\"\")","v":""},null,null,null,0]
[null,null,null,null,null,{"$f":"IFERROR(VLOOKUP(E2205,Insumos!A:C,2,FALSE),\"\")","v":""},null,null,null,0]
[null,null,null,null,null,{"$f":"IFERROR(VLOOKUP(E2206,Insumos!A:C,2,FALSE),\"\")","v":""},null,null,null,0]
[null,null,null,null,null,{"$f":"IFERROR(VLOOKUP(E2207,Insumos!A:C,2,FALSE),\"\")","v":""},null,null,null,0]
[null,null,null,null,null,{"$f":"IFERROR(VLOOKUP(E2208,Insumos!A:C,2,FALSE),\"\")","v":""},null,null,null,0]
[null,null,null,null,null,{"$f":"IFERROR(VLOOKUP(E2209,Insumos!A:C,2,FALSE),\"\")","v":""},null,null,null,0]
[null,null,null,null,null,{"$f":"IFERROR(VLOOKUP(E2210,Insumos!A:C,2,FALSE),\"\")","v":""},null,null,null,0]
[null,null,null,null,null,{"$f":"IFERROR(VLOOKUP(E2211,Insumos!A:C,2,FALSE),\"\")","v":""},null,null,null,0]
[null,null,null,null,null,{"$f":"IFERROR(VLOOKUP(E2212,Insumos!A:C,2,FALSE),\"\")","v":""},null,null,null,0]
[null,null,null,null,null,{"$f":"IFERROR(VLOOKUP(E2213,Insumos!A:C,2,FALSE),\"\")","v":""},null,null,null,0]
[null,null,null,null,null,{"$f":"IFERROR(VLOOKUP(E2214,Insumos!A:C,2,FALSE),\"\")","v":""},null,null,null,0]
[null,null,null,null,null,{"$f":"IFERROR(VLOOKUP(E2215,Insumos!A:C,2,FALSE),\"\")","v":""},null,null,null,0]
[null,null,null,null,null,{"$f":"IFERROR(VLOOKUP(E2216,Insumos!A:C,2,FALSE),\"\")","v":""},null,null,null,0]
[null,null,null,null,null,{"$f":"IFERROR(VLOOKUP(E2217,Insumos!A:C,2,FALSE),\"\")","v":""},null,null,null,0]
[null,null,null,null,null,{"$f":"IFERROR(VLOOKUP(E2218,Insumos!A:C,2,FALSE),\"\")","v":""},null,null,null,0]
[null,null,null,null,null,{"$f":"IFERROR(VLOOKUP(E2219,Insumos!A:C,2,FALSE),\"\")","v":""},null,null,null,0]
[null,null,null,null,null,{"$f":"IFERROR(VLOOKUP(E2220,Insumos!A:C,2,FALSE),\"\")","v":""},null,null,null,0]
[null,null,null,null,null,{"$f":"IFERROR(VLOOKUP(E2221,Insumos!A:C,2,FALSE),\"\")","v":""},null,null,null,0]
[null,null,null,null,null,{"$f":"IFERROR(VLOOKUP(E2222,Insumos!A:C,2,FALSE),\"\")","v":""},null,null,null,0]
[null,null,null,null,null,{"$f":"IFERROR(VLOOKUP(E2223,Insumos!A:C,2,FALSE),\"\")","v":""},null,null,null,0]
[null,null,null,null,null,{"$f":"IFERROR(VLOOKUP(E2224,Insumos!A:C,2,FALSE),\"\")","v":""},null,null,null,0]
[null,null,null,null,null,{"$f":"IFERROR(VLOOKUP(E2225,Insumos!A:C,2,FALSE),\"\")","v":""},null,null,null,0]
[null,null,null,null,null,{"$f":"IFERROR(VLOOKUP(E2226,Insumos!A:C,2,FALSE),\"\")","v":""},null,null,null,0]
[null,null,null,null,null,{"$f":"IFERROR(VLOOKUP(E2227,Insumos!A:C,2,FALSE),\"\")","v":""},null,null,null,0]
[null,null,null,null,null,{"$f":"IFERROR(VLOOKUP(E2228,Insumos!A:C,2,FALSE),\"\")","v":""},null,null,null,0]
[null,null,null,null,null,{"$f":"IFERROR(VLOOKUP(E2229,Insumos!A:C,2,FALSE),\"\")","v":""},null,null,null,0]
[null,null,null,null,null,{"$f":"IFERROR(VLOOKUP(E2230,Insumos!A:C,2,FALSE),\"\")","v":""},null,null,null,0]
[null,null,null,null,null,{"$f":"IFERROR(VLOOKUP(E2231,Insumos!A:C,2,FALSE),\"\")","v":""},null,null,null,0]
[null,null,null,null,null,{"$f":"IFERROR(VLOOKUP(E2232,Insumos!A:C,2,FALSE),\"\")","v":""},null,null,null,0]
[null,null,null,null,null,{"$f":"IFERROR(VLOOKUP(E2233,Insumos!A:C,2,FALSE),\"\")","v":""},null,null,null,0]
[null,null,null,null,null,{"$f":"IFERROR(VLOOKUP(E2234,Insumos!A:C,2,FALSE),\"\")","v":""},null,null,null,0]
[null,null,null,null,null,{"$f":"IFERROR(VLOOKUP(E2235,Insumos!A:C,2,FALSE),\"\")","v":""},null,null,null,0]
[null,null,null,null,null,{"$f":"IFERROR(VLOOKUP(E2236,Insumos!A:C,2,FALSE),\"\")","v":""},null,null,null,0]
[null,null,null,null,null,{"$f":"IFERROR(VLOOKUP(E2237,Insumos!A:C,2,FALSE),\"\")","v":""},null,null,null,0]
[null,null,null,null,null,{"$f":"IFERROR(VLOOKUP(E2238,Insumos!A:C,2,FALSE),\"\")","v":""},null,null,null,0]
[null,null,null,null,null,{"$f":"IFERROR(VLOOKUP(E2239,Insumos!A:C,2,FALSE),\"\")","v":""},null,null,null,0]
[null,null,null,null,null,{"$f":"IFERROR(VLOOKUP(E2240,Insumos!A:C,2,FALSE),\"\")","v":""},null,null,null,0]
[null,null,null,null,null,{"$f":"IFERROR(VLOOKUP(E2241,Insumos!A:C,2,FALSE),\"\")","v":""},null,null,null,0]
[null,null,null,null,null,{"$f":"IFERROR(VLOOKUP(E2242,Insumos!A:C,2,FALSE),\"\")","v":""},null,null,null,0]
[null,null,null,null,null,{"$f":"IFERROR(VLOOKUP(E2243,Insumos!A:C,2,FALSE),\"\")","v":""},null,null,null,0]
[null,null,null,null,null,{"$f":"IFERROR(VLOOKUP(E2244,Insumos!A:C,2,FALSE),\"\")","v":""},null,null,null,0]
[null,null,null,null,null,{"$f":"IFERROR(VLOOKUP(E2245,Insumos!A:C,2,FALSE),\"\")","v":""},null,null,null,{"$f":"IFERROR(H2245*I2245,\"\")","v":0}]
[null,null,null,null,null,{"$f":"IFERROR(VLOOKUP(E2246,Insumos!A:C,2,FALSE),\"\")","v":""},null,null,null,0]
[null,null,null,null,null,{"$f":"IFERROR(VLOOKUP(E2247,Insumos!A:C,2,FALSE),\"\")","v":""},null,null,null,0]
[null,null,null,null,null,{"$f":"IFERROR(VLOOKUP(E2248,Insumos!A:C,2,FALSE),\"\")","v":""},null,null,null,0]
[null,null,null,null,null,{"$f":"IFERROR(VLOOKUP(E2249,Insumos!A:C,2,FALSE),\"\")","v":""},null,null,null,0]
[null,null,null,null,null,{"$f":"IFERROR(VLOOKUP(E2250,Insumos!A:C,2,FALSE),\"\")","v":""},null,null,null,0]
[null,null,null,null,null,{"$f":"IFERROR(VLOOKUP(E2251,Insumos!A:C,2,FALSE),\"\")","v":""},null,null,null,0]
[null,null,null,null,null,{"$f":"IFERROR(VLOOKUP(E2252,Insumos!A:C,2,FALSE),\"\")","v":""},null,null,null,0]
[null,null,null,null,null,{"$f":"IFERROR(VLOOKUP(E2253,Insumos!A:C,2,FALSE),\"\")","v":""},null,null,null,0]
[null,null,null,null,null,{"$f":"IFERROR(VLOOKUP(E2254,Insumos!A:C,2,FALSE),\"\")","v":""},null,null,null,0]
[null,null,null,null,null,{"$f":"IFERROR(VLOOKUP(E2255,Insumos!A:C,2,FALSE),\"\")","v":""},null,null,null,0]
[null,null,null,null,null,{"$f":"IFERROR(VLOOKUP(E2256,Insumos!A:C,2,FALSE),\"\")","v":""},null,null,null,0]
[null,null,null,null,null,{"$f":"IFERROR(VLOOKUP(E2257,Insumos!A:C,2,FALSE),\"\")","v":""},null,null,null,0]
[null,null,null,null,null,{"$f":"IFERROR(VLOOKUP(E2258,Insumos!A:C,2,FALSE),\"\")","v":""},null,null,null,0]
[null,null,null,null,null,{"$f":"IFERROR(VLOOKUP(E2259,Insumos!A:C,2,FALSE),\"\")","v":""},null,null,null,0]
[null,null,null,null,null,{"$f":"IFERROR(VLOOKUP(E2260,Insumos!A:C,2,FALSE),\"\")","v":""},null,null,null,0]
[null,null,null,null,null,{"$f":"IFERROR(VLOOKUP(E2261,Insumos!A:C,2,FALSE),\"\")","v":""},null,null,null,0]
[null,null,null,null,null,{"$f":"IFERROR(VLOOKUP(E2262,Insumos!A:C,2,FALSE),\"\")","v":""},null,null,null,0]
[null,null,null,null,null,{"$f":"IFERROR(VLOOKUP(E2263,Insumos!A:C,2,FALSE),\"\")","v":""},null,null,null,0]
[null,null,null,null,null,{"$f":"IFERROR(VLOOKUP(E2264,Insumos!A:C,2,FALSE),\"\")","v":""},null,null,null,0]
[null,null,null,null,null,{"$f":"IFERROR(VLOOKUP(E2265,Insumos!A:C,2,FALSE),\"\")","v":""},null,null,null,0]
[null,null,null,null,null,{"$f":"IFERROR(VLOOKUP(E2266,Insumos!A:C,2,FALSE),\"\")","v":""},null,null,null,0]
[null,null,null,null,null,{"$f":"IFERROR(VLOOKUP(E2267,Insumos!A:C,2,FALSE),\"\")","v":""},null,null,null,0]
[null,null,null,null,null,{"$f":"IFERROR(VLOOKUP(E2268,Insumos!A:C,2,FALSE),\"\")","v":""},null,null,null,0]
[null,null,null,null,null,{"$f":"IFERROR(VLOOKUP(E2269,Insumos!A:C,2,FALSE),\"\")","v":""},null,null,null,0]
[null,null,null,null,null,{"$f":"IFERROR(VLOOKUP(E2270,Insumos!A:C,2,FALSE),\"\")","v":""},null,null,null,0]
[null,null,null,null,null,{"$f":"IFERROR(VLOOKUP(E2271,Insumos!A:C,2,FALSE),\"\")","v":""},null,null,null,0]
[null,null,null,null,null,{"$f":"IFERROR(VLOOKUP(E2272,Insumos!A:C,2,FALSE),\"\")","v":""},null,null,null,0]
[null,null,null,null,null,{"$f":"IFERROR(VLOOKUP(E2273,Insumos!A:C,2,FALSE),\"\")","v":""},null,null,null,0]
[null,null,null,null,null,{"$f":"IFERROR(VLOOKUP(E2274,Insumos!A:C,2,FALSE),\"\")","v":""},null,null,null,0]
[null,null,null,null,null,{"$f":"IFERROR(VLOOKUP(E2275,Insumos!A:C,2,FALSE),\"\")","v":""},null,null,null,0]
[null,null,null,null,null,{"$f":"IFERROR(VLOOKUP(E2276,Insumos!A:C,2,FALSE),\"\")","v":""},null,null,null,0]
[null,null,null,null,null,{"$f":"IFERROR(VLOOKUP(E2277,Insumos!A:C,2,FALSE),\"\")","v":""},null,null,null,0]
[null,null,null,null,null,{"$f":"IFERROR(VLOOKUP(E2278,Insumos!A:C,2,FALSE),\"\")","v":""},null,null,null,0]
[null,null,null,null,null,{"$f":"IFERROR(VLOOKUP(E2279,Insumos!A:C,2,FALSE),\"\")","v":""},null,null,null,0]
[null,null,null,null,null,{"$f":"IFERROR(VLOOKUP(E2280,Insumos!A:C,2,FALSE),\"\")","v":""},null,null,null,0]
[null,null,null,null,null,{"$f":"IFERROR(VLOOKUP(E2281,Insumos!A:C,2,FALSE),\"\")","v":""},null,null,null,0]
[null,null,null,null,null,{"$f":"IFERROR(VLOOKUP(E2282,Insumos!A:C,2,FALSE),\"\")","v":""},null,null,null,0]
[null,null,null,null,null,{"$f":"IFERROR(VLOOKUP(E2283,Insumos!A:C,2,FALSE),\"\")","v":""},null,null,null,0]
[null,null,null,null,null,{"$f":"IFERROR(VLOOKUP(E2284,Insumos!A:C,2,FALSE),\"\")","v":""},null,null,null,0]
[null,null,null,null,null,{"$f":"IFERROR(VLOOKUP(E2285,Insumos!A:C,2,FALSE),\"\")","v":""},null,null,null,0]
[null,null,null,null,null,{"$f":"IFERROR(VLOOKUP(E2286,Insumos!A:C,2,FALSE),\"\")","v":""},null,null,null,0]
[null,null,null,null,null,{"$f":"IFERROR(VLOOKUP(E2287,Insumos!A:C,2,FALSE),\"\")","v":""},null,null,null,0]
[null,null,null,null,null,{"$f":"IFERROR(VLOOKUP(E2288,Insumos!A:C,2,FALSE),\"\")","v":""},null,null,null,0]
[null,null,null,null,null,{"$f":"IFERROR(VLOOKUP(E2289,Insumos!A:C,2,FALSE),\"\")","v":""},null,null,null,0]
[null,null,null,null,null,{"$f":"IFERROR(VLOOKUP(E2290,Insumos!A:C,2,FALSE),\"\")","v":""},null,null,null,0]
[null,null,null,null,null,{"$f":"IFERROR(VLOOKUP(E2291,Insumos!A:C,2,FALSE),\"\")","v":""},null,null,null,0]
[null,null,null,null,null,{"$f":"IFERROR(VLOOKUP(E2292,Insumos!A:C,2,FALSE),\"\")","v":""},null,null,null,0]
[null,null,null,null,null,{"$f":"IFERROR(VLOOKUP(E2293,Insumos!A:C,2,FALSE),\"\")","v":""},null,null,null,0]
[null,null,null,null,null,{"$f":"IFERROR(VLOOKUP(E2294,Insumos!A:C,2,FALSE),\"\")","v":""},null,null,null,0]
[null,null,null,null,null,{"$f":"IFERROR(VLOOKUP(E2295,Insumos!A:C,2,FALSE),\"\")","v":""},null,null,null,0]
[null,null,null,null,null,{"$f":"IFERROR(VLOOKUP(E2296,Insumos!A:C,2,FALSE),\"\")","v":""},null,null,null,0]
[null,null,null,null,null,{"$f":"IFERROR(VLOOKUP(E2297,Insumos!A:C,2,FALSE),\"\")","v":""},null,null,null,0]
[null,null,null,null,null,{"$f":"IFERROR(VLOOKUP(E2298,Insumos!A:C,2,FALSE),\"\")","v":""},null,null,null,0]
[null,null,null,null,null,{"$f":"IFERROR(VLOOKUP(E2299,Insumos!A:C,2,FALSE),\"\")","v":""},null,null,null,0]
[null,null,null,null,null,{"$f":"IFERROR(VLOOKUP(E2300,Insumos!A:C,2,FALSE),\"\")","v":""},null,null,null,0]
[null,null,null,null,null,{"$f":"IFERROR(VLOOKUP(E2301,Insumos!A:C,2,FALSE),\"\")","v":""},null,null,null,0]
[null,null,null,null,null,{"$f":"IFERROR(VLOOKUP(E2302,Insumos!A:C,2,FALSE),\"\")","v":""},null,null,null,0]
[null,null,null,null,null,{"$f":"IFERROR(VLOOKUP(E2303,Insumos!A:C,2,FALSE),\"\")","v":""},null,null,null,0]
[null,null,null,null,null,{"$f":"IFERROR(VLOOKUP(E2304,Insumos!A:C,2,FALSE),\"\")","v":""},null,null,null,0]
[null,null,null,null,null,{"$f":"IFERROR(VLOOKUP(E2305,Insumos!A:C,2,FALSE),\"\")","v":""},null,null,null,0]
[null,null,null,null,null,{"$f":"IFERROR(VLOOKUP(E2306,Insumos!A:C,2,FALSE),\"\")","v":""},null,null,null,0]
[null,null,null,null,null,{"$f":"IFERROR(VLOOKUP(E2307,Insumos!A:C,2,FALSE),\"\")","v":""},null,null,null,0]
[null,null,null,null,null,{"$f":"IFERROR(VLOOKUP(E2308,Insumos!A:C,2,FALSE),\"\")","v":""},null,null,null,0]
[null,null,null,null,null,{"$f":"IFERROR(VLOOKUP(E2309,Insumos!A:C,2,FALSE),\"\")","v":""},null,null,null,{"$f":"IFERROR(H2309*I2309,\"\")","v":0}]
[null,null,null,null,null,{"$f":"IFERROR(VLOOKUP(E2310,Insumos!A:C,2,FALSE),\"\")","v":""},null,null,null,0]
[null,null,null,null,null,{"$f":"IFERROR(VLOOKUP(E2311,Insumos!A:C,2,FALSE),\"\")","v":""},null,null,null,0]
[null,null,null,null,null,{"$f":"IFERROR(VLOOKUP(E2312,Insumos!A:C,2,FALSE),\"\")","v":""},null,null,null,0]
[null,null,null,null,null,{"$f":"IFERROR(VLOOKUP(E2313,Insumos!A:C,2,FALSE),\"\")","v":""},null,null,null,0]
[null,null,null,null,null,{"$f":"IFERROR(VLOOKUP(E2314,Insumos!A:C,2,FALSE),\"\")","v":""},null,null,null,0]
[null,null,null,null,null,{"$f":"IFERROR(VLOOKUP(E2315,Insumos!A:C,2,FALSE),\"\")","v":""},null,null,null,0]
[null,null,null,null,null,{"$f":"IFERROR(VLOOKUP(E2316,Insumos!A:C,2,FALSE),\"\")","v":""},null,null,null,0]
[null,null,null,null,null,{"$f":"IFERROR(VLOOKUP(E2317,Insumos!A:C,2,FALSE),\"\")","v":""},null,null,null,0]
[null,null,null,null,null,{"$f":"IFERROR(VLOOKUP(E2318,Insumos!A:C,2,FALSE),\"\")","v":""},null,null,null,0]
[null,null,null,null,null,{"$f":"IFERROR(VLOOKUP(E2319,Insumos!A:C,2,FALSE),\"\")","v":""},null,null,null,0]
[null,null,null,null,null,{"$f":"IFERROR(VLOOKUP(E2320,Insumos!A:C,2,FALSE),\"\")","v":""},null,null,null,0]
[null,null,null,null,null,{"$f":"IFERROR(VLOOKUP(E2321,Insumos!A:C,2,FALSE),\"\")","v":""},null,null,null,0]
[null,null,null,null,null,{"$f":"IFERROR(VLOOKUP(E2322,Insumos!A:C,2,FALSE),\"\")","v":""},null,null,null,0]
[null,null,null,null,null,{"$f":"IFERROR(VLOOKUP(E2323,Insumos!A:C,2,FALSE),\"\")","v":""},null,null,null,0]
[null,null,null,null,null,{"$f":"IFERROR(VLOOKUP(E2324,Insumos!A:C,2,FALSE),\"\")","v":""},null,null,null,0]
[null,null,null,null,null,{"$f":"IFERROR(VLOOKUP(E2325,Insumos!A:C,2,FALSE),\"\")","v":""},null,null,null,0]
[null,null,null,null,null,{"$f":"IFERROR(VLOOKUP(E2326,Insumos!A:C,2,FALSE),\"\")","v":""},null,null,null,0]
[null,null,null,null,null,{"$f":"IFERROR(VLOOKUP(E2327,Insumos!A:C,2,FALSE),\"\")","v":""},null,null,null,0]
[null,null,null,null,null,{"$f":"IFERROR(VLOOKUP(E2328,Insumos!A:C,2,FALSE),\"\")","v":""},null,null,null,0]
[null,null,null,null,null,{"$f":"IFERROR(VLOOKUP(E2329,Insumos!A:C,2,FALSE),\"\")","v":""},null,null,null,0]
[null,null,null,null,null,{"$f":"IFERROR(VLOOKUP(E2330,Insumos!A:C,2,FALSE),\"\")","v":""},null,null,null,0]
[null,null,null,null,null,{"$f":"IFERROR(VLOOKUP(E2331,Insumos!A:C,2,FALSE),\"\")","v":""},null,null,null,0]
[null,null,null,null,null,{"$f":"IFERROR(VLOOKUP(E2332,Insumos!A:C,2,FALSE),\"\")","v":""},null,null,null,0]
[null,null,null,null,null,{"$f":"IFERROR(VLOOKUP(E2333,Insumos!A:C,2,FALSE),\"\")","v":""},null,null,null,0]
[null,null,null,null,null,{"$f":"IFERROR(VLOOKUP(E2334,Insumos!A:C,2,FALSE),\"\")","v":""},null,null,null,0]
[null,null,null,null,null,{"$f":"IFERROR(VLOOKUP(E2335,Insumos!A:C,2,FALSE),\"\")","v":""},null,null,null,0]
[null,null,null,null,null,{"$f":"IFERROR(VLOOKUP(E2336,Insumos!A:C,2,FALSE),\"\")","v":""},null,null,null,0]
[null,null,null,null,null,{"$f":"IFERROR(VLOOKUP(E2337,Insumos!A:C,2,FALSE),\"\")","v":""},null,null,null,0]
[null,null,null,null,null,{"$f":"IFERROR(VLOOKUP(E2338,Insumos!A:C,2,FALSE),\"\")","v":""},null,null,null,0]
[null,null,null,null,null,{"$f":"IFERROR(VLOOKUP(E2339,Insumos!A:C,2,FALSE),\"\")","v":""},null,null,null,0]
[null,null,null,null,null,{"$f":"IFERROR(VLOOKUP(E2340,Insumos!A:C,2,FALSE),\"\")","v":""},null,null,null,0]
[null,null,null,null,null,{"$f":"IFERROR(VLOOKUP(E2341,Insumos!A:C,2,FALSE),\"\")","v":""},null,null,null,0]
[null,null,null,null,null,{"$f":"IFERROR(VLOOKUP(E2342,Insumos!A:C,2,FALSE),\"\")","v":""},null,null,null,0]
[null,null,null,null,null,{"$f":"IFERROR(VLOOKUP(E2343,Insumos!A:C,2,FALSE),\"\")","v":""},null,null,null,0]
[null,null,null,null,null,{"$f":"IFERROR(VLOOKUP(E2344,Insumos!A:C,2,FALSE),\"\")","v":""},null,null,null,0]
[null,null,null,null,null,{"$f":"IFERROR(VLOOKUP(E2345,Insumos!A:C,2,FALSE),\"\")","v":""},null,null,null,0]
[null,null,null,null,null,{"$f":"IFERROR(VLOOKUP(E2346,Insumos!A:C,2,FALSE),\"\")","v":""},null,null,null,0]
[null,null,null,null,null,{"$f":"IFERROR(VLOOKUP(E2347,Insumos!A:C,2,FALSE),\"\")","v":""},null,null,null,0]
[null,null,null,null,null,{"$f":"IFERROR(VLOOKUP(E2348,Insumos!A:C,2,FALSE),\"\")","v":""},null,null,null,0]
[null,null,null,null,null,{"$f":"IFERROR(VLOOKUP(E2349,Insumos!A:C,2,FALSE),\"\")","v":""},null,null,null,0]
[null,null,null,null,null,{"$f":"IFERROR(VLOOKUP(E2350,Insumos!A:C,2,FALSE),\"\")","v":""},null,null,null,0]
[null,null,null,null,null,{"$f":"IFERROR(VLOOKUP(E2351,Insumos!A:C,2,FALSE),\"\")","v":""},null,null,null,0]
[null,null,null,null,null,{"$f":"IFERROR(VLOOKUP(E2352,Insumos!A:C,2,FALSE),\"\")","v":""},null,null,null,0]
[null,null,null,null,null,{"$f":"IFERROR(VLOOKUP(E2353,Insumos!A:C,2,FALSE),\"\")","v":""},null,null,null,0]
[null,null,null,null,null,{"$f":"IFERROR(VLOOKUP(E2354,Insumos!A:C,2,FALSE),\"\")","v":""},null,null,null,0]
[null,null,null,null,null,{"$f":"IFERROR(VLOOKUP(E2355,Insumos!A:C,2,FALSE),\"\")","v":""},null,null,null,0]
[null,null,null,null,null,{"$f":"IFERROR(VLOOKUP(E2356,Insumos!A:C,2,FALSE),\"\")","v":""},null,null,null,0]
[null,null,null,null,null,{"$f":"IFERROR(VLOOKUP(E2357,Insumos!A:C,2,FALSE),\"\")","v":""},null,null,null,0]
[null,null,null,null,null,{"$f":"IFERROR(VLOOKUP(E2358,Insumos!A:C,2,FALSE),\"\")","v":""},null,null,null,0]
[null,null,null,null,null,{"$f":"IFERROR(VLOOKUP(E2359,Insumos!A:C,2,FALSE),\"\")","v":""},null,null,null,0]
[null,null,null,null,null,{"$f":"IFERROR(VLOOKUP(E2360,Insumos!A:C,2,FALSE),\"\")","v":""},null,null,null,0]
[null,null,null,null,null,{"$f":"IFERROR(VLOOKUP(E2361,Insumos!A:C,2,FALSE),\"\")","v":""},null,null,null,0]
[null,null,null,null,null,{"$f":"IFERROR(VLOOKUP(E2362,Insumos!A:C,2,FALSE),\"\")","v":""},null,null,null,0]
[null,null,null,null,null,{"$f":"IFERROR(VLOOKUP(E2363,Insumos!A:C,2,FALSE),\"\")","v":""},null,null,null,0]
[null,null,null,null,null,{"$f":"IFERROR(VLOOKUP(E2364,Insumos!A:C,2,FALSE),\"\")","v":""},null,null,null,0]
[null,null,null,null,null,{"$f":"IFERROR(VLOOKUP(E2365,Insumos!A:C,2,FALSE),\"\")","v":""},null,null,null,0]
[null,null,null,null,null,{"$f":"IFERROR(VLOOKUP(E2366,Insumos!A:C,2,FALSE),\"\")","v":""},null,null,null,0]
[null,null,null,null,null,{"$f":"IFERROR(VLOOKUP(E2367,Insumos!A:C,2,FALSE),\"\")","v":""},null,null,null,0]
[null,null,null,null,null,{"$f":"IFERROR(VLOOKUP(E2368,Insumos!A:C,2,FALSE),\"\")","v":""},null,null,null,0]
[null,null,null,null,null,{"$f":"IFERROR(VLOOKUP(E2369,Insumos!A:C,2,FALSE),\"\")","v":""},null,null,null,0]
[null,null,null,null,null,{"$f":"IFERROR(VLOOKUP(E2370,Insumos!A:C,2,FALSE),\"\")","v":""},null,null,null,0]
[null,null,null,null,null,{"$f":"IFERROR(VLOOKUP(E2371,Insumos!A:C,2,FALSE),\"\")","v":""},null,null,null,0]
[null,null,null,null,null,{"$f":"IFERROR(VLOOKUP(E2372,Insumos!A:C,2,FALSE),\"\")","v":""},null,null,null,0]
[null,null,null,null,null,{"$f":"IFERROR(VLOOKUP(E2373,Insumos!A:C,2,FALSE),\"\")","v":""},null,null,null,{"$f":"IFERROR(H2373*I2373,\"\")","v":0}]
[null,null,null,null,null,{"$f":"IFERROR(VLOOKUP(E2374,Insumos!A:C,2,FALSE),\"\")","v":""},null,null,null,0]
[null,null,null,null,null,{"$f":"IFERROR(VLOOKUP(E2375,Insumos!A:C,2,FALSE),\"\")","v":""},null,null,null,0]
[null,null,null,null,null,{"$f":"IFERROR(VLOOKUP(E2376,Insumos!A:C,2,FALSE),\"\")","v":""},null,null,null,0]
[null,null,null,null,null,{"$f":"IFERROR(VLOOKUP(E2377,Insumos!A:C,2,FALSE),\"\")","v":""},null,null,null,0]
[null,null,null,null,null,{"$f":"IFERROR(VLOOKUP(E2378,Insumos!A:C,2,FALSE),\"\")","v":""},null,null,null,0]
[null,null,null,null,null,{"$f":"IFERROR(VLOOKUP(E2379,Insumos!A:C,2,FALSE),\"\")","v":""},null,null,null,0]
[null,null,null,null,null,{"$f":"IFERROR(VLOOKUP(E2380,Insumos!A:C,2,FALSE),\"\")","v":""},null,null,null,0]
[null,null,null,null,null,{"$f":"IFERROR(VLOOKUP(E2381,Insumos!A:C,2,FALSE),\"\")","v":""},null,null,null,0]
[null,null,null,null,null,{"$f":"IFERROR(VLOOKUP(E2382,Insumos!A:C,2,FALSE),\"\")","v":""},null,null,null,0]
[null,null,null,null,null,{"$f":"IFERROR(VLOOKUP(E2383,Insumos!A:C,2,FALSE),\"\")","v":""},null,null,null,0]
[null,null,null,null,null,{"$f":"IFERROR(VLOOKUP(E2384,Insumos!A:C,2,FALSE),\"\")","v":""},null,null,null,0]
[null,null,null,null,null,{"$f":"IFERROR(VLOOKUP(E2385,Insumos!A:C,2,FALSE),\"\")","v":""},null,null,null,0]
[null,null,null,null,null,{"$f":"IFERROR(VLOOKUP(E2386,Insumos!A:C,2,FALSE),\"\")","v":""},null,null,null,0]
[null,null,null,null,null,{"$f":"IFERROR(VLOOKUP(E2387,Insumos!A:C,2,FALSE),\"\")","v":""},null,null,null,0]
[null,null,null,null,null,{"$f":"IFERROR(VLOOKUP(E2388,Insumos!A:C,2,FALSE),\"\")","v":""},null,null,null,0]
[null,null,null,null,null,{"$f":"IFERROR(VLOOKUP(E2389,Insumos!A:C,2,FALSE),\"\")","v":""},null,null,null,0]
[null,null,null,null,null,{"$f":"IFERROR(VLOOKUP(E2390,Insumos!A:C,2,FALSE),\"\")","v":""},null,null,null,0]
[null,null,null,null,null,{"$f":"IFERROR(VLOOKUP(E2391,Insumos!A:C,2,FALSE),\"\")","v":""},null,null,null,0]
[null,null,null,null,null,{"$f":"IFERROR(VLOOKUP(E2392,Insumos!A:C,2,FALSE),\"\")","v":""},null,null,null,0]
[null,null,null,null,null,{"$f":"IFERROR(VLOOKUP(E2393,Insumos!A:C,2,FALSE),\"\")","v":""},null,null,null,0]
[null,null,null,null,null,{"$f":"IFERROR(VLOOKUP(E2394,Insumos!A:C,2,FALSE),\"\")","v":""},null,null,null,0]
[null,null,null,null,null,{"$f":"IFERROR(VLOOKUP(E2395,Insumos!A:C,2,FALSE),\"\")","v":""},null,null,null,0]
[null,null,null,null,null,{"$f":"IFERROR(VLOOKUP(E2396,Insumos!A:C,2,FALSE),\"\")","v":""},null,null,null,0]
[null,null,null,null,null,{"$f":"IFERROR(VLOOKUP(E2397,Insumos!A:C,2,FALSE),\"\")","v":""},null,null,null,0]
[null,null,null,null,null,{"$f":"IFERROR(VLOOKUP(E2398,Insumos!A:C,2,FALSE),\"\")","v":""},null,null,null,0]
[null,null,null,null,null,{"$f":"IFERROR(VLOOKUP(E2399,Insumos!A:C,2,FALSE),\"\")","v":""},null,null,null,0]
[null,null,null,null,null,{"$f":"IFERROR(VLOOKUP(E2400,Insumos!A:C,2,FALSE),\"\")","v":""},null,null,null,0]
[null,null,null,null,null,{"$f":"IFERROR(VLOOKUP(E2401,Insumos!A:C,2,FALSE),\"\")","v":""},null,null,null,0]
[null,null,null,null,null,{"$f":"IFERROR(VLOOKUP(E2402,Insumos!A:C,2,FALSE),\"\")","v":""},null,null,null,0]
[null,null,null,null,null,{"$f":"IFERROR(VLOOKUP(E2403,Insumos!A:C,2,FALSE),\"\")","v":""},null,null,null,0]
[null,null,null,null,null,{"$f":"IFERROR(VLOOKUP(E2404,Insumos!A:C,2,FALSE),\"\")","v":""},null,null,null,0]
[null,null,null,null,null,{"$f":"IFERROR(VLOOKUP(E2405,Insumos!A:C,2,FALSE),\"\")","v":""},null,null,null,0]
[null,null,null,null,null,{"$f":"IFERROR(VLOOKUP(E2406,Insumos!A:C,2,FALSE),\"\")","v":""},null,null,null,0]
[null,null,null,null,null,{"$f":"IFERROR(VLOOKUP(E2407,Insumos!A:C,2,FALSE),\"\")","v":""},null,null,null,0]
[null,null,null,null,null,{"$f":"IFERROR(VLOOKUP(E2408,Insumos!A:C,2,FALSE),\"\")","v":""},null,null,null,0]
[null,null,null,null,null,{"$f":"IFERROR(VLOOKUP(E2409,Insumos!A:C,2,FALSE),\"\")","v":""},null,null,null,0]
[null,null,null,null,null,{"$f":"IFERROR(VLOOKUP(E2410,Insumos!A:C,2,FALSE),\"\")","v":""},null,null,null,0]
[null,null,null,null,null,{"$f":"IFERROR(VLOOKUP(E2411,Insumos!A:C,2,FALSE),\"\")","v":""},null,null,null,0]
[null,null,null,null,null,{"$f":"IFERROR(VLOOKUP(E2412,Insumos!A:C,2,FALSE),\"\")","v":""},null,null,null,0]
[null,null,null,null,null,{"$f":"IFERROR(VLOOKUP(E2413,Insumos!A:C,2,FALSE),\"\")","v":""},null,null,null,0]
[null,null,null,null,null,{"$f":"IFERROR(VLOOKUP(E2414,Insumos!A:C,2,FALSE),\"\")","v":""},null,null,null,0]
[null,null,null,null,null,{"$f":"IFERROR(VLOOKUP(E2415,Insumos!A:C,2,FALSE),\"\")","v":""},null,null,null,0]
[null,null,null,null,null,{"$f":"IFERROR(VLOOKUP(E2416,Insumos!A:C,2,FALSE),\"\")","v":""},null,null,null,0]
[null,null,null,null,null,{"$f":"IFERROR(VLOOKUP(E2417,Insumos!A:C,2,FALSE),\"\")","v":""},null,null,null,0]
[null,null,null,null,null,{"$f":"IFERROR(VLOOKUP(E2418,Insumos!A:C,2,FALSE),\"\")","v":""},null,null,null,0]
[null,null,null,null,null,{"$f":"IFERROR(VLOOKUP(E2419,Insumos!A:C,2,FALSE),\"\")","v":""},null,null,null,0]
[null,null,null,null,null,{"$f":"IFERROR(VLOOKUP(E2420,Insumos!A:C,2,FALSE),\"\")","v":""},null,null,null,0]
[null,null,null,null,null,{"$f":"IFERROR(VLOOKUP(E2421,Insumos!A:C,2,FALSE),\"\")","v":""},null,null,null,0]
[null,null,null,null,null,{"$f":"IFERROR(VLOOKUP(E2422,Insumos!A:C,2,FALSE),\"\")","v":""},null,null,null,0]
[null,null,null,null,null,{"$f":"IFERROR(VLOOKUP(E2423,Insumos!A:C,2,FALSE),\"\")","v":""},null,null,null,0]
[null,null,null,null,null,{"$f":"IFERROR(VLOOKUP(E2424,Insumos!A:C,2,FALSE),\"\")","v":""},null,null,null,0]
[null,null,null,null,null,{"$f":"IFERROR(VLOOKUP(E2425,Insumos!A:C,2,FALSE),\"\")","v":""},null,null,null,0]
[null,null,null,null,null,{"$f":"IFERROR(VLOOKUP(E2426,Insumos!A:C,2,FALSE),\"\")","v":""},null,null,null,0]
[null,null,null,null,null,{"$f":"IFERROR(VLOOKUP(E2427,Insumos!A:C,2,FALSE),\"\")","v":""},null,null,null,0]
[null,null,null,null,null,{"$f":"IFERROR(VLOOKUP(E2428,Insumos!A:C,2,FALSE),\"\")","v":""},null,null,null,0]
[null,null,null,null,null,{"$f":"IFERROR(VLOOKUP(E2429,Insumos!A:C,2,FALSE),\"\")","v":""},null,null,null,0]
[null,null,null,null,null,{"$f":"IFERROR(VLOOKUP(E2430,Insumos!A:C,2,FALSE),\"\")","v":""},null,null,null,0]
[null,null,null,null,null,{"$f":"IFERROR(VLOOKUP(E2431,Insumos!A:C,2,FALSE),\"\")","v":""},null,null,null,0]
[null,null,null,null,null,{"$f":"IFERROR(VLOOKUP(E2432,Insumos!A:C,2,FALSE),\"\")","v":""},null,null,null,0]
[null,null,null,null,null,{"$f":"IFERROR(VLOOKUP(E2433,Insumos!A:C,2,FALSE),\"\")","v":""},null,null,null,0]
[null,null,null,null,null,{"$f":"IFERROR(VLOOKUP(E2434,Insumos!A:C,2,FALSE),\"\")","v":""},null,null,null,0]
[null,null,null,null,null,{"$f":"IFERROR(VLOOKUP(E2435,Insumos!A:C,2,FALSE),\"\")","v":""},null,null,null,0]
[null,null,null,null,null,{"$f":"IFERROR(VLOOKUP(E2436,Insumos!A:C,2,FALSE),\"\")","v":""},null,null,null,0]
[null,null,null,null,null,{"$f":"IFERROR(VLOOKUP(E2437,Insumos!A:C,2,FALSE),\"\")","v":""},null,null,null,{"$f":"IFERROR(H2437*I2437,\"\")","v":0}]
[null,null,null,null,null,{"$f":"IFERROR(VLOOKUP(E2438,Insumos!A:C,2,FALSE),\"\")","v":""},null,null,null,0]
[null,null,null,null,null,{"$f":"IFERROR(VLOOKUP(E2439,Insumos!A:C,2,FALSE),\"\")","v":""},null,null,null,0]
[null,null,null,null,null,{"$f":"IFERROR(VLOOKUP(E2440,Insumos!A:C,2,FALSE),\"\")","v":""},null,null,null,0]
[null,null,null,null,null,{"$f":"IFERROR(VLOOKUP(E2441,Insumos!A:C,2,FALSE),\"\")","v":""},null,null,null,0]
[null,null,null,null,null,{"$f":"IFERROR(VLOOKUP(E2442,Insumos!A:C,2,FALSE),\"\")","v":""},null,null,null,0]
[null,null,null,null,null,{"$f":"IFERROR(VLOOKUP(E2443,Insumos!A:C,2,FALSE),\"\")","v":""},null,null,null,0]
[null,null,null,null,null,{"$f":"IFERROR(VLOOKUP(E2444,Insumos!A:C,2,FALSE),\"\")","v":""},null,null,null,0]
[null,null,null,null,null,{"$f":"IFERROR(VLOOKUP(E2445,Insumos!A:C,2,FALSE),\"\")","v":""},null,null,null,0]
[null,null,null,null,null,{"$f":"IFERROR(VLOOKUP(E2446,Insumos!A:C,2,FALSE),\"\")","v":""},null,null,null,0]
[null,null,null,null,null,{"$f":"IFERROR(VLOOKUP(E2447,Insumos!A:C,2,FALSE),\"\")","v":""},null,null,null,0]
[null,null,null,null,null,{"$f":"IFERROR(VLOOKUP(E2448,Insumos!A:C,2,FALSE),\"\")","v":""},null,null,null,0]
[null,null,null,null,null,{"$f":"IFERROR(VLOOKUP(E2449,Insumos!A:C,2,FALSE),\"\")","v":""},null,null,null,0]
[null,null,null,null,null,{"$f":"IFERROR(VLOOKUP(E2450,Insumos!A:C,2,FALSE),\"\")","v":""},null,null,null,0]
[null,null,null,null,null,{"$f":"IFERROR(VLOOKUP(E2451,Insumos!A:C,2,FALSE),\"\")","v":""},null,null,null,0]
[null,null,null,null,null,{"$f":"IFERROR(VLOOKUP(E2452,Insumos!A:C,2,FALSE),\"\")","v":""},null,null,null,0]
[null,null,null,null,null,{"$f":"IFERROR(VLOOKUP(E2453,Insumos!A:C,2,FALSE),\"\")","v":""},null,null,null,0]
[null,null,null,null,null,{"$f":"IFERROR(VLOOKUP(E2454,Insumos!A:C,2,FALSE),\"\")","v":""},null,null,null,0]
[null,null,null,null,null,{"$f":"IFERROR(VLOOKUP(E2455,Insumos!A:C,2,FALSE),\"\")","v":""},null,null,null,0]
[null,null,null,null,null,{"$f":"IFERROR(VLOOKUP(E2456,Insumos!A:C,2,FALSE),\"\")","v":""},null,null,null,0]
[null,null,null,null,null,{"$f":"IFERROR(VLOOKUP(E2457,Insumos!A:C,2,FALSE),\"\")","v":""},null,null,null,0]
[null,null,null,null,null,{"$f":"IFERROR(VLOOKUP(E2458,Insumos!A:C,2,FALSE),\"\")","v":""},null,null,null,0]
[null,null,null,null,null,{"$f":"IFERROR(VLOOKUP(E2459,Insumos!A:C,2,FALSE),\"\")","v":""},null,null,null,0]
[null,null,null,null,null,{"$f":"IFERROR(VLOOKUP(E2460,Insumos!A:C,2,FALSE),\"\")","v":""},null,null,null,0]
[null,null,null,null,null,{"$f":"IFERROR(VLOOKUP(E2461,Insumos!A:C,2,FALSE),\"\")","v":""},null,null,null,0]
[null,null,null,null,null,{"$f":"IFERROR(VLOOKUP(E2462,Insumos!A:C,2,FALSE),\"\")","v":""},null,null,null,0]
[null,null,null,null,null,{"$f":"IFERROR(VLOOKUP(E2463,Insumos!A:C,2,FALSE),\"\")","v":""},null,null,null,0]
[null,null,null,null,null,{"$f":"IFERROR(VLOOKUP(E2464,Insumos!A:C,2,FALSE),\"\")","v":""},null,null,null,0]
[null,null,null,null,null,{"$f":"IFERROR(VLOOKUP(E2465,Insumos!A:C,2,FALSE),\"\")","v":""},null,null,null,0]
[null,null,null,null,null,{"$f":"IFERROR(VLOOKUP(E2466,Insumos!A:C,2,FALSE),\"\")","v":""},null,null,null,0]
[null,null,null,null,null,{"$f":"IFERROR(VLOOKUP(E2467,Insumos!A:C,2,FALSE),\"\")","v":""},null,null,null,0]
[null,null,null,null,null,{"$f":"IFERROR(VLOOKUP(E2468,Insumos!A:C,2,FALSE),\"\")","v":""},null,null,null,0]
[null,null,null,null,null,{"$f":"IFERROR(VLOOKUP(E2469,Insumos!A:C,2,FALSE),\"\")","v":""},null,null,null,0]
[null,null,null,null,null,{"$f":"IFERROR(VLOOKUP(E2470,Insumos!A:C,2,FALSE),\"\")","v":""},null,null,null,0]
[null,null,null,null,null,{"$f":"IFERROR(VLOOKUP(E2471,Insumos!A:C,2,FALSE),\"\")","v":""},null,null,null,0]
[null,null,null,null,null,{"$f":"IFERROR(VLOOKUP(E2472,Insumos!A:C,2,FALSE),\"\")","v":""},null,null,null,0]
[null,null,null,null,null,{"$f":"IFERROR(VLOOKUP(E2473,Insumos!A:C,2,FALSE),\"\")","v":""},null,null,null,0]
[null,null,null,null,null,{"$f":"IFERROR(VLOOKUP(E2474,Insumos!A:C,2,FALSE),\"\")","v":""},null,null,null,0]
[null,null,null,null,null,{"$f":"IFERROR(VLOOKUP(E2475,Insumos!A:C,2,FALSE),\"\")","v":""},null,null,null,0]
[null,null,null,null,null,{"$f":"IFERROR(VLOOKUP(E2476,Insumos!A:C,2,FALSE),\"\")","v":""},null,null,null,0]
[null,null,null,null,null,{"$f":"IFERROR(VLOOKUP(E2477,Insumos!A:C,2,FALSE),\"\")","v":""},null,null,null,0]
[null,null,null,null,null,{"$f":"IFERROR(VLOOKUP(E2478,Insumos!A:C,2,FALSE),\"\")","v":""},null,null,null,0]
[null,null,null,null,null,{"$f":"IFERROR(VLOOKUP(E2479,Insumos!A:C,2,FALSE),\"\")","v":""},null,null,null,0]
[null,null,null,null,null,{"$f":"IFERROR(VLOOKUP(E2480,Insumos!A:C,2,FALSE),\"\")","v":""},null,null,null,0]
[null,null,null,null,null,{"$f":"IFERROR(VLOOKUP(E2481,Insumos!A:C,2,FALSE),\"\")","v":""},null,null,null,0]
[null,null,null,null,null,{"$f":"IFERROR(VLOOKUP(E2482,Insumos!A:C,2,FALSE),\"\")","v":""},null,null,null,0]
[null,null,null,null,null,{"$f":"IFERROR(VLOOKUP(E2483,Insumos!A:C,2,FALSE),\"\")","v":""},null,null,null,0]
[null,null,null,null,null,{"$f":"IFERROR(VLOOKUP(E2484,Insumos!A:C,2,FALSE),\"\")","v":""},null,null,null,0]
[null,null,null,null,null,{"$f":"IFERROR(VLOOKUP(E2485,Insumos!A:C,2,FALSE),\"\")","v":""},null,null,null,0]
[null,null,null,null,null,{"$f":"IFERROR(VLOOKUP(E2486,Insumos!A:C,2,FALSE),\"\")","v":""},null,null,null,0]
[null,null,null,null,null,{"$f":"IFERROR(VLOOKUP(E2487,Insumos!A:C,2,FALSE),\"\")","v":""},null,null,null,0]
[null,null,null,null,null,{"$f":"IFERROR(VLOOKUP(E2488,Insumos!A:C,2,FALSE),\"\")","v":""},null,null,null,0]
[null,null,null,null,null,{"$f":"IFERROR(VLOOKUP(E2489,Insumos!A:C,2,FALSE),\"\")","v":""},null,null,null,0]
[null,null,null,null,null,{"$f":"IFERROR(VLOOKUP(E2490,Insumos!A:C,2,FALSE),\"\")","v":""},null,null,null,0]
[null,null,null,null,null,{"$f":"IFERROR(VLOOKUP(E2491,Insumos!A:C,2,FALSE),\"\")","v":""},null,null,null,0]
[null,null,null,null,null,{"$f":"IFERROR(VLOOKUP(E2492,Insumos!A:C,2,FALSE),\"\")","v":""},null,null,null,0]
[null,null,null,null,null,{"$f":"IFERROR(VLOOKUP(E2493,Insumos!A:C,2,FALSE),\"\")","v":""},null,null,null,0]
[null,null,null,null,null,{"$f":"IFERROR(VLOOKUP(E2494,Insumos!A:C,2,FALSE),\"\")","v":""},null,null,null,0]
[null,null,null,null,null,{"$f":"IFERROR(VLOOKUP(E2495,Insumos!A:C,2,FALSE),\"\")","v":""},null,null,null,0]
[null,null,null,null,null,{"$f":"IFERROR(VLOOKUP(E2496,Insumos!A:C,2,FALSE),\"\")","v":""},null,null,null,0]
[null,null,null,null,null,{"$f":"IFERROR(VLOOKUP(E2497,Insumos!A:C,2,FALSE),\"\")","v":""},null,null,null,0]
[null,null,null,null,null,{"$f":"IFERROR(VLOOKUP(E2498,Insumos!A:C,2,FALSE),\"\")","v":""},null,null,null,0]
[null,null,null,null,null,{"$f":"IFERROR(VLOOKUP(E2499,Insumos!A:C,2,FALSE),\"\")","v":""},null,null,null,0]
[null,null,null,null,null,{"$f":"IFERROR(VLOOKUP(E2500,Insumos!A:C,2,FALSE),\"\")","v":""},null,null,null,0]
[null,null,null,null,null,{"$f":"IFERROR(VLOOKUP(E2501,Insumos!A:C,2,FALSE),\"\")","v":""},null,null,null,{"$f":"IFERROR(H2501*I2501,\"\")","v":0}]
[null,null,null,null,null,{"$f":"IFERROR(VLOOKUP(E2502,Insumos!A:C,2,FALSE),\"\")","v":""},null,null,null,{"$f":"IFERROR(H2502*I2502,\"\")","v":0}]
[null,null,null,null,null,{"$f":"IFERROR(VLOOKUP(E2503,Insumos!A:C,2,FALSE),\"\")","v":""},null,null,null,{"$f":"IFERROR(H2503*I2503,\"\")","v":0}]
[null,null,null,null,null,{"$f":"IFERROR(VLOOKUP(E2504,Insumos!A:C,2,FALSE),\"\")","v":""},null,null,null,{"$f":"IFERROR(H2504*I2504,\"\")","v":0}]

{"sheet":"Relatório","index":2,"n_rows":29,"n_cols":7,"rows_kept":29,"cut":false,"hidden":false,"merged":[[7,1,7,2],[2,0,2,5],[7,3,7,6],[1,1,1,6],[3,5,3,6],[4,5,4,6],[3,2,3,3],[4,2,4,3],[5,2,5,3],[6,2,6,3]]}
[]
[null,"RELATÓRIO DE ENTRADAS E SAÍDAS POR INSUMOS"]
[]
["INSUMO","SAFRA 2023","TOTAL DE ENTRADAS (NOTA FISCAL)",null,"QUANTIDADE DE SAÍDAS","SALDO ATUAL NO ESTOQUE"]
["herbicida",null,{"$f":"IFERROR(SUMIF(Nota_Fiscal!L4:L1174,A5,Nota_Fiscal!I4:I1174),\"\")","v":4075},null,{"$f":"IFERROR(SUMIF(Saída!H:H,Relatório!$A$5,Saída!F:F),\"\")","v":1361},{"$f":"C5-E5","v":2714}]
[null,"Lt",{"$f":"SUMIFS(Nota_Fiscal!$I$4:$I$1600,Nota_Fiscal!$F$4:$F$1600,Relatório!B6,Nota_Fiscal!$L$4:$L$1600,Relatório!$A$5)","v":2075},null,{"$f":"SUMIFS(Saída!$F$4:$F$38,Saída!$C$4:$C$38,Relatório!B6,Saída!$H$4:$H$38,Relatório!$A$5)","v":786},{"$f":"C6-E6","v":1289}]
[null,"Kg",{"$f":"SUMIFS(Nota_Fiscal!$I$4:$I$1600,Nota_Fiscal!$F$4:$F$1600,Relatório!B7,Nota_Fiscal!$L$4:$L$1600,Relatório!$A$5)","v":2000},null,{"$f":"SUMIFS(Saída!$F$4:$F$38,Saída!$C$4:$C$38,Relatório!B7,Saída!$H$4:$H$38,Relatório!$A$5)","v":575},{"$f":"C7-E7","v":1425}]
[null,"Entradas",null,"Saídas de Insumos"]
["Data","Produto","Entrada","Data2","Produto2","Saída","Talhão"]
[{"$f":"IFERROR(INDEX(Nota_Fiscal!$C$4:$C$1600,SMALL(IF(Nota_Fiscal!L$4:L$1600=A$5,ROW(Nota_Fiscal!L$4:L$1600)-ROWS($A$1:$A$3)),ROW($A1))),\"\")","v":"2023-08-03"},{"$f":"IFERROR(INDEX(Nota_Fiscal!G$4:G$1600,SMALL(IF(Nota_Fiscal!L$4:L$1600=A$5,ROW(Nota_Fiscal!L$4:L$1600)-ROWS($A$1:$A$3)),ROW($A1))),\"\")","v":"OFF ROAD"},{"$f":"IFERROR(INDEX(Nota_Fiscal!I$4:I$1600,SMALL(IF(Nota_Fiscal!L$4:L$1600=A$5,ROW(Nota_Fiscal!L$4:L$1600)-ROWS($A$1:$A$3)),ROW($A1))),\"\")","v":300},{"$f":"IFERROR(INDEX(Saída!$D$4:$D$38,SMALL(IF(Saída!$H$4:$H$38=A$5,ROW(Saída!$H$4:$H$38)-ROWS($A$1:$A$3)),ROW($A1))),\"\")","v":"2023-08-04"},{"$f":"IFERROR(INDEX(Saída!$E$4:$E$38,SMALL(IF(Saída!$H$4:$H$38=A$5,ROW(Saída!$H$4:$H$38)-ROWS($A$1:$A$3)),ROW($A1))),\"\")","v":"STRINGER WG"},{"$f":"IFERROR(INDEX(Saída!$F$4:$F$38,SMALL(IF(Saída!$H$4:$H$38=A$5,ROW(Saída!$H$4:$H$38)-ROWS($A$1:$A$3)),ROW($A1))),\"\")","v":220},{"$f":"IFERROR(INDEX(Saída!$B$4:$B$38,SMALL(IF(Saída!$H$4:$H$38=A$5,ROW(Saída!$H$4:$H$38)-ROWS($A$1:$A$3)),ROW($A1))),\"\")","v":6}]
[{"$f":"IFERROR(INDEX(Nota_Fiscal!$C$4:$C$1600,SMALL(IF(Nota_Fiscal!L$4:L$1600=A$5,ROW(Nota_Fiscal!L$4:L$1600)-ROWS($A$1:$A$3)),ROW($A2))),\"\")","v":"2023-08-03"},{"$f":"IFERROR(INDEX(Nota_Fiscal!G$4:G$1600,SMALL(IF(Nota_Fiscal!L$4:L$1600=A$5,ROW(Nota_Fiscal!L$4:L$1600)-ROWS($A$1:$A$3)),ROW($A2))),\"\")","v":"POQUER "},{"$f":"IFERROR(INDEX(Nota_Fiscal!I$4:I$1600,SMALL(IF(Nota_Fiscal!L$4:L$1600=A$5,ROW(Nota_Fiscal!L$4:L$1600)-ROWS($A$1:$A$3)),ROW($A2))),\"\")","v":240},{"$f":"IFERROR(INDEX(Saída!$D$4:$D$38,SMALL(IF(Saída!$H$4:$H$38=A$5,ROW(Saída!$H$4:$H$38)-ROWS($A$1:$A$3)),ROW($A2))),\"\")","v":"2023-08-04"},{"$f":"IFERROR(INDEX(Saída!$E$4:$E$38,SMALL(IF(Saída!$H$4:$H$38=A$5,ROW(Saída!$H$4:$H$38)-ROWS($A$1:$A$3)),ROW($A2))),\"\")","v":"TRICLON"},{"$f":"IFERROR(INDEX(Saída!$F$4:$F$38,SMALL(IF(Saída!$H$4:$H$38=A$5,ROW(Saída!$H$4:$H$38)-ROWS($A$1:$A$3)),ROW($A2))),\"\")","v":165},{"$f":"IFERROR(INDEX(Saída!$B$4:$B$38,SMALL(IF(Saída!$H$4:$H$38=A$5,ROW(Saída!$H$4:$H$38)-ROWS($A$1:$A$3)),ROW($A2))),\"\")","v":6}]
[{"$f":"IFERROR(INDEX(Nota_Fiscal!$C$4:$C$1600,SMALL(IF(Nota_Fiscal!L$4:L$1600=A$5,ROW(Nota_Fiscal!L$4:L$1600)-ROWS($A$1:$A$3)),ROW($A3))),\"\")","v":"2023-08-04"},{"$f":"IFERROR(INDEX(Nota_Fiscal!G$4:G$1600,SMALL(IF(Nota_Fiscal!L$4:L$1600=A$5,ROW(Nota_Fiscal!L$4:L$1600)-ROWS($A$1:$A$3)),ROW($A3))),\"\")","v":"TRICLON"},{"$f":"IFERROR(INDEX(Nota_Fiscal!I$4:I$1600,SMALL(IF(Nota_Fiscal!L$4:L$1600=A$5,ROW(Nota_Fiscal!L$4:L$1600)-ROWS($A$1:$A$3)),ROW($A3))),\"\")","v":240},{"$f":"IFERROR(INDEX(Saída!$D$4:$D$38,SMALL(IF(Saída!$H$4:$H$38=A$5,ROW(Saída!$H$4:$H$38)-ROWS($A$1:$A$3)),ROW($A3))),\"\")","v":"2023-08-15"},{"$f":"IFERROR(INDEX(Saída!$E$4:$E$38,SMALL(IF(Saída!$H$4:$H$38=A$5,ROW(Saída!$H$4:$H$38)-ROWS($A$1:$A$3)),ROW($A3))),\"\")","v":"OFF ROAD"},{"$f":"IFERROR(INDEX(Saída!$F$4:$F$38,SMALL(IF(Saída!$H$4:$H$38=A$5,ROW(Saída!$H$4:$H$38)-ROWS($A$1:$A$3)),ROW($A3))),\"\")","v":220},{"$f":"IFERROR(INDEX(Saída!$B$4:$B$38,SMALL(IF(Saída!$H$4:$H$38=A$5,ROW(Saída!$H$4:$H$38)-ROWS($A$1:$A$3)),ROW($A3))),\"\")","v":6}]
[{"$f":"IFERROR(INDEX(Nota_Fiscal!$C$4:$C$1600,SMALL(IF(Nota_Fiscal!L$4:L$1600=A$5,ROW(Nota_Fiscal!L$4:L$1600)-ROWS($A$1:$A$3)),ROW($A4))),\"\")","v":"2023-08-03"},{"$f":"IFERROR(INDEX(Nota_Fiscal!G$4:G$1600,SMALL(IF(Nota_Fiscal!L$4:L$1600=A$5,ROW(Nota_Fiscal!L$4:L$1600)-ROWS($A$1:$A$3)),ROW($A4))),\"\")","v":"OFF ROAD"},{"$f":"IFERROR(INDEX(Nota_Fiscal!I$4:I$1600,SMALL(IF(Nota_Fiscal!L$4:L$1600=A$5,ROW(Nota_Fiscal!L$4:L$1600)-ROWS($A$1:$A$3)),ROW($A4))),\"\")","v":300},{"$f":"IFERROR(INDEX(Saída!$D$4:$D$38,SMALL(IF(Saída!$H$4:$H$38=A$5,ROW(Saída!$H$4:$H$38)-ROWS($A$1:$A$3)),ROW($A4))),\"\")","v":"2023-08-23"},{"$f":"IFERROR(INDEX(Saída!$E$4:$E$38,SMALL(IF(Saída!$H$4:$H$38=A$5,ROW(Saída!$H$4:$H$38)-ROWS($A$1:$A$3)),ROW($A4))),\"\")","v":"STRINGER WG"},{"$f":"IFERROR(INDEX(Saída!$F$4:$F$38,SMALL(IF(Saída!$H$4:$H$38=A$5,ROW(Saída!$H$4:$H$38)-ROWS($A$1:$A$3)),ROW($A4))),\"\")","v":120},{"$f":"IFERROR(INDEX(Saída!$B$4:$B$38,SMALL(IF(Saída!$H$4:$H$38=A$5,ROW(Saída!$H$4:$H$38)-ROWS($A$1:$A$3)),ROW($A4))),\"\")","v":6}]
[{"$f":"IFERROR(INDEX(Nota_Fiscal!$C$4:$C$1600,SMALL(IF(Nota_Fiscal!L$4:L$1600=A$5,ROW(Nota_Fiscal!L$4:L$1600)-ROWS($A$1:$A$3)),ROW($A5))),\"\")","v":"2023-08-03"},{"$f":"IFERROR(INDEX(Nota_Fiscal!G$4:G$1600,SMALL(IF(Nota_Fiscal!L$4:L$1600=A$5,ROW(Nota_Fiscal!L$4:L$1600)-ROWS($A$1:$A$3)),ROW($A5))),\"\")","v":"POQUER "},{"$f":"IFERROR(INDEX(Nota_Fiscal!I$4:I$1600,SMALL(IF(Nota_Fiscal!L$4:L$1600=A$5,ROW(Nota_Fiscal!L$4:L$1600)-ROWS($A$1:$A$3)),ROW($A5))),\"\")","v":240},{"$f":"IFERROR(INDEX(Saída!$D$4:$D$38,SMALL(IF(Saída!$H$4:$H$38=A$5,ROW(Saída!$H$4:$H$38)-ROWS($A$1:$A$3)),ROW($A5))),\"\")","v":"2023-08-23"},{"$f":"IFERROR(INDEX(Saída!$E$4:$E$38,SMALL(IF(Saída!$H$4:$H$38=A$5,ROW(Saída!$H$4:$H$38)-ROWS($A$1:$A$3)),ROW($A5))),\"\")","v":"TRICLON"},{"$f":"IFERROR(INDEX(Saída!$F$4:$F$38,SMALL(IF(Saída!$H$4:$H$38=A$5,ROW(Saída!$H$4:$H$38)-ROWS($A$1:$A$3)),ROW($A5))),\"\")","v":90},{"$f":"IFERROR(INDEX(Saída!$B$4:$B$38,SMALL(IF(Saída!$H$4:$H$38=A$5,ROW(Saída!$H$4:$H$38)-ROWS($A$1:$A$3)),ROW($A5))),\"\")","v":6}]
[{"$f":"IFERROR(INDEX(Nota_Fiscal!$C$4:$C$1600,SMALL(IF(Nota_Fiscal!L$4:L$1600=A$5,ROW(Nota_Fiscal!L$4:L$1600)-ROWS($A$1:$A$3)),ROW($A6))),\"\")","v":"2023-08-03"},{"$f":"IFERROR(INDEX(Nota_Fiscal!G$4:G$1600,SMALL(IF(Nota_Fiscal!L$4:L$1600=A$5,ROW(Nota_Fiscal!L$4:L$1600)-ROWS($A$1:$A$3)),ROW($A6))),\"\")","v":"TRICLON"},{"$f":"IFERROR(INDEX(Nota_Fiscal!I$4:I$1600,SMALL(IF(Nota_Fiscal!L$4:L$1600=A$5,ROW(Nota_Fiscal!L$4:L$1600)-ROWS($A$1:$A$3)),ROW($A6))),\"\")","v":220},{"$f":"IFERROR(INDEX(Saída!$D$4:$D$38,SMALL(IF(Saída!$H$4:$H$38=A$5,ROW(Saída!$H$4:$H$38)-ROWS($A$1:$A$3)),ROW($A6))),\"\")","v":"2023-08-24"},{"$f":"IFERROR(INDEX(Saída!$E$4:$E$38,SMALL(IF(Saída!$H$4:$H$38=A$5,ROW(Saída!$H$4:$H$38)-ROWS($A$1:$A$3)),ROW($A6))),\"\")","v":"STRINGER WG"},{"$f":"IFERROR(INDEX(Saída!$F$4:$F$38,SMALL(IF(Saída!$H$4:$H$38=A$5,ROW(Saída!$H$4:$H$38)-ROWS($A$1:$A$3)),ROW($A6))),\"\")","v":155},{"$f":"IFERROR(INDEX(Saída!$B$4:$B$38,SMALL(IF(Saída!$H$4:$H$38=A$5,ROW(Saída!$H$4:$H$38)-ROWS($A$1:$A$3)),ROW($A6))),\"\")","v":1}]
[{"$f":"IFERROR(INDEX(Nota_Fiscal!$C$4:$C$1600,SMALL(IF(Nota_Fiscal!L$4:L$1600=A$5,ROW(Nota_Fiscal!L$4:L$1600)-ROWS($A$1:$A$3)),ROW($A7))),\"\")","v":"2023-06-07"},{"$f":"IFERROR(INDEX(Nota_Fiscal!G$4:G$1600,SMALL(IF(Nota_Fiscal!L$4:L$1600=A$5,ROW(Nota_Fiscal!L$4:L$1600)-ROWS($A$1:$A$3)),ROW($A7))),\"\")","v":"STRINGER WG"},{"$f":"IFERROR(INDEX(Nota_Fiscal!I$4:I$1600,SMALL(IF(Nota_Fiscal!L$4:L$1600=A$5,ROW(Nota_Fiscal!L$4:L$1600)-ROWS($A$1:$A$3)),ROW($A7))),\"\")","v":180},{"$f":"IFERROR(INDEX(Saída!$D$4:$D$38,SMALL(IF(Saída!$H$4:$H$38=A$5,ROW(Saída!$H$4:$H$38)-ROWS($A$1:$A$3)),ROW($A7))),\"\")","v":"2023-08-30"},{"$f":"IFERROR(INDEX(Saída!$E$4:$E$38,SMALL(IF(Saída!$H$4:$H$38=A$5,ROW(Saída!$H$4:$H$38)-ROWS($A$1:$A$3)),ROW($A7))),\"\")","v":"STRINGER WG"},{"$f":"IFERROR(INDEX(Saída!$F$4:$F$38,SMALL(IF(Saída!$H$4:$H$38=A$5,ROW(Saída!$H$4:$H$38)-ROWS($A$1:$A$3)),ROW($A7))),\"\")","v":40},{"$f":"IFERROR(INDEX(Saída!$B$4:$B$38,SMALL(IF(Saída!$H$4:$H$38=A$5,ROW(Saída!$H$4:$H$38)-ROWS($A$1:$A$3)),ROW($A7))),\"\")","v":"Cilo"}]
[{"$f":"IFERROR(INDEX(Nota_Fiscal!$C$4:$C$1600,SMALL(IF(Nota_Fiscal!L$4:L$1600=A$5,ROW(Nota_Fiscal!L$4:L$1600)-ROWS($A$1:$A$3)),ROW($A8))),\"\")","v":"2023-06-07"},{"$f":"IFERROR(INDEX(Nota_Fiscal!G$4:G$1600,SMALL(IF(Nota_Fiscal!L$4:L$1600=A$5,ROW(Nota_Fiscal!L$4:L$1600)-ROWS($A$1:$A$3)),ROW($A8))),\"\")","v":"STRINGER WG"},{"$f":"IFERROR(INDEX(Nota_Fiscal!I$4:I$1600,SMALL(IF(Nota_Fiscal!L$4:L$1600=A$5,ROW(Nota_Fiscal!L$4:L$1600)-ROWS($A$1:$A$3)),ROW($A8))),\"\")","v":640},{"$f":"IFERROR(INDEX(Saída!$D$4:$D$38,SMALL(IF(Saída!$H$4:$H$38=A$5,ROW(Saída!$H$4:$H$38)-ROWS($A$1:$A$3)),ROW($A8))),\"\")","v":"2023-08-30"},{"$f":"IFERROR(INDEX(Saída!$E$4:$E$38,SMALL(IF(Saída!$H$4:$H$38=A$5,ROW(Saída!$H$4:$H$38)-ROWS($A$1:$A$3)),ROW($A8))),\"\")","v":"CLETODIM CCAB EC"},{"$f":"IFERROR(INDEX(Saída!$F$4:$F$38,SMALL(IF(Saída!$H$4:$H$38=A$5,ROW(Saída!$H$4:$H$38)-ROWS($A$1:$A$3)),ROW($A8))),\"\")","v":15},{"$f":"IFERROR(INDEX(Saída!$B$4:$B$38,SMALL(IF(Saída!$H$4:$H$38=A$5,ROW(Saída!$H$4:$H$38)-ROWS($A$1:$A$3)),ROW($A8))),\"\")","v":"Cilo"}]
[{"$f":"IFERROR(INDEX(Nota_Fiscal!$C$4:$C$1600,SMALL(IF(Nota_Fiscal!L$4:L$1600=A$5,ROW(Nota_Fiscal!L$4:L$1600)-ROWS($A$1:$A$3)),ROW($A9))),\"\")","v":"2023-06-07"},{"$f":"IFERROR(INDEX(Nota_Fiscal!G$4:G$1600,SMALL(IF(Nota_Fiscal!L$4:L$1600=A$5,ROW(Nota_Fiscal!L$4:L$1600)-ROWS($A$1:$A$3)),ROW($A9))),\"\")","v":"STRINGER WG"},{"$f":"IFERROR(INDEX(Nota_Fiscal!I$4:I$1600,SMALL(IF(Nota_Fiscal!L$4:L$1600=A$5,ROW(Nota_Fiscal!L$4:L$1600)-ROWS($A$1:$A$3)),ROW($A9))),\"\")","v":1180},{"$f":"IFERROR(INDEX(Saída!$D$4:$D$38,SMALL(IF(Saída!$H$4:$H$38=A$5,ROW(Saída!$H$4:$H$38)-ROWS($A$1:$A$3)),ROW($A9))),\"\")","v":"2023-08-30"},{"$f":"IFERROR(INDEX(Saída!$E$4:$E$38,SMALL(IF(Saída!$H$4:$H$38=A$5,ROW(Saída!$H$4:$H$38)-ROWS($A$1:$A$3)),ROW($A9))),\"\")","v":"STRINGER WG"},{"$f":"IFERROR(INDEX(Saída!$F$4:$F$38,SMALL(IF(Saída!$H$4:$H$38=A$5,ROW(Saída!$H$4:$H$38)-ROWS($A$1:$A$3)),ROW($A9))),\"\")","v":40},{"$f":"IFERROR(INDEX(Saída!$B$4:$B$38,SMALL(IF(Saída!$H$4:$H$38=A$5,ROW(Saída!$H$4:$H$38)-ROWS($A$1:$A$3)),ROW($A9))),\"\")","v":"Culhambi"}]
[{"$f":"IFERROR(INDEX(Nota_Fiscal!$C$4:$C$1600,SMALL(IF(Nota_Fiscal!L$4:L$1600=A$5,ROW(Nota_Fiscal!L$4:L$1600)-ROWS($A$1:$A$3)),ROW($A10))),\"\")","v":"2023-08-24"},{"$f":"IFERROR(INDEX(Nota_Fiscal!G$4:G$1600,SMALL(IF(Nota_Fiscal!L$4:L$1600=A$5,ROW(Nota_Fiscal!L$4:L$1600)-ROWS($A$1:$A$3)),ROW($A10))),\"\")","v":"SAPEK MAX 880"},{"$f":"IFERROR(INDEX(Nota_Fiscal!I$4:I$1600,SMALL(IF(Nota_Fiscal!L$4:L$1600=A$5,ROW(Nota_Fiscal!L$4:L$1600)-ROWS($A$1:$A$3)),ROW($A10))),\"\")","v":175},{"$f":"IFERROR(INDEX(Saída!$D$4:$D$38,SMALL(IF(Saída!$H$4:$H$38=A$5,ROW(Saída!$H$4:$H$38)-ROWS($A$1:$A$3)),ROW($A10))),\"\")","v":"2023-08-30"},{"$f":"IFERROR(INDEX(Saída!$E$4:$E$38,SMALL(IF(Saída!$H$4:$H$38=A$5,ROW(Saída!$H$4:$H$38)-ROWS($A$1:$A$3)),ROW($A10))),\"\")","v":"CLETODIM CCAB EC"},{"$f":"IFERROR(INDEX(Saída!$F$4:$F$38,SMALL(IF(Saída!$H$4:$H$38=A$5,ROW(Saída!$H$4:$H$38)-ROWS($A$1:$A$3)),ROW($A10))),\"\")","v":15},{"$f":"IFERROR(INDEX(Saída!$B$4:$B$38,SMALL(IF(Saída!$H$4:$H$38=A$5,ROW(Saída!$H$4:$H$38)-ROWS($A$1:$A$3)),ROW($A10))),\"\")","v":"Culhambi"}]
[{"$f":"IFERROR(INDEX(Nota_Fiscal!$C$4:$C$1600,SMALL(IF(Nota_Fiscal!L$4:L$1600=A$5,ROW(Nota_Fiscal!L$4:L$1600)-ROWS($A$1:$A$3)),ROW($A11))),\"\")","v":"2023-08-24"},{"$f":"IFERROR(INDEX(Nota_Fiscal!G$4:G$1600,SMALL(IF(Nota_Fiscal!L$4:L$1600=A$5,ROW(Nota_Fiscal!L$4:L$1600)-ROWS($A$1:$A$3)),ROW($A11))),\"\")","v":"CLETODIM CCAB EC"},{"$f":"IFERROR(INDEX(Nota_Fiscal!I$4:I$1600,SMALL(IF(Nota_Fiscal!L$4:L$1600=A$5,ROW(Nota_Fiscal!L$4:L$1600)-ROWS($A$1:$A$3)),ROW($A11))),\"\")","v":360},{"$f":"IFERROR(INDEX(Saída!$D$4:$D$38,SMALL(IF(Saída!$H$4:$H$38=A$5,ROW(Saída!$H$4:$H$38)-ROWS($A$1:$A$3)),ROW($A11))),\"\")","v":"2023-08-30"},{"$f":"IFERROR(INDEX(Saída!$E$4:$E$38,SMALL(IF(Saída!$H$4:$H$38=A$5,ROW(Saída!$H$4:$H$38)-ROWS($A$1:$A$3)),ROW($A11))),\"\")","v":"STRINGER WG"},{"$f":"IFERROR(INDEX(Saída!$F$4:$F$38,SMALL(IF(Saída!$H$4:$H$38=A$5,ROW(Saída!$H$4:$H$38)-ROWS($A$1:$A$3)),ROW($A11))),\"\")","v":45},{"$f":"IFERROR(INDEX(Saída!$B$4:$B$38,SMALL(IF(Saída!$H$4:$H$38=A$5,ROW(Saída!$H$4:$H$38)-ROWS($A$1:$A$3)),ROW($A11))),\"\")","v":5}]
[{"$f":"IFERROR(INDEX(Nota_Fiscal!$C$4:$C$1600,SMALL(IF(Nota_Fiscal!L$4:L$1600=A$5,ROW(Nota_Fiscal!L$4:L$1600)-ROWS($A$1:$A$3)),ROW($A12))),\"\")","v":""},{"$f":"IFERROR(INDEX(Nota_Fiscal!G$4:G$1600,SMALL(IF(Nota_Fiscal!L$4:L$1600=A$5,ROW(Nota_Fiscal!L$4:L$1600)-ROWS($A$1:$A$3)),ROW($A12))),\"\")","v":""},{"$f":"IFERROR(INDEX(Nota_Fiscal!I$4:I$1600,SMALL(IF(Nota_Fiscal!L$4:L$1600=A$5,ROW(Nota_Fiscal!L$4:L$1600)-ROWS($A$1:$A$3)),ROW($A12))),\"\")","v":""},{"$f":"IFERROR(INDEX(Saída!$D$4:$D$38,SMALL(IF(Saída!$H$4:$H$38=A$5,ROW(Saída!$H$4:$H$38)-ROWS($A$1:$A$3)),ROW($A12))),\"\")","v":"2023-08-30"},{"$f":"IFERROR(INDEX(Saída!$E$4:$E$38,SMALL(IF(Saída!$H$4:$H$38=A$5,ROW(Saída!$H$4:$H$38)-ROWS($A$1:$A$3)),ROW($A12))),\"\")","v":"CLETODIM CCAB EC"},{"$f":"IFERROR(INDEX(Saída!$F$4:$F$38,SMALL(IF(Saída!$H$4:$H$38=A$5,ROW(Saída!$H$4:$H$38)-ROWS($A$1:$A$3)),ROW($A12))),\"\")","v":18},{"$f":"IFERROR(INDEX(Saída!$B$4:$B$38,SMALL(IF(Saída!$H$4:$H$38=A$5,ROW(Saída!$H$4:$H$38)-ROWS($A$1:$A$3)),ROW($A12))),\"\")","v":5}]
[{"$f":"IFERROR(INDEX(Nota_Fiscal!$C$4:$C$1600,SMALL(IF(Nota_Fiscal!L$4:L$1600=A$5,ROW(Nota_Fiscal!L$4:L$1600)-ROWS($A$1:$A$3)),ROW($A13))),\"\")","v":""},{"$f":"IFERROR(INDEX(Nota_Fiscal!G$4:G$1600,SMALL(IF(Nota_Fiscal!L$4:L$1600=A$5,ROW(Nota_Fiscal!L$4:L$1600)-ROWS($A$1:$A$3)),ROW($A13))),\"\")","v":""},{"$f":"IFERROR(INDEX(Nota_Fiscal!I$4:I$1600,SMALL(IF(Nota_Fiscal!L$4:L$1600=A$5,ROW(Nota_Fiscal!L$4:L$1600)-ROWS($A$1:$A$3)),ROW($A13))),\"\")","v":""},{"$f":"IFERROR(INDEX(Saída!$D$4:$D$38,SMALL(IF(Saída!$H$4:$H$38=A$5,ROW(Saída!$H$4:$H$38)-ROWS($A$1:$A$3)),ROW($A13))),\"\")","v":"2023-08-31"},{"$f":"IFERROR(INDEX(Saída!$E$4:$E$38,SMALL(IF(Saída!$H$4:$H$38=A$5,ROW(Saída!$H$4:$H$38)-ROWS($A$1:$A$3)),ROW($A13))),\"\")","v":"STRINGER WG"},{"$f":"IFERROR(INDEX(Saída!$F$4:$F$38,SMALL(IF(Saída!$H$4:$H$38=A$5,ROW(Saída!$H$4:$H$38)-ROWS($A$1:$A$3)),ROW($A13))),\"\")","v":90},{"$f":"IFERROR(INDEX(Saída!$B$4:$B$38,SMALL(IF(Saída!$H$4:$H$38=A$5,ROW(Saída!$H$4:$H$38)-ROWS($A$1:$A$3)),ROW($A13))),\"\")","v":5}]
[{"$f":"IFERROR(INDEX(Nota_Fiscal!$C$4:$C$1600,SMALL(IF(Nota_Fiscal!L$4:L$1600=A$5,ROW(Nota_Fiscal!L$4:L$1600)-ROWS($A$1:$A$3)),ROW($A14))),\"\")","v":""},{"$f":"IFERROR(INDEX(Nota_Fiscal!G$4:G$1600,SMALL(IF(Nota_Fiscal!L$4:L$1600=A$5,ROW(Nota_Fiscal!L$4:L$1600)-ROWS($A$1:$A$3)),ROW($A14))),\"\")","v":""},{"$f":"IFERROR(INDEX(Nota_Fiscal!I$4:I$1600,SMALL(IF(Nota_Fiscal!L$4:L$1600=A$5,ROW(Nota_Fiscal!L$4:L$1600)-ROWS($A$1:$A$3)),ROW($A14))),\"\")","v":""},{"$f":"IFERROR(INDEX(Saída!$D$4:$D$38,SMALL(IF(Saída!$H$4:$H$38=A$5,ROW(Saída!$H$4:$H$38)-ROWS($A$1:$A$3)),ROW($A14))),\"\")","v":"2023-08-31"},{"$f":"IFERROR(INDEX(Saída!$E$4:$E$38,SMALL(IF(Saída!$H$4:$H$38=A$5,ROW(Saída!$H$4:$H$38)-ROWS($A$1:$A$3)),ROW($A14))),\"\")","v":"CLETODIM CCAB EC"},{"$f":"IFERROR(INDEX(Saída!$F$4:$F$38,SMALL(IF(Saída!$H$4:$H$38=A$5,ROW(Saída!$H$4:$H$38)-ROWS($A$1:$A$3)),ROW($A14))),\"\")","v":36},{"$f":"IFERROR(INDEX(Saída!$B$4:$B$38,SMALL(IF(Saída!$H$4:$H$38=A$5,ROW(Saída!$H$4:$H$38)-ROWS($A$1:$A$3)),ROW($A14))),\"\")","v":5}]
[{"$f":"IFERROR(INDEX(Nota_Fiscal!$C$4:$C$1600,SMALL(IF(Nota_Fiscal!L$4:L$1600=A$5,ROW(Nota_Fiscal!L$4:L$1600)-ROWS($A$1:$A$3)),ROW($A15))),\"\")","v":""},{"$f":"IFERROR(INDEX(Nota_Fiscal!G$4:G$1600,SMALL(IF(Nota_Fiscal!L$4:L$1600=A$5,ROW(Nota_Fiscal!L$4:L$1600)-ROWS($A$1:$A$3)),ROW($A15))),\"\")","v":""},{"$f":"IFERROR(INDEX(Nota_Fiscal!I$4:I$1600,SMALL(IF(Nota_Fiscal!L$4:L$1600=A$5,ROW(Nota_Fiscal!L$4:L$1600)-ROWS($A$1:$A$3)),ROW($A15))),\"\")","v":""},{"$f":"IFERROR(INDEX(Saída!$D$4:$D$38,SMALL(IF(Saída!$H$4:$H$38=A$5,ROW(Saída!$H$4:$H$38)-ROWS($A$1:$A$3)),ROW($A15))),\"\")","v":"2023-08-31"},{"$f":"IFERROR(INDEX(Saída!$E$4:$E$38,SMALL(IF(Saída!$H$4:$H$38=A$5,ROW(Saída!$H$4:$H$38)-ROWS($A$1:$A$3)),ROW($A15))),\"\")","v":"STRINGER WG"},{"$f":"IFERROR(INDEX(Saída!$F$4:$F$38,SMALL(IF(Saída!$H$4:$H$38=A$5,ROW(Saída!$H$4:$H$38)-ROWS($A$1:$A$3)),ROW($A15))),\"\")","v":65},{"$f":"IFERROR(INDEX(Saída!$B$4:$B$38,SMALL(IF(Saída!$H$4:$H$38=A$5,ROW(Saída!$H$4:$H$38)-ROWS($A$1:$A$3)),ROW($A15))),\"\")","v":4}]
[{"$f":"IFERROR(INDEX(Nota_Fiscal!$C$4:$C$1600,SMALL(IF(Nota_Fiscal!L$4:L$1600=A$5,ROW(Nota_Fiscal!L$4:L$1600)-ROWS($A$1:$A$3)),ROW($A16))),\"\")","v":""},{"$f":"IFERROR(INDEX(Nota_Fiscal!G$4:G$1600,SMALL(IF(Nota_Fiscal!L$4:L$1600=A$5,ROW(Nota_Fiscal!L$4:L$1600)-ROWS($A$1:$A$3)),ROW($A16))),\"\")","v":""},{"$f":"IFERROR(INDEX(Nota_Fiscal!I$4:I$1600,SMALL(IF(Nota_Fiscal!L$4:L$1600=A$5,ROW(Nota_Fiscal!L$4:L$1600)-ROWS($A$1:$A$3)),ROW($A16))),\"\")","v":""},{"$f":"IFERROR(INDEX(Saída!$D$4:$D$38,SMALL(IF(Saída!$H$4:$H$38=A$5,ROW(Saída!$H$4:$H$38)-ROWS($A$1:$A$3)),ROW($A16))),\"\")","v":"2023-08-31"},{"$f":"IFERROR(INDEX(Saída!$E$4:$E$38,SMALL(IF(Saída!$H$4:$H$38=A$5,ROW(Saída!$H$4:$H$38)-ROWS($A$1:$A$3)),ROW($A16))),\"\")","v":"CLETODIM CCAB EC"},{"$f":"IFERROR(INDEX(Saída!$F$4:$F$38,SMALL(IF(Saída!$H$4:$H$38=A$5,ROW(Saída!$H$4:$H$38)-ROWS($A$1:$A$3)),ROW($A16))),\"\")","v":27},{"$f":"IFERROR(INDEX(Saída!$B$4:$B$38,SMALL(IF(Saída!$H$4:$H$38=A$5,ROW(Saída!$H$4:$H$38)-ROWS($A$1:$A$3)),ROW($A16))),\"\")","v":4}]
[{"$f":"IFERROR(INDEX(Nota_Fiscal!$C$4:$C$1600,SMALL(IF(Nota_Fiscal!L$4:L$1600=A$5,ROW(Nota_Fiscal!L$4:L$1600)-ROWS($A$1:$A$3)),ROW($A17))),\"\")","v":""},{"$f":"IFERROR(INDEX(Nota_Fiscal!G$4:G$1600,SMALL(IF(Nota_Fiscal!L$4:L$1600=A$5,ROW(Nota_Fiscal!L$4:L$1600)-ROWS($A$1:$A$3)),ROW($A17))),\"\")","v":""},{"$f":"IFERROR(INDEX(Nota_Fiscal!I$4:I$1600,SMALL(IF(Nota_Fiscal!L$4:L$1600=A$5,ROW(Nota_Fiscal!L$4:L$1600)-ROWS($A$1:$A$3)),ROW($A17))),\"\")","v":""},{"$f":"IFERROR(INDEX(Saída!$D$4:$D$38,SMALL(IF(Saída!$H$4:$H$38=A$5,ROW(Saída!$H$4:$H$38)-ROWS($A$1:$A$3)),ROW($A17))),\"\")","v":""},{"$f":"IFERROR(INDEX(Saída!$E$4:$E$38,SMALL(IF(Saída!$H$4:$H$38=A$5,ROW(Saída!$H$4:$H$38)-ROWS($A$1:$A$3)),ROW($A17))),\"\")","v":""},{"$f":"IFERROR(INDEX(Saída!$F$4:$F$38,SMALL(IF(Saída!$H$4:$H$38=A$5,ROW(Saída!$H$4:$H$38)-ROWS($A$1:$A$3)),ROW($A17))),\"\")","v":""},{"$f":"IFERROR(INDEX(Saída!$B$4:$B$38,SMALL(IF(Saída!$H$4:$H$38=A$5,ROW(Saída!$H$4:$H$38)-ROWS($A$1:$A$3)),ROW($A17))),\"\")","v":""}]
[{"$f":"IFERROR(INDEX(Nota_Fiscal!$C$4:$C$1600,SMALL(IF(Nota_Fiscal!L$4:L$1600=A$5,ROW(Nota_Fiscal!L$4:L$1600)-ROWS($A$1:$A$3)),ROW($A18))),\"\")","v":""},{"$f":"IFERROR(INDEX(Nota_Fiscal!G$4:G$1600,SMALL(IF(Nota_Fiscal!L$4:L$1600=A$5,ROW(Nota_Fiscal!L$4:L$1600)-ROWS($A$1:$A$3)),ROW($A18))),\"\")","v":""},{"$f":"IFERROR(INDEX(Nota_Fiscal!I$4:I$1600,SMALL(IF(Nota_Fiscal!L$4:L$1600=A$5,ROW(Nota_Fiscal!L$4:L$1600)-ROWS($A$1:$A$3)),ROW($A18))),\"\")","v":""},{"$f":"IFERROR(INDEX(Saída!$D$4:$D$38,SMALL(IF(Saída!$H$4:$H$38=A$5,ROW(Saída!$H$4:$H$38)-ROWS($A$1:$A$3)),ROW($A18))),\"\")","v":""},{"$f":"IFERROR(INDEX(Saída!$E$4:$E$38,SMALL(IF(Saída!$H$4:$H$38=A$5,ROW(Saída!$H$4:$H$38)-ROWS($A$1:$A$3)),ROW($A18))),\"\")","v":""},{"$f":"IFERROR(INDEX(Saída!$F$4:$F$38,SMALL(IF(Saída!$H$4:$H$38=A$5,ROW(Saída!$H$4:$H$38)-ROWS($A$1:$A$3)),ROW($A18))),\"\")","v":""},{"$f":"IFERROR(INDEX(Saída!$B$4:$B$38,SMALL(IF(Saída!$H$4:$H$38=A$5,ROW(Saída!$H$4:$H$38)-ROWS($A$1:$A$3)),ROW($A18))),\"\")","v":""}]
[{"$f":"IFERROR(INDEX(Nota_Fiscal!$C$4:$C$1600,SMALL(IF(Nota_Fiscal!L$4:L$1600=A$5,ROW(Nota_Fiscal!L$4:L$1600)-ROWS($A$1:$A$3)),ROW($A19))),\"\")","v":""},{"$f":"IFERROR(INDEX(Nota_Fiscal!G$4:G$1600,SMALL(IF(Nota_Fiscal!L$4:L$1600=A$5,ROW(Nota_Fiscal!L$4:L$1600)-ROWS($A$1:$A$3)),ROW($A19))),\"\")","v":""},{"$f":"IFERROR(INDEX(Nota_Fiscal!I$4:I$1600,SMALL(IF(Nota_Fiscal!L$4:L$1600=A$5,ROW(Nota_Fiscal!L$4:L$1600)-ROWS($A$1:$A$3)),ROW($A19))),\"\")","v":""},{"$f":"IFERROR(INDEX(Saída!$D$4:$D$38,SMALL(IF(Saída!$H$4:$H$38=A$5,ROW(Saída!$H$4:$H$38)-ROWS($A$1:$A$3)),ROW($A19))),\"\")","v":""},{"$f":"IFERROR(INDEX(Saída!$E$4:$E$38,SMALL(IF(Saída!$H$4:$H$38=A$5,ROW(Saída!$H$4:$H$38)-ROWS($A$1:$A$3)),ROW($A19))),\"\")","v":""},{"$f":"IFERROR(INDEX(Saída!$F$4:$F$38,SMALL(IF(Saída!$H$4:$H$38=A$5,ROW(Saída!$H$4:$H$38)-ROWS($A$1:$A$3)),ROW($A19))),\"\")","v":""},{"$f":"IFERROR(INDEX(Saída!$B$4:$B$38,SMALL(IF(Saída!$H$4:$H$38=A$5,ROW(Saída!$H$4:$H$38)-ROWS($A$1:$A$3)),ROW($A19))),\"\")","v":""}]
[{"$f":"IFERROR(INDEX(Nota_Fiscal!$C$4:$C$1600,SMALL(IF(Nota_Fiscal!L$4:L$1600=A$5,ROW(Nota_Fiscal!L$4:L$1600)-ROWS($A$1:$A$3)),ROW($A20))),\"\")","v":""},{"$f":"IFERROR(INDEX(Nota_Fiscal!G$4:G$1600,SMALL(IF(Nota_Fiscal!L$4:L$1600=A$5,ROW(Nota_Fiscal!L$4:L$1600)-ROWS($A$1:$A$3)),ROW($A20))),\"\")","v":""},{"$f":"IFERROR(INDEX(Nota_Fiscal!I$4:I$1600,SMALL(IF(Nota_Fiscal!L$4:L$1600=A$5,ROW(Nota_Fiscal!L$4:L$1600)-ROWS($A$1:$A$3)),ROW($A20))),\"\")","v":""},{"$f":"IFERROR(INDEX(Saída!$D$4:$D$38,SMALL(IF(Saída!$H$4:$H$38=A$5,ROW(Saída!$H$4:$H$38)-ROWS($A$1:$A$3)),ROW($A20))),\"\")","v":""},{"$f":"IFERROR(INDEX(Saída!$E$4:$E$38,SMALL(IF(Saída!$H$4:$H$38=A$5,ROW(Saída!$H$4:$H$38)-ROWS($A$1:$A$3)),ROW($A20))),\"\")","v":""},{"$f":"IFERROR(INDEX(Saída!$F$4:$F$38,SMALL(IF(Saída!$H$4:$H$38=A$5,ROW(Saída!$H$4:$H$38)-ROWS($A$1:$A$3)),ROW($A20))),\"\")","v":""},{"$f":"IFERROR(INDEX(Saída!$B$4:$B$38,SMALL(IF(Saída!$H$4:$H$38=A$5,ROW(Saída!$H$4:$H$38)-ROWS($A$1:$A$3)),ROW($A20))),\"\")","v":""}]

{"sheet":"Saída","index":3,"n_rows":38,"n_cols":8,"rows_kept":38,"cut":false,"hidden":false,"merged":[[1,0,1,6],[0,0,0,6]]}
["CADASTRO DAS SAÍDAS DE INSUMOS"]
[]
["INSUMO","TALHÃO","UN","DATA","PRODUTO","QTD","ATIVIDADE","Coluna1"]
["Defensivo Granulado",6,{"$f":"IFERROR(VLOOKUP(A4,Insumos!A:B,2,FALSE),\"\")","v":"Kg"},"2023-08-04","STRINGER WG",220,"dessecação",{"$f":"IFERROR(VLOOKUP(E4,Nota_Fiscal!$G$4:$L$1000,6,0),\"\")","v":"herbicida"}]
["Defensivo Galão",6,{"$f":"IFERROR(VLOOKUP(A5,Insumos!A:B,2,FALSE),\"\")","v":"Lt"},"2023-08-04","TRICLON",165,"dessecação",{"$f":"IFERROR(VLOOKUP(E5,Nota_Fiscal!$G$4:$L$1000,6,0),\"\")","v":"herbicida"}]
["Defensivo Galão",6,{"$f":"IFERROR(VLOOKUP(A6,Insumos!A:B,2,FALSE),\"\")","v":"Lt"},"2023-08-04","IHARA GOLD",30,"dessecação",{"$f":"IFERROR(VLOOKUP(E6,Nota_Fiscal!$G$4:$L$1000,6,0),\"\")","v":"óleo"}]
["Defensivo Galão",6,{"$f":"IFERROR(VLOOKUP(A7,Insumos!A:B,2,FALSE),\"\")","v":"Lt"},"2023-08-04","AURORA",8,"dessecação",{"$f":"IFERROR(VLOOKUP(E7,Nota_Fiscal!$G$4:$L$1000,6,0),\"\")","v":""}]
["Defensivo Galão",6,{"$f":"IFERROR(VLOOKUP(A8,Insumos!A:B,2,FALSE),\"\")","v":"Lt"},"2023-08-15","OFF ROAD",220,"Sequencial",{"$f":"IFERROR(VLOOKUP(E8,Nota_Fiscal!$G$4:$L$1000,6,0),\"\")","v":"herbicida"}]
["Defensivo Galão",6,{"$f":"IFERROR(VLOOKUP(A9,Insumos!A:B,2,FALSE),\"\")","v":"Lt"},"2023-08-15","IHARA GOLD",30,"Sequencial",{"$f":"IFERROR(VLOOKUP(E9,Nota_Fiscal!$G$4:$L$1000,6,0),\"\")","v":"óleo"}]
["Defensivo Granulado",6,{"$f":"IFERROR(VLOOKUP(A10,Insumos!A:B,2,FALSE),\"\")","v":"Kg"},"2023-08-23","STRINGER WG",120,"dessecação",{"$f":"IFERROR(VLOOKUP(E10,Nota_Fiscal!$G$4:$L$1000,6,0),\"\")","v":"herbicida"}]
["Defensivo Galão",6,{"$f":"IFERROR(VLOOKUP(A11,Insumos!A:B,2,FALSE),\"\")","v":"Lt"},"2023-08-23","TRICLON",90,"dessecação",{"$f":"IFERROR(VLOOKUP(E11,Nota_Fiscal!$G$4:$L$1000,6,0),\"\")","v":"herbicida"}]
["Defensivo Galão",6,{"$f":"IFERROR(VLOOKUP(A12,Insumos!A:B,2,FALSE),\"\")","v":"Lt"},"2023-08-23","AURORA",4,"dessecação",{"$f":"IFERROR(VLOOKUP(E12,Nota_Fiscal!$G$4:$L$1000,6,0),\"\")","v":""}]
["Defensivo Galão",6,{"$f":"IFERROR(VLOOKUP(A13,Insumos!A:B,2,FALSE),\"\")","v":"Lt"},"2023-08-23","IHARA GOLD",20,"dessecação",{"$f":"IFERROR(VLOOKUP(E13,Nota_Fiscal!$G$4:$L$1000,6,0),\"\")","v":"óleo"}]
["Defensivo Granulado",1,{"$f":"IFERROR(VLOOKUP(A14,Insumos!A:B,2,FALSE),\"\")","v":"Kg"},"2023-08-24","STRINGER WG",155,"dessecação",{"$f":"IFERROR(VLOOKUP(E14,Nota_Fiscal!$G$4:$L$1000,6,0),\"\")","v":"herbicida"}]
["Defensivo Granulado","Cilo",{"$f":"IFERROR(VLOOKUP(A15,Insumos!A:B,2,FALSE),\"\")","v":"Kg"},"2023-08-30","STRINGER WG",40,"dessecação",{"$f":"IFERROR(VLOOKUP(E15,Nota_Fiscal!$G$4:$L$1000,6,0),\"\")","v":"herbicida"}]
["Defensivo Galão","Cilo",{"$f":"IFERROR(VLOOKUP(A16,Insumos!A:B,2,FALSE),\"\")","v":"Lt"},"2023-08-30","CLETODIM CCAB EC",15,"dessecação",{"$f":"IFERROR(VLOOKUP(E16,Nota_Fiscal!$G$4:$L$1000,6,0),\"\")","v":"herbicida"}]
["Defensivo Galão","Cilo",{"$f":"IFERROR(VLOOKUP(A17,Insumos!A:B,2,FALSE),\"\")","v":"Lt"},"2023-08-30","CADDET BB",7.5,"dessecação",{"$f":"IFERROR(VLOOKUP(E17,Nota_Fiscal!$G$4:$L$1000,6,0),\"\")","v":"óleo"}]
["Defensivo Galão","Cilo",{"$f":"IFERROR(VLOOKUP(A18,Insumos!A:B,2,FALSE),\"\")","v":"Lt"},"2023-08-30","ATUMUS TANDER",1,"dessecação",{"$f":"IFERROR(VLOOKUP(E18,Nota_Fiscal!$G$4:$L$1000,6,0),\"\")","v":"Adjuvante"}]
["Defensivo Granulado","Culhambi",{"$f":"IFERROR(VLOOKUP(A19,Insumos!A:B,2,FALSE),\"\")","v":"Kg"},"2023-08-30","STRINGER WG",40,"dessecação",{"$f":"IFERROR(VLOOKUP(E19,Nota_Fiscal!$G$4:$L$1000,6,0),\"\")","v":"herbicida"}]
["Defensivo Galão","Culhambi",{"$f":"IFERROR(VLOOKUP(A20,Insumos!A:B,2,FALSE),\"\")","v":"Lt"},"2023-08-30","CLETODIM CCAB EC",15,"dessecação",{"$f":"IFERROR(VLOOKUP(E20,Nota_Fiscal!$G$4:$L$1000,6,0),\"\")","v":"herbicida"}]
["Defensivo Galão","Culhambi",{"$f":"IFERROR(VLOOKUP(A21,Insumos!A:B,2,FALSE),\"\")","v":"Lt"},"2023-08-30","CADDET BB",7.5,"dessecação",{"$f":"IFERROR(VLOOKUP(E21,Nota_Fiscal!$G$4:$L$1000,6,0),\"\")","v":"óleo"}]
["Defensivo Galão","Culhambi",{"$f":"IFERROR(VLOOKUP(A22,Insumos!A:B,2,FALSE),\"\")","v":"Lt"},"2023-08-30","ATUMUS TANDER",1,"dessecação",{"$f":"IFERROR(VLOOKUP(E22,Nota_Fiscal!$G$4:$L$1000,6,0),\"\")","v":"Adjuvante"}]
["Defensivo Galão",5,{"$f":"IFERROR(VLOOKUP(A23,Insumos!A:B,2,FALSE),\"\")","v":"Lt"},"2023-08-30","STRINGER WG",45,"dessecação",{"$f":"IFERROR(VLOOKUP(E23,Nota_Fiscal!$G$4:$L$1000,6,0),\"\")","v":"herbicida"}]
["Defensivo Galão",5,{"$f":"IFERROR(VLOOKUP(A24,Insumos!A:B,2,FALSE),\"\")","v":"Lt"},"2023-08-30","CLETODIM CCAB EC",18,"dessecação",{"$f":"IFERROR(VLOOKUP(E24,Nota_Fiscal!$G$4:$L$1000,6,0),\"\")","v":"herbicida"}]
["Defensivo Galão",5,{"$f":"IFERROR(VLOOKUP(A25,Insumos!A:B,2,FALSE),\"\")","v":"Lt"},"2023-08-30","CADDET BB",9,"dessecação",{"$f":"IFERROR(VLOOKUP(E25,Nota_Fiscal!$G$4:$L$1000,6,0),\"\")","v":"óleo"}]
["Defensivo Galão",5,{"$f":"IFERROR(VLOOKUP(A26,Insumos!A:B,2,FALSE),\"\")","v":"Lt"},"2023-08-30","ATUMUS TANDER",1,"dessecação",{"$f":"IFERROR(VLOOKUP(E26,Nota_Fiscal!$G$4:$L$1000,6,0),\"\")","v":"Adjuvante"}]
["Defensivo Galão",5,{"$f":"IFERROR(VLOOKUP(A27,Insumos!A:B,2,FALSE),\"\")","v":"Lt"},"2023-08-31","AURORA",2,"dessecação",{"$f":"IFERROR(VLOOKUP(E27,Nota_Fiscal!$G$4:$L$1000,6,0),\"\")","v":""}]
["Defensivo Galão",5,{"$f":"IFERROR(VLOOKUP(A28,Insumos!A:B,2,FALSE),\"\")","v":"Lt"},"2023-08-31","STRINGER WG",90,"dessecação",{"$f":"IFERROR(VLOOKUP(E28,Nota_Fiscal!$G$4:$L$1000,6,0),\"\")","v":"herbicida"}]
["Defensivo Galão",5,{"$f":"IFERROR(VLOOKUP(A29,Insumos!A:B,2,FALSE),\"\")","v":"Lt"},"2023-08-31","CLETODIM CCAB EC",36,"dessecação",{"$f":"IFERROR(VLOOKUP(E29,Nota_Fiscal!$G$4:$L$1000,6,0),\"\")","v":"herbicida"}]
["Defensivo Galão",5,{"$f":"IFERROR(VLOOKUP(A30,Insumos!A:B,2,FALSE),\"\")","v":"Lt"},"2023-08-31","CADDET BB",18,"dessecação",{"$f":"IFERROR(VLOOKUP(E30,Nota_Fiscal!$G$4:$L$1000,6,0),\"\")","v":"óleo"}]
["Defensivo Galão",5,{"$f":"IFERROR(VLOOKUP(A31,Insumos!A:B,2,FALSE),\"\")","v":"Lt"},"2023-08-31","ATUMUS TANDER",2,"dessecação",{"$f":"IFERROR(VLOOKUP(E31,Nota_Fiscal!$G$4:$L$1000,6,0),\"\")","v":"Adjuvante"}]
["Defensivo Galão",5,{"$f":"IFERROR(VLOOKUP(A32,Insumos!A:B,2,FALSE),\"\")","v":"Lt"},"2023-08-31","AURORA",2,"dessecação",{"$f":"IFERROR(VLOOKUP(E32,Nota_Fiscal!$G$4:$L$1000,6,0),\"\")","v":""}]
["Defensivo Galão",4,{"$f":"IFERROR(VLOOKUP(A33,Insumos!A:B,2,FALSE),\"\")","v":"Lt"},"2023-08-31","STRINGER WG",65,"dessecação",{"$f":"IFERROR(VLOOKUP(E33,Nota_Fiscal!$G$4:$L$1000,6,0),\"\")","v":"herbicida"}]
["Defensivo Galão",4,{"$f":"IFERROR(VLOOKUP(A34,Insumos!A:B,2,FALSE),\"\")","v":"Lt"},"2023-08-31","CLETODIM CCAB EC",27,"dessecação",{"$f":"IFERROR(VLOOKUP(E34,Nota_Fiscal!$G$4:$L$1000,6,0),\"\")","v":"herbicida"}]
["Defensivo Galão",4,{"$f":"IFERROR(VLOOKUP(A35,Insumos!A:B,2,FALSE),\"\")","v":"Lt"},"2023-08-31","CADDET BB",13.5,"dessecação",{"$f":"IFERROR(VLOOKUP(E35,Nota_Fiscal!$G$4:$L$1000,6,0),\"\")","v":"óleo"}]
["Defensivo Galão",4,{"$f":"IFERROR(VLOOKUP(A36,Insumos!A:B,2,FALSE),\"\")","v":"Lt"},"2023-08-31","ATUMUS TANDER",1.5,"dessecação",{"$f":"IFERROR(VLOOKUP(E36,Nota_Fiscal!$G$4:$L$1000,6,0),\"\")","v":"Adjuvante"}]
[null,null,{"$f":"IFERROR(VLOOKUP(A37,Insumos!A:B,2,FALSE),\"\")","v":""},null,null,null,null,{"$f":"IFERROR(VLOOKUP(E37,Nota_Fiscal!$G$4:$L$1000,6,0),\"\")","v":""}]
[null,null,{"$f":"IFERROR(VLOOKUP(A38,Insumos!A:B,2,FALSE),\"\")","v":""},null,null,null,null,{"$f":"IFERROR(VLOOKUP(E38,Nota_Fiscal!$G$4:$L$1000,6,0),\"\")","v":""}]

{"sheet":"Atividade","index":4,"n_rows":15,"n_cols":1,"rows_kept":15,"cut":false,"hidden":true,"merged":[],"read":"row_number_cap"}
["CADASTRO DE ATIVIDADES"]
[]
["NOME DA ATIVIDADE"]
["soja"]
["milho"]
["sorgo"]
["milheto"]
["herbicida"]
["fungicida"]
["inseticida"]
["Adjuvante"]
["óleo"]
["Sequencial"]
["Adjuvante"]
["dessecação"]

{"sheet":"Unidade","index":5,"n_rows":8,"n_cols":1,"rows_kept":8,"cut":false,"hidden":true,"merged":[]}
["CADASTRO DE UNIDADE"]
[]
["Unidade"]
["Kg"]
["Lt"]
["Un"]
["Bag"]
["Saco"]

{"sheet":"Insumos","index":6,"n_rows":9,"n_cols":3,"rows_kept":9,"cut":false,"hidden":true,"merged":[[0,0,0,2]]}
["INSUMOS POR CLASSE"]
[]
["INSUMO","UNIDADE","ESTOQUE INICIAL"]
["Adubo","Kg"]
["Defensivo Galão","Lt"]
["Defensivo Granulado","Kg"]
["Cloreto","Kg"]
["Semente de Soja","Kg"]
["Semente de milho","Kg"]

{"sheet":"Produtos","index":7,"n_rows":134,"n_cols":3,"rows_kept":134,"cut":false,"hidden":false,"merged":[[0,0,1,2]]}
["Produtos"]
[]
["Nome","Entrada","Saida"]
[{"$f":"IFERROR(INDEX(Nota_Fiscal!$G$4:$G$2504,MATCH(0,COUNTIF($A$3:A3,Nota_Fiscal!$G$4:$G$2504),0)),\"\")","v":"OFF ROAD"},{"$f":"SUMIFS(Nota_Fiscal!I4:I2504,Nota_Fiscal!G4:G2504,Tabela1[[#This Row],[Nome]])","v":600},{"$f":"SUMIFS(Saída!$F$4:$F$38,Saída!E$4:E$38,Tabela1[[#This Row],[Nome]])","v":220}]
[{"$f":"IFERROR(INDEX(Nota_Fiscal!$G$4:$G$2504,MATCH(0,COUNTIF($A$3:A4,Nota_Fiscal!$G$4:$G$2504),0)),\"\")","v":"POQUER "},{"$f":"SUMIFS(Nota_Fiscal!I5:I2505,Nota_Fiscal!G5:G2505,Tabela1[[#This Row],[Nome]])","v":480},{"$f":"SUMIFS(Saída!$F$4:$F$38,Saída!E$4:E$38,Tabela1[[#This Row],[Nome]])","v":0}]
[{"$f":"IFERROR(INDEX(Nota_Fiscal!$G$4:$G$2504,MATCH(0,COUNTIF($A$3:A5,Nota_Fiscal!$G$4:$G$2504),0)),\"\")","v":"IHARA GOLD"},{"$f":"SUMIFS(Nota_Fiscal!I6:I2506,Nota_Fiscal!G6:G2506,Tabela1[[#This Row],[Nome]])","v":360},{"$f":"SUMIFS(Saída!$F$4:$F$38,Saída!E$4:E$38,Tabela1[[#This Row],[Nome]])","v":80}]
[{"$f":"IFERROR(INDEX(Nota_Fiscal!$G$4:$G$2504,MATCH(0,COUNTIF($A$3:A6,Nota_Fiscal!$G$4:$G$2504),0)),\"\")","v":"TRICLON"},{"$f":"SUMIFS(Nota_Fiscal!I7:I2507,Nota_Fiscal!G7:G2507,Tabela1[[#This Row],[Nome]])","v":460},{"$f":"SUMIFS(Saída!$F$4:$F$38,Saída!E$4:E$38,Tabela1[[#This Row],[Nome]])","v":255}]
[{"$f":"IFERROR(INDEX(Nota_Fiscal!$G$4:$G$2504,MATCH(0,COUNTIF($A$3:A7,Nota_Fiscal!$G$4:$G$2504),0)),\"\")","v":"STRINGER WG"},{"$f":"SUMIFS(Nota_Fiscal!I8:I2508,Nota_Fiscal!G8:G2508,Tabela1[[#This Row],[Nome]])","v":2000},{"$f":"SUMIFS(Saída!$F$4:$F$38,Saída!E$4:E$38,Tabela1[[#This Row],[Nome]])","v":775}]
[{"$f":"IFERROR(INDEX(Nota_Fiscal!$G$4:$G$2504,MATCH(0,COUNTIF($A$3:A8,Nota_Fiscal!$G$4:$G$2504),0)),\"\")","v":"CADDET BB"},{"$f":"SUMIFS(Nota_Fiscal!I9:I2509,Nota_Fiscal!G9:G2509,Tabela1[[#This Row],[Nome]])","v":120},{"$f":"SUMIFS(Saída!$F$4:$F$38,Saída!E$4:E$38,Tabela1[[#This Row],[Nome]])","v":55.5}]
[{"$f":"IFERROR(INDEX(Nota_Fiscal!$G$4:$G$2504,MATCH(0,COUNTIF($A$3:A9,Nota_Fiscal!$G$4:$G$2504),0)),\"\")","v":"SAPEK MAX 880"},{"$f":"SUMIFS(Nota_Fiscal!I10:I2510,Nota_Fiscal!G10:G2510,Tabela1[[#This Row],[Nome]])","v":175},{"$f":"SUMIFS(Saída!$F$4:$F$38,Saída!E$4:E$38,Tabela1[[#This Row],[Nome]])","v":0}]
[{"$f":"IFERROR(INDEX(Nota_Fiscal!$G$4:$G$2504,MATCH(0,COUNTIF($A$3:A10,Nota_Fiscal!$G$4:$G$2504),0)),\"\")","v":"CLETODIM CCAB EC"},{"$f":"SUMIFS(Nota_Fiscal!I11:I2511,Nota_Fiscal!G11:G2511,Tabela1[[#This Row],[Nome]])","v":360},{"$f":"SUMIFS(Saída!$F$4:$F$38,Saída!E$4:E$38,Tabela1[[#This Row],[Nome]])","v":111}]
[{"$f":"IFERROR(INDEX(Nota_Fiscal!$G$4:$G$2504,MATCH(0,COUNTIF($A$3:A11,Nota_Fiscal!$G$4:$G$2504),0)),\"\")","v":"ATUMUS TANDER"},{"$f":"SUMIFS(Nota_Fiscal!I12:I2512,Nota_Fiscal!G12:G2512,Tabela1[[#This Row],[Nome]])","v":100},{"$f":"SUMIFS(Saída!$F$4:$F$38,Saída!E$4:E$38,Tabela1[[#This Row],[Nome]])","v":6.5}]
[{"$f":"IFERROR(INDEX(Nota_Fiscal!$G$4:$G$2504,MATCH(0,COUNTIF($A$3:A12,Nota_Fiscal!$G$4:$G$2504),0)),\"\")","v":0},{"$f":"SUMIFS(Nota_Fiscal!I13:I2513,Nota_Fiscal!G13:G2513,Tabela1[[#This Row],[Nome]])","v":0},{"$f":"SUMIFS(Saída!$F$4:$F$38,Saída!E$4:E$38,Tabela1[[#This Row],[Nome]])","v":0}]
[{"$f":"IFERROR(INDEX(Nota_Fiscal!$G$4:$G$2504,MATCH(0,COUNTIF($A$3:A13,Nota_Fiscal!$G$4:$G$2504),0)),\"\")","v":""},{"$f":"SUMIFS(Nota_Fiscal!I14:I2514,Nota_Fiscal!G14:G2514,Tabela1[[#This Row],[Nome]])","v":0},{"$f":"SUMIFS(Saída!$F$4:$F$38,Saída!E$4:E$38,Tabela1[[#This Row],[Nome]])","v":0}]
[{"$f":"IFERROR(INDEX(Nota_Fiscal!$G$4:$G$2504,MATCH(0,COUNTIF($A$3:A14,Nota_Fiscal!$G$4:$G$2504),0)),\"\")","v":""},{"$f":"SUMIFS(Nota_Fiscal!I15:I2515,Nota_Fiscal!G15:G2515,Tabela1[[#This Row],[Nome]])","v":0},{"$f":"SUMIFS(Saída!$F$4:$F$38,Saída!E$4:E$38,Tabela1[[#This Row],[Nome]])","v":0}]
[{"$f":"IFERROR(INDEX(Nota_Fiscal!$G$4:$G$2504,MATCH(0,COUNTIF($A$3:A15,Nota_Fiscal!$G$4:$G$2504),0)),\"\")","v":""},{"$f":"SUMIFS(Nota_Fiscal!I16:I2516,Nota_Fiscal!G16:G2516,Tabela1[[#This Row],[Nome]])","v":0},{"$f":"SUMIFS(Saída!$F$4:$F$38,Saída!E$4:E$38,Tabela1[[#This Row],[Nome]])","v":0}]
[{"$f":"IFERROR(INDEX(Nota_Fiscal!$G$4:$G$2504,MATCH(0,COUNTIF($A$3:A16,Nota_Fiscal!$G$4:$G$2504),0)),\"\")","v":""},{"$f":"SUMIFS(Nota_Fiscal!I17:I2517,Nota_Fiscal!G17:G2517,Tabela1[[#This Row],[Nome]])","v":0},{"$f":"SUMIFS(Saída!$F$4:$F$38,Saída!E$4:E$38,Tabela1[[#This Row],[Nome]])","v":0}]
[{"$f":"IFERROR(INDEX(Nota_Fiscal!$G$4:$G$2504,MATCH(0,COUNTIF($A$3:A17,Nota_Fiscal!$G$4:$G$2504),0)),\"\")","v":""},{"$f":"SUMIFS(Nota_Fiscal!I18:I2518,Nota_Fiscal!G18:G2518,Tabela1[[#This Row],[Nome]])","v":0},{"$f":"SUMIFS(Saída!$F$4:$F$38,Saída!E$4:E$38,Tabela1[[#This Row],[Nome]])","v":0}]
[{"$f":"IFERROR(INDEX(Nota_Fiscal!$G$4:$G$2504,MATCH(0,COUNTIF($A$3:A18,Nota_Fiscal!$G$4:$G$2504),0)),\"\")","v":""},{"$f":"SUMIFS(Nota_Fiscal!I19:I2519,Nota_Fiscal!G19:G2519,Tabela1[[#This Row],[Nome]])","v":0},{"$f":"SUMIFS(Saída!$F$4:$F$38,Saída!E$4:E$38,Tabela1[[#This Row],[Nome]])","v":0}]
[{"$f":"IFERROR(INDEX(Nota_Fiscal!$G$4:$G$2504,MATCH(0,COUNTIF($A$3:A19,Nota_Fiscal!$G$4:$G$2504),0)),\"\")","v":""},{"$f":"SUMIFS(Nota_Fiscal!I20:I2520,Nota_Fiscal!G20:G2520,Tabela1[[#This Row],[Nome]])","v":0},{"$f":"SUMIFS(Saída!$F$4:$F$38,Saída!E$4:E$38,Tabela1[[#This Row],[Nome]])","v":0}]
[{"$f":"IFERROR(INDEX(Nota_Fiscal!$G$4:$G$2504,MATCH(0,COUNTIF($A$3:A20,Nota_Fiscal!$G$4:$G$2504),0)),\"\")","v":""},{"$f":"SUMIFS(Nota_Fiscal!I21:I2521,Nota_Fiscal!G21:G2521,Tabela1[[#This Row],[Nome]])","v":0},{"$f":"SUMIFS(Saída!$F$4:$F$38,Saída!E$4:E$38,Tabela1[[#This Row],[Nome]])","v":0}]
[{"$f":"IFERROR(INDEX(Nota_Fiscal!$G$4:$G$2504,MATCH(0,COUNTIF($A$3:A21,Nota_Fiscal!$G$4:$G$2504),0)),\"\")","v":""},{"$f":"SUMIFS(Nota_Fiscal!I22:I2522,Nota_Fiscal!G22:G2522,Tabela1[[#This Row],[Nome]])","v":0},{"$f":"SUMIFS(Saída!$F$4:$F$38,Saída!E$4:E$38,Tabela1[[#This Row],[Nome]])","v":0}]
[{"$f":"IFERROR(INDEX(Nota_Fiscal!$G$4:$G$2504,MATCH(0,COUNTIF($A$3:A22,Nota_Fiscal!$G$4:$G$2504),0)),\"\")","v":""},{"$f":"SUMIFS(Nota_Fiscal!I23:I2523,Nota_Fiscal!G23:G2523,Tabela1[[#This Row],[Nome]])","v":0},{"$f":"SUMIFS(Saída!$F$4:$F$38,Saída!E$4:E$38,Tabela1[[#This Row],[Nome]])","v":0}]
[{"$f":"IFERROR(INDEX(Nota_Fiscal!$G$4:$G$2504,MATCH(0,COUNTIF($A$3:A23,Nota_Fiscal!$G$4:$G$2504),0)),\"\")","v":""},{"$f":"SUMIFS(Nota_Fiscal!I24:I2524,Nota_Fiscal!G24:G2524,Tabela1[[#This Row],[Nome]])","v":0},{"$f":"SUMIFS(Saída!$F$4:$F$38,Saída!E$4:E$38,Tabela1[[#This Row],[Nome]])","v":0}]
[{"$f":"IFERROR(INDEX(Nota_Fiscal!$G$4:$G$2504,MATCH(0,COUNTIF($A$3:A24,Nota_Fiscal!$G$4:$G$2504),0)),\"\")","v":""},{"$f":"SUMIFS(Nota_Fiscal!I25:I2525,Nota_Fiscal!G25:G2525,Tabela1[[#This Row],[Nome]])","v":0},{"$f":"SUMIFS(Saída!$F$4:$F$38,Saída!E$4:E$38,Tabela1[[#This Row],[Nome]])","v":0}]
[{"$f":"IFERROR(INDEX(Nota_Fiscal!$G$4:$G$2504,MATCH(0,COUNTIF($A$3:A25,Nota_Fiscal!$G$4:$G$2504),0)),\"\")","v":""},{"$f":"SUMIFS(Nota_Fiscal!I26:I2526,Nota_Fiscal!G26:G2526,Tabela1[[#This Row],[Nome]])","v":0},{"$f":"SUMIFS(Saída!$F$4:$F$38,Saída!E$4:E$38,Tabela1[[#This Row],[Nome]])","v":0}]
[{"$f":"IFERROR(INDEX(Nota_Fiscal!$G$4:$G$2504,MATCH(0,COUNTIF($A$3:A26,Nota_Fiscal!$G$4:$G$2504),0)),\"\")","v":""},{"$f":"SUMIFS(Nota_Fiscal!I27:I2527,Nota_Fiscal!G27:G2527,Tabela1[[#This Row],[Nome]])","v":0},{"$f":"SUMIFS(Saída!$F$4:$F$38,Saída!E$4:E$38,Tabela1[[#This Row],[Nome]])","v":0}]
[{"$f":"IFERROR(INDEX(Nota_Fiscal!$G$4:$G$2504,MATCH(0,COUNTIF($A$3:A27,Nota_Fiscal!$G$4:$G$2504),0)),\"\")","v":""},{"$f":"SUMIFS(Nota_Fiscal!I28:I2528,Nota_Fiscal!G28:G2528,Tabela1[[#This Row],[Nome]])","v":0},{"$f":"SUMIFS(Saída!$F$4:$F$38,Saída!E$4:E$38,Tabela1[[#This Row],[Nome]])","v":0}]
[{"$f":"IFERROR(INDEX(Nota_Fiscal!$G$4:$G$2504,MATCH(0,COUNTIF($A$3:A28,Nota_Fiscal!$G$4:$G$2504),0)),\"\")","v":""},{"$f":"SUMIFS(Nota_Fiscal!I29:I2529,Nota_Fiscal!G29:G2529,Tabela1[[#This Row],[Nome]])","v":0},{"$f":"SUMIFS(Saída!$F$4:$F$38,Saída!E$4:E$38,Tabela1[[#This Row],[Nome]])","v":0}]
[{"$f":"IFERROR(INDEX(Nota_Fiscal!$G$4:$G$2504,MATCH(0,COUNTIF($A$3:A29,Nota_Fiscal!$G$4:$G$2504),0)),\"\")","v":""},{"$f":"SUMIFS(Nota_Fiscal!I30:I2530,Nota_Fiscal!G30:G2530,Tabela1[[#This Row],[Nome]])","v":0},{"$f":"SUMIFS(Saída!$F$4:$F$38,Saída!E$4:E$38,Tabela1[[#This Row],[Nome]])","v":0}]
[{"$f":"IFERROR(INDEX(Nota_Fiscal!$G$4:$G$2504,MATCH(0,COUNTIF($A$3:A30,Nota_Fiscal!$G$4:$G$2504),0)),\"\")","v":""},{"$f":"SUMIFS(Nota_Fiscal!I31:I2531,Nota_Fiscal!G31:G2531,Tabela1[[#This Row],[Nome]])","v":0},{"$f":"SUMIFS(Saída!$F$4:$F$38,Saída!E$4:E$38,Tabela1[[#This Row],[Nome]])","v":0}]
[{"$f":"IFERROR(INDEX(Nota_Fiscal!$G$4:$G$2504,MATCH(0,COUNTIF($A$3:A31,Nota_Fiscal!$G$4:$G$2504),0)),\"\")","v":""},{"$f":"SUMIFS(Nota_Fiscal!I32:I2532,Nota_Fiscal!G32:G2532,Tabela1[[#This Row],[Nome]])","v":0},{"$f":"SUMIFS(Saída!$F$4:$F$38,Saída!E$4:E$38,Tabela1[[#This Row],[Nome]])","v":0}]
[{"$f":"IFERROR(INDEX(Nota_Fiscal!$G$4:$G$2504,MATCH(0,COUNTIF($A$3:A32,Nota_Fiscal!$G$4:$G$2504),0)),\"\")","v":""},{"$f":"SUMIFS(Nota_Fiscal!I33:I2533,Nota_Fiscal!G33:G2533,Tabela1[[#This Row],[Nome]])","v":0},{"$f":"SUMIFS(Saída!$F$4:$F$38,Saída!E$4:E$38,Tabela1[[#This Row],[Nome]])","v":0}]
[{"$f":"IFERROR(INDEX(Nota_Fiscal!$G$4:$G$2504,MATCH(0,COUNTIF($A$3:A33,Nota_Fiscal!$G$4:$G$2504),0)),\"\")","v":""},{"$f":"SUMIFS(Nota_Fiscal!I34:I2534,Nota_Fiscal!G34:G2534,Tabela1[[#This Row],[Nome]])","v":0},{"$f":"SUMIFS(Saída!$F$4:$F$38,Saída!E$4:E$38,Tabela1[[#This Row],[Nome]])","v":0}]
[{"$f":"IFERROR(INDEX(Nota_Fiscal!$G$4:$G$2504,MATCH(0,COUNTIF($A$3:A34,Nota_Fiscal!$G$4:$G$2504),0)),\"\")","v":""},{"$f":"SUMIFS(Nota_Fiscal!I35:I2535,Nota_Fiscal!G35:G2535,Tabela1[[#This Row],[Nome]])","v":0},{"$f":"SUMIFS(Saída!$F$4:$F$38,Saída!E$4:E$38,Tabela1[[#This Row],[Nome]])","v":0}]
[{"$f":"IFERROR(INDEX(Nota_Fiscal!$G$4:$G$2504,MATCH(0,COUNTIF($A$3:A35,Nota_Fiscal!$G$4:$G$2504),0)),\"\")","v":""},{"$f":"SUMIFS(Nota_Fiscal!I36:I2536,Nota_Fiscal!G36:G2536,Tabela1[[#This Row],[Nome]])","v":0},{"$f":"SUMIFS(Saída!$F$4:$F$38,Saída!E$4:E$38,Tabela1[[#This Row],[Nome]])","v":0}]
[{"$f":"IFERROR(INDEX(Nota_Fiscal!$G$4:$G$2504,MATCH(0,COUNTIF($A$3:A36,Nota_Fiscal!$G$4:$G$2504),0)),\"\")","v":""},{"$f":"SUMIFS(Nota_Fiscal!I37:I2537,Nota_Fiscal!G37:G2537,Tabela1[[#This Row],[Nome]])","v":0},{"$f":"SUMIFS(Saída!$F$4:$F$38,Saída!E$4:E$38,Tabela1[[#This Row],[Nome]])","v":0}]
[{"$f":"IFERROR(INDEX(Nota_Fiscal!$G$4:$G$2504,MATCH(0,COUNTIF($A$3:A37,Nota_Fiscal!$G$4:$G$2504),0)),\"\")","v":""},{"$f":"SUMIFS(Nota_Fiscal!I38:I2538,Nota_Fiscal!G38:G2538,Tabela1[[#This Row],[Nome]])","v":0},{"$f":"SUMIFS(Saída!$F$4:$F$38,Saída!E$4:E$38,Tabela1[[#This Row],[Nome]])","v":0}]
[{"$f":"IFERROR(INDEX(Nota_Fiscal!$G$4:$G$2504,MATCH(0,COUNTIF($A$3:A38,Nota_Fiscal!$G$4:$G$2504),0)),\"\")","v":""},{"$f":"SUMIFS(Nota_Fiscal!I39:I2539,Nota_Fiscal!G39:G2539,Tabela1[[#This Row],[Nome]])","v":0},{"$f":"SUMIFS(Saída!$F$4:$F$38,Saída!E$4:E$38,Tabela1[[#This Row],[Nome]])","v":0}]
[{"$f":"IFERROR(INDEX(Nota_Fiscal!$G$4:$G$2504,MATCH(0,COUNTIF($A$3:A39,Nota_Fiscal!$G$4:$G$2504),0)),\"\")","v":""},{"$f":"SUMIFS(Nota_Fiscal!I40:I2540,Nota_Fiscal!G40:G2540,Tabela1[[#This Row],[Nome]])","v":0},{"$f":"SUMIFS(Saída!$F$4:$F$38,Saída!E$4:E$38,Tabela1[[#This Row],[Nome]])","v":0}]
[{"$f":"IFERROR(INDEX(Nota_Fiscal!$G$4:$G$2504,MATCH(0,COUNTIF($A$3:A40,Nota_Fiscal!$G$4:$G$2504),0)),\"\")","v":""},{"$f":"SUMIFS(Nota_Fiscal!I41:I2541,Nota_Fiscal!G41:G2541,Tabela1[[#This Row],[Nome]])","v":0},{"$f":"SUMIFS(Saída!$F$4:$F$38,Saída!E$4:E$38,Tabela1[[#This Row],[Nome]])","v":0}]
[{"$f":"IFERROR(INDEX(Nota_Fiscal!$G$4:$G$2504,MATCH(0,COUNTIF($A$3:A41,Nota_Fiscal!$G$4:$G$2504),0)),\"\")","v":""},{"$f":"SUMIFS(Nota_Fiscal!I42:I2542,Nota_Fiscal!G42:G2542,Tabela1[[#This Row],[Nome]])","v":0},{"$f":"SUMIFS(Saída!$F$4:$F$38,Saída!E$4:E$38,Tabela1[[#This Row],[Nome]])","v":0}]
[{"$f":"IFERROR(INDEX(Nota_Fiscal!$G$4:$G$2504,MATCH(0,COUNTIF($A$3:A42,Nota_Fiscal!$G$4:$G$2504),0)),\"\")","v":""},{"$f":"SUMIFS(Nota_Fiscal!I43:I2543,Nota_Fiscal!G43:G2543,Tabela1[[#This Row],[Nome]])","v":0},{"$f":"SUMIFS(Saída!$F$4:$F$38,Saída!E$4:E$38,Tabela1[[#This Row],[Nome]])","v":0}]
[{"$f":"IFERROR(INDEX(Nota_Fiscal!$G$4:$G$2504,MATCH(0,COUNTIF($A$3:A43,Nota_Fiscal!$G$4:$G$2504),0)),\"\")","v":""},{"$f":"SUMIFS(Nota_Fiscal!I44:I2544,Nota_Fiscal!G44:G2544,Tabela1[[#This Row],[Nome]])","v":0},{"$f":"SUMIFS(Saída!$F$4:$F$38,Saída!E$4:E$38,Tabela1[[#This Row],[Nome]])","v":0}]
[{"$f":"IFERROR(INDEX(Nota_Fiscal!$G$4:$G$2504,MATCH(0,COUNTIF($A$3:A44,Nota_Fiscal!$G$4:$G$2504),0)),\"\")","v":""},{"$f":"SUMIFS(Nota_Fiscal!I45:I2545,Nota_Fiscal!G45:G2545,Tabela1[[#This Row],[Nome]])","v":0},{"$f":"SUMIFS(Saída!$F$4:$F$38,Saída!E$4:E$38,Tabela1[[#This Row],[Nome]])","v":0}]
[{"$f":"IFERROR(INDEX(Nota_Fiscal!$G$4:$G$2504,MATCH(0,COUNTIF($A$3:A45,Nota_Fiscal!$G$4:$G$2504),0)),\"\")","v":""},{"$f":"SUMIFS(Nota_Fiscal!I46:I2546,Nota_Fiscal!G46:G2546,Tabela1[[#This Row],[Nome]])","v":0},{"$f":"SUMIFS(Saída!$F$4:$F$38,Saída!E$4:E$38,Tabela1[[#This Row],[Nome]])","v":0}]
[{"$f":"IFERROR(INDEX(Nota_Fiscal!$G$4:$G$2504,MATCH(0,COUNTIF($A$3:A46,Nota_Fiscal!$G$4:$G$2504),0)),\"\")","v":""},{"$f":"SUMIFS(Nota_Fiscal!I47:I2547,Nota_Fiscal!G47:G2547,Tabela1[[#This Row],[Nome]])","v":0},{"$f":"SUMIFS(Saída!$F$4:$F$38,Saída!E$4:E$38,Tabela1[[#This Row],[Nome]])","v":0}]
[{"$f":"IFERROR(INDEX(Nota_Fiscal!$G$4:$G$2504,MATCH(0,COUNTIF($A$3:A47,Nota_Fiscal!$G$4:$G$2504),0)),\"\")","v":""},{"$f":"SUMIFS(Nota_Fiscal!I48:I2548,Nota_Fiscal!G48:G2548,Tabela1[[#This Row],[Nome]])","v":0},{"$f":"SUMIFS(Saída!$F$4:$F$38,Saída!E$4:E$38,Tabela1[[#This Row],[Nome]])","v":0}]
[{"$f":"IFERROR(INDEX(Nota_Fiscal!$G$4:$G$2504,MATCH(0,COUNTIF($A$3:A48,Nota_Fiscal!$G$4:$G$2504),0)),\"\")","v":""},{"$f":"SUMIFS(Nota_Fiscal!I49:I2549,Nota_Fiscal!G49:G2549,Tabela1[[#This Row],[Nome]])","v":0},{"$f":"SUMIFS(Saída!$F$4:$F$38,Saída!E$4:E$38,Tabela1[[#This Row],[Nome]])","v":0}]
[{"$f":"IFERROR(INDEX(Nota_Fiscal!$G$4:$G$2504,MATCH(0,COUNTIF($A$3:A49,Nota_Fiscal!$G$4:$G$2504),0)),\"\")","v":""},{"$f":"SUMIFS(Nota_Fiscal!I50:I2550,Nota_Fiscal!G50:G2550,Tabela1[[#This Row],[Nome]])","v":0},{"$f":"SUMIFS(Saída!$F$4:$F$38,Saída!E$4:E$38,Tabela1[[#This Row],[Nome]])","v":0}]
[{"$f":"IFERROR(INDEX(Nota_Fiscal!$G$4:$G$2504,MATCH(0,COUNTIF($A$3:A50,Nota_Fiscal!$G$4:$G$2504),0)),\"\")","v":""},{"$f":"SUMIFS(Nota_Fiscal!I51:I2551,Nota_Fiscal!G51:G2551,Tabela1[[#This Row],[Nome]])","v":0},{"$f":"SUMIFS(Saída!$F$4:$F$38,Saída!E$4:E$38,Tabela1[[#This Row],[Nome]])","v":0}]
[{"$f":"IFERROR(INDEX(Nota_Fiscal!$G$4:$G$2504,MATCH(0,COUNTIF($A$3:A51,Nota_Fiscal!$G$4:$G$2504),0)),\"\")","v":""},{"$f":"SUMIFS(Nota_Fiscal!I52:I2552,Nota_Fiscal!G52:G2552,Tabela1[[#This Row],[Nome]])","v":0},{"$f":"SUMIFS(Saída!$F$4:$F$38,Saída!E$4:E$38,Tabela1[[#This Row],[Nome]])","v":0}]
[{"$f":"IFERROR(INDEX(Nota_Fiscal!$G$4:$G$2504,MATCH(0,COUNTIF($A$3:A52,Nota_Fiscal!$G$4:$G$2504),0)),\"\")","v":""},{"$f":"SUMIFS(Nota_Fiscal!I53:I2553,Nota_Fiscal!G53:G2553,Tabela1[[#This Row],[Nome]])","v":0},{"$f":"SUMIFS(Saída!$F$4:$F$38,Saída!E$4:E$38,Tabela1[[#This Row],[Nome]])","v":0}]
[{"$f":"IFERROR(INDEX(Nota_Fiscal!$G$4:$G$2504,MATCH(0,COUNTIF($A$3:A53,Nota_Fiscal!$G$4:$G$2504),0)),\"\")","v":""},{"$f":"SUMIFS(Nota_Fiscal!I54:I2554,Nota_Fiscal!G54:G2554,Tabela1[[#This Row],[Nome]])","v":0},{"$f":"SUMIFS(Saída!$F$4:$F$38,Saída!E$4:E$38,Tabela1[[#This Row],[Nome]])","v":0}]
[{"$f":"IFERROR(INDEX(Nota_Fiscal!$G$4:$G$2504,MATCH(0,COUNTIF($A$3:A54,Nota_Fiscal!$G$4:$G$2504),0)),\"\")","v":""},{"$f":"SUMIFS(Nota_Fiscal!I55:I2555,Nota_Fiscal!G55:G2555,Tabela1[[#This Row],[Nome]])","v":0},{"$f":"SUMIFS(Saída!$F$4:$F$38,Saída!E$4:E$38,Tabela1[[#This Row],[Nome]])","v":0}]
[{"$f":"IFERROR(INDEX(Nota_Fiscal!$G$4:$G$2504,MATCH(0,COUNTIF($A$3:A55,Nota_Fiscal!$G$4:$G$2504),0)),\"\")","v":""},{"$f":"SUMIFS(Nota_Fiscal!I56:I2556,Nota_Fiscal!G56:G2556,Tabela1[[#This Row],[Nome]])","v":0},{"$f":"SUMIFS(Saída!$F$4:$F$38,Saída!E$4:E$38,Tabela1[[#This Row],[Nome]])","v":0}]
[{"$f":"IFERROR(INDEX(Nota_Fiscal!$G$4:$G$2504,MATCH(0,COUNTIF($A$3:A56,Nota_Fiscal!$G$4:$G$2504),0)),\"\")","v":""},{"$f":"SUMIFS(Nota_Fiscal!I57:I2557,Nota_Fiscal!G57:G2557,Tabela1[[#This Row],[Nome]])","v":0},{"$f":"SUMIFS(Saída!$F$4:$F$38,Saída!E$4:E$38,Tabela1[[#This Row],[Nome]])","v":0}]
[{"$f":"IFERROR(INDEX(Nota_Fiscal!$G$4:$G$2504,MATCH(0,COUNTIF($A$3:A57,Nota_Fiscal!$G$4:$G$2504),0)),\"\")","v":""},{"$f":"SUMIFS(Nota_Fiscal!I58:I2558,Nota_Fiscal!G58:G2558,Tabela1[[#This Row],[Nome]])","v":0},{"$f":"SUMIFS(Saída!$F$4:$F$38,Saída!E$4:E$38,Tabela1[[#This Row],[Nome]])","v":0}]
[{"$f":"IFERROR(INDEX(Nota_Fiscal!$G$4:$G$2504,MATCH(0,COUNTIF($A$3:A58,Nota_Fiscal!$G$4:$G$2504),0)),\"\")","v":""},{"$f":"SUMIFS(Nota_Fiscal!I59:I2559,Nota_Fiscal!G59:G2559,Tabela1[[#This Row],[Nome]])","v":0},{"$f":"SUMIFS(Saída!$F$4:$F$38,Saída!E$4:E$38,Tabela1[[#This Row],[Nome]])","v":0}]
[{"$f":"IFERROR(INDEX(Nota_Fiscal!$G$4:$G$2504,MATCH(0,COUNTIF($A$3:A59,Nota_Fiscal!$G$4:$G$2504),0)),\"\")","v":""},{"$f":"SUMIFS(Nota_Fiscal!I60:I2560,Nota_Fiscal!G60:G2560,Tabela1[[#This Row],[Nome]])","v":0},{"$f":"SUMIFS(Saída!$F$4:$F$38,Saída!E$4:E$38,Tabela1[[#This Row],[Nome]])","v":0}]
[{"$f":"IFERROR(INDEX(Nota_Fiscal!$G$4:$G$2504,MATCH(0,COUNTIF($A$3:A60,Nota_Fiscal!$G$4:$G$2504),0)),\"\")","v":""},{"$f":"SUMIFS(Nota_Fiscal!I61:I2561,Nota_Fiscal!G61:G2561,Tabela1[[#This Row],[Nome]])","v":0},{"$f":"SUMIFS(Saída!$F$4:$F$38,Saída!E$4:E$38,Tabela1[[#This Row],[Nome]])","v":0}]
[{"$f":"IFERROR(INDEX(Nota_Fiscal!$G$4:$G$2504,MATCH(0,COUNTIF($A$3:A61,Nota_Fiscal!$G$4:$G$2504),0)),\"\")","v":""},{"$f":"SUMIFS(Nota_Fiscal!I62:I2562,Nota_Fiscal!G62:G2562,Tabela1[[#This Row],[Nome]])","v":0},{"$f":"SUMIFS(Saída!$F$4:$F$38,Saída!E$4:E$38,Tabela1[[#This Row],[Nome]])","v":0}]
[{"$f":"IFERROR(INDEX(Nota_Fiscal!$G$4:$G$2504,MATCH(0,COUNTIF($A$3:A62,Nota_Fiscal!$G$4:$G$2504),0)),\"\")","v":""},{"$f":"SUMIFS(Nota_Fiscal!I63:I2563,Nota_Fiscal!G63:G2563,Tabela1[[#This Row],[Nome]])","v":0},{"$f":"SUMIFS(Saída!$F$4:$F$38,Saída!E$4:E$38,Tabela1[[#This Row],[Nome]])","v":0}]
[{"$f":"IFERROR(INDEX(Nota_Fiscal!$G$4:$G$2504,MATCH(0,COUNTIF($A$3:A63,Nota_Fiscal!$G$4:$G$2504),0)),\"\")","v":""},{"$f":"SUMIFS(Nota_Fiscal!I64:I2564,Nota_Fiscal!G64:G2564,Tabela1[[#This Row],[Nome]])","v":0},{"$f":"SUMIFS(Saída!$F$4:$F$38,Saída!E$4:E$38,Tabela1[[#This Row],[Nome]])","v":0}]
[{"$f":"IFERROR(INDEX(Nota_Fiscal!$G$4:$G$2504,MATCH(0,COUNTIF($A$3:A64,Nota_Fiscal!$G$4:$G$2504),0)),\"\")","v":""},{"$f":"SUMIFS(Nota_Fiscal!I65:I2565,Nota_Fiscal!G65:G2565,Tabela1[[#This Row],[Nome]])","v":0},{"$f":"SUMIFS(Saída!$F$4:$F$38,Saída!E$4:E$38,Tabela1[[#This Row],[Nome]])","v":0}]
[{"$f":"IFERROR(INDEX(Nota_Fiscal!$G$4:$G$2504,MATCH(0,COUNTIF($A$3:A65,Nota_Fiscal!$G$4:$G$2504),0)),\"\")","v":""},{"$f":"SUMIFS(Nota_Fiscal!I66:I2566,Nota_Fiscal!G66:G2566,Tabela1[[#This Row],[Nome]])","v":0},{"$f":"SUMIFS(Saída!$F$4:$F$38,Saída!E$4:E$38,Tabela1[[#This Row],[Nome]])","v":0}]
[{"$f":"IFERROR(INDEX(Nota_Fiscal!$G$4:$G$2504,MATCH(0,COUNTIF($A$3:A66,Nota_Fiscal!$G$4:$G$2504),0)),\"\")","v":""},{"$f":"SUMIFS(Nota_Fiscal!I67:I2567,Nota_Fiscal!G67:G2567,Tabela1[[#This Row],[Nome]])","v":0},{"$f":"SUMIFS(Saída!$F$4:$F$38,Saída!E$4:E$38,Tabela1[[#This Row],[Nome]])","v":0}]
[{"$f":"IFERROR(INDEX(Nota_Fiscal!$G$4:$G$2504,MATCH(0,COUNTIF($A$3:A67,Nota_Fiscal!$G$4:$G$2504),0)),\"\")","v":""},{"$f":"SUMIFS(Nota_Fiscal!I68:I2568,Nota_Fiscal!G68:G2568,Tabela1[[#This Row],[Nome]])","v":0},{"$f":"SUMIFS(Saída!$F$4:$F$38,Saída!E$4:E$38,Tabela1[[#This Row],[Nome]])","v":0}]
[{"$f":"IFERROR(INDEX(Nota_Fiscal!$G$4:$G$2504,MATCH(0,COUNTIF($A$3:A68,Nota_Fiscal!$G$4:$G$2504),0)),\"\")","v":""},{"$f":"SUMIFS(Nota_Fiscal!I69:I2569,Nota_Fiscal!G69:G2569,Tabela1[[#This Row],[Nome]])","v":0},{"$f":"SUMIFS(Saída!$F$4:$F$38,Saída!E$4:E$38,Tabela1[[#This Row],[Nome]])","v":0}]
[{"$f":"IFERROR(INDEX(Nota_Fiscal!$G$4:$G$2504,MATCH(0,COUNTIF($A$3:A69,Nota_Fiscal!$G$4:$G$2504),0)),\"\")","v":""},{"$f":"SUMIFS(Nota_Fiscal!I70:I2570,Nota_Fiscal!G70:G2570,Tabela1[[#This Row],[Nome]])","v":0},{"$f":"SUMIFS(Saída!$F$4:$F$38,Saída!E$4:E$38,Tabela1[[#This Row],[Nome]])","v":0}]
[{"$f":"IFERROR(INDEX(Nota_Fiscal!$G$4:$G$2504,MATCH(0,COUNTIF($A$3:A70,Nota_Fiscal!$G$4:$G$2504),0)),\"\")","v":""},{"$f":"SUMIFS(Nota_Fiscal!I71:I2571,Nota_Fiscal!G71:G2571,Tabela1[[#This Row],[Nome]])","v":0},{"$f":"SUMIFS(Saída!$F$4:$F$38,Saída!E$4:E$38,Tabela1[[#This Row],[Nome]])","v":0}]
[{"$f":"IFERROR(INDEX(Nota_Fiscal!$G$4:$G$2504,MATCH(0,COUNTIF($A$3:A71,Nota_Fiscal!$G$4:$G$2504),0)),\"\")","v":""},{"$f":"SUMIFS(Nota_Fiscal!I72:I2572,Nota_Fiscal!G72:G2572,Tabela1[[#This Row],[Nome]])","v":0},{"$f":"SUMIFS(Saída!$F$4:$F$38,Saída!E$4:E$38,Tabela1[[#This Row],[Nome]])","v":0}]
[{"$f":"IFERROR(INDEX(Nota_Fiscal!$G$4:$G$2504,MATCH(0,COUNTIF($A$3:A72,Nota_Fiscal!$G$4:$G$2504),0)),\"\")","v":""},{"$f":"SUMIFS(Nota_Fiscal!I73:I2573,Nota_Fiscal!G73:G2573,Tabela1[[#This Row],[Nome]])","v":0},{"$f":"SUMIFS(Saída!$F$4:$F$38,Saída!E$4:E$38,Tabela1[[#This Row],[Nome]])","v":0}]
[{"$f":"IFERROR(INDEX(Nota_Fiscal!$G$4:$G$2504,MATCH(0,COUNTIF($A$3:A73,Nota_Fiscal!$G$4:$G$2504),0)),\"\")","v":""},{"$f":"SUMIFS(Nota_Fiscal!I74:I2574,Nota_Fiscal!G74:G2574,Tabela1[[#This Row],[Nome]])","v":0},{"$f":"SUMIFS(Saída!$F$4:$F$38,Saída!E$4:E$38,Tabela1[[#This Row],[Nome]])","v":0}]
[{"$f":"IFERROR(INDEX(Nota_Fiscal!$G$4:$G$2504,MATCH(0,COUNTIF($A$3:A74,Nota_Fiscal!$G$4:$G$2504),0)),\"\")","v":""},{"$f":"SUMIFS(Nota_Fiscal!I75:I2575,Nota_Fiscal!G75:G2575,Tabela1[[#This Row],[Nome]])","v":0},{"$f":"SUMIFS(Saída!$F$4:$F$38,Saída!E$4:E$38,Tabela1[[#This Row],[Nome]])","v":0}]
[{"$f":"IFERROR(INDEX(Nota_Fiscal!$G$4:$G$2504,MATCH(0,COUNTIF($A$3:A75,Nota_Fiscal!$G$4:$G$2504),0)),\"\")","v":""},{"$f":"SUMIFS(Nota_Fiscal!I76:I2576,Nota_Fiscal!G76:G2576,Tabela1[[#This Row],[Nome]])","v":0},{"$f":"SUMIFS(Saída!$F$4:$F$38,Saída!E$4:E$38,Tabela1[[#This Row],[Nome]])","v":0}]
[{"$f":"IFERROR(INDEX(Nota_Fiscal!$G$4:$G$2504,MATCH(0,COUNTIF($A$3:A76,Nota_Fiscal!$G$4:$G$2504),0)),\"\")","v":""},{"$f":"SUMIFS(Nota_Fiscal!I77:I2577,Nota_Fiscal!G77:G2577,Tabela1[[#This Row],[Nome]])","v":0},{"$f":"SUMIFS(Saída!$F$4:$F$38,Saída!E$4:E$38,Tabela1[[#This Row],[Nome]])","v":0}]
[{"$f":"IFERROR(INDEX(Nota_Fiscal!$G$4:$G$2504,MATCH(0,COUNTIF($A$3:A77,Nota_Fiscal!$G$4:$G$2504),0)),\"\")","v":""},{"$f":"SUMIFS(Nota_Fiscal!I78:I2578,Nota_Fiscal!G78:G2578,Tabela1[[#This Row],[Nome]])","v":0},{"$f":"SUMIFS(Saída!$F$4:$F$38,Saída!E$4:E$38,Tabela1[[#This Row],[Nome]])","v":0}]
[{"$f":"IFERROR(INDEX(Nota_Fiscal!$G$4:$G$2504,MATCH(0,COUNTIF($A$3:A78,Nota_Fiscal!$G$4:$G$2504),0)),\"\")","v":""},{"$f":"SUMIFS(Nota_Fiscal!I79:I2579,Nota_Fiscal!G79:G2579,Tabela1[[#This Row],[Nome]])","v":0},{"$f":"SUMIFS(Saída!$F$4:$F$38,Saída!E$4:E$38,Tabela1[[#This Row],[Nome]])","v":0}]
[{"$f":"IFERROR(INDEX(Nota_Fiscal!$G$4:$G$2504,MATCH(0,COUNTIF($A$3:A79,Nota_Fiscal!$G$4:$G$2504),0)),\"\")","v":""},{"$f":"SUMIFS(Nota_Fiscal!I80:I2580,Nota_Fiscal!G80:G2580,Tabela1[[#This Row],[Nome]])","v":0},{"$f":"SUMIFS(Saída!$F$4:$F$38,Saída!E$4:E$38,Tabela1[[#This Row],[Nome]])","v":0}]
[{"$f":"IFERROR(INDEX(Nota_Fiscal!$G$4:$G$2504,MATCH(0,COUNTIF($A$3:A80,Nota_Fiscal!$G$4:$G$2504),0)),\"\")","v":""},{"$f":"SUMIFS(Nota_Fiscal!I81:I2581,Nota_Fiscal!G81:G2581,Tabela1[[#This Row],[Nome]])","v":0},{"$f":"SUMIFS(Saída!$F$4:$F$38,Saída!E$4:E$38,Tabela1[[#This Row],[Nome]])","v":0}]
[{"$f":"IFERROR(INDEX(Nota_Fiscal!$G$4:$G$2504,MATCH(0,COUNTIF($A$3:A81,Nota_Fiscal!$G$4:$G$2504),0)),\"\")","v":""},{"$f":"SUMIFS(Nota_Fiscal!I82:I2582,Nota_Fiscal!G82:G2582,Tabela1[[#This Row],[Nome]])","v":0},{"$f":"SUMIFS(Saída!$F$4:$F$38,Saída!E$4:E$38,Tabela1[[#This Row],[Nome]])","v":0}]
[{"$f":"IFERROR(INDEX(Nota_Fiscal!$G$4:$G$2504,MATCH(0,COUNTIF($A$3:A82,Nota_Fiscal!$G$4:$G$2504),0)),\"\")","v":""},{"$f":"SUMIFS(Nota_Fiscal!I83:I2583,Nota_Fiscal!G83:G2583,Tabela1[[#This Row],[Nome]])","v":0},{"$f":"SUMIFS(Saída!$F$4:$F$38,Saída!E$4:E$38,Tabela1[[#This Row],[Nome]])","v":0}]
[{"$f":"IFERROR(INDEX(Nota_Fiscal!$G$4:$G$2504,MATCH(0,COUNTIF($A$3:A83,Nota_Fiscal!$G$4:$G$2504),0)),\"\")","v":""},{"$f":"SUMIFS(Nota_Fiscal!I84:I2584,Nota_Fiscal!G84:G2584,Tabela1[[#This Row],[Nome]])","v":0},{"$f":"SUMIFS(Saída!$F$4:$F$38,Saída!E$4:E$38,Tabela1[[#This Row],[Nome]])","v":0}]
[{"$f":"IFERROR(INDEX(Nota_Fiscal!$G$4:$G$2504,MATCH(0,COUNTIF($A$3:A84,Nota_Fiscal!$G$4:$G$2504),0)),\"\")","v":""},{"$f":"SUMIFS(Nota_Fiscal!I85:I2585,Nota_Fiscal!G85:G2585,Tabela1[[#This Row],[Nome]])","v":0},{"$f":"SUMIFS(Saída!$F$4:$F$38,Saída!E$4:E$38,Tabela1[[#This Row],[Nome]])","v":0}]
[{"$f":"IFERROR(INDEX(Nota_Fiscal!$G$4:$G$2504,MATCH(0,COUNTIF($A$3:A85,Nota_Fiscal!$G$4:$G$2504),0)),\"\")","v":""},{"$f":"SUMIFS(Nota_Fiscal!I86:I2586,Nota_Fiscal!G86:G2586,Tabela1[[#This Row],[Nome]])","v":0},{"$f":"SUMIFS(Saída!$F$4:$F$38,Saída!E$4:E$38,Tabela1[[#This Row],[Nome]])","v":0}]
[{"$f":"IFERROR(INDEX(Nota_Fiscal!$G$4:$G$2504,MATCH(0,COUNTIF($A$3:A86,Nota_Fiscal!$G$4:$G$2504),0)),\"\")","v":""},{"$f":"SUMIFS(Nota_Fiscal!I87:I2587,Nota_Fiscal!G87:G2587,Tabela1[[#This Row],[Nome]])","v":0},{"$f":"SUMIFS(Saída!$F$4:$F$38,Saída!E$4:E$38,Tabela1[[#This Row],[Nome]])","v":0}]
[{"$f":"IFERROR(INDEX(Nota_Fiscal!$G$4:$G$2504,MATCH(0,COUNTIF($A$3:A87,Nota_Fiscal!$G$4:$G$2504),0)),\"\")","v":""},{"$f":"SUMIFS(Nota_Fiscal!I88:I2588,Nota_Fiscal!G88:G2588,Tabela1[[#This Row],[Nome]])","v":0},{"$f":"SUMIFS(Saída!$F$4:$F$38,Saída!E$4:E$38,Tabela1[[#This Row],[Nome]])","v":0}]
[{"$f":"IFERROR(INDEX(Nota_Fiscal!$G$4:$G$2504,MATCH(0,COUNTIF($A$3:A88,Nota_Fiscal!$G$4:$G$2504),0)),\"\")","v":""},{"$f":"SUMIFS(Nota_Fiscal!I89:I2589,Nota_Fiscal!G89:G2589,Tabela1[[#This Row],[Nome]])","v":0},{"$f":"SUMIFS(Saída!$F$4:$F$38,Saída!E$4:E$38,Tabela1[[#This Row],[Nome]])","v":0}]
[{"$f":"IFERROR(INDEX(Nota_Fiscal!$G$4:$G$2504,MATCH(0,COUNTIF($A$3:A89,Nota_Fiscal!$G$4:$G$2504),0)),\"\")","v":""},{"$f":"SUMIFS(Nota_Fiscal!I90:I2590,Nota_Fiscal!G90:G2590,Tabela1[[#This Row],[Nome]])","v":0},{"$f":"SUMIFS(Saída!$F$4:$F$38,Saída!E$4:E$38,Tabela1[[#This Row],[Nome]])","v":0}]
[{"$f":"IFERROR(INDEX(Nota_Fiscal!$G$4:$G$2504,MATCH(0,COUNTIF($A$3:A90,Nota_Fiscal!$G$4:$G$2504),0)),\"\")","v":""},{"$f":"SUMIFS(Nota_Fiscal!I91:I2591,Nota_Fiscal!G91:G2591,Tabela1[[#This Row],[Nome]])","v":0},{"$f":"SUMIFS(Saída!$F$4:$F$38,Saída!E$4:E$38,Tabela1[[#This Row],[Nome]])","v":0}]
[{"$f":"IFERROR(INDEX(Nota_Fiscal!$G$4:$G$2504,MATCH(0,COUNTIF($A$3:A91,Nota_Fiscal!$G$4:$G$2504),0)),\"\")","v":""},{"$f":"SUMIFS(Nota_Fiscal!I92:I2592,Nota_Fiscal!G92:G2592,Tabela1[[#This Row],[Nome]])","v":0},{"$f":"SUMIFS(Saída!$F$4:$F$38,Saída!E$4:E$38,Tabela1[[#This Row],[Nome]])","v":0}]
[{"$f":"IFERROR(INDEX(Nota_Fiscal!$G$4:$G$2504,MATCH(0,COUNTIF($A$3:A92,Nota_Fiscal!$G$4:$G$2504),0)),\"\")","v":""},{"$f":"SUMIFS(Nota_Fiscal!I93:I2593,Nota_Fiscal!G93:G2593,Tabela1[[#This Row],[Nome]])","v":0},{"$f":"SUMIFS(Saída!$F$4:$F$38,Saída!E$4:E$38,Tabela1[[#This Row],[Nome]])","v":0}]
[{"$f":"IFERROR(INDEX(Nota_Fiscal!$G$4:$G$2504,MATCH(0,COUNTIF($A$3:A93,Nota_Fiscal!$G$4:$G$2504),0)),\"\")","v":""},{"$f":"SUMIFS(Nota_Fiscal!I94:I2594,Nota_Fiscal!G94:G2594,Tabela1[[#This Row],[Nome]])","v":0},{"$f":"SUMIFS(Saída!$F$4:$F$38,Saída!E$4:E$38,Tabela1[[#This Row],[Nome]])","v":0}]
[{"$f":"IFERROR(INDEX(Nota_Fiscal!$G$4:$G$2504,MATCH(0,COUNTIF($A$3:A94,Nota_Fiscal!$G$4:$G$2504),0)),\"\")","v":""},{"$f":"SUMIFS(Nota_Fiscal!I95:I2595,Nota_Fiscal!G95:G2595,Tabela1[[#This Row],[Nome]])","v":0},{"$f":"SUMIFS(Saída!$F$4:$F$38,Saída!E$4:E$38,Tabela1[[#This Row],[Nome]])","v":0}]
[{"$f":"IFERROR(INDEX(Nota_Fiscal!$G$4:$G$2504,MATCH(0,COUNTIF($A$3:A95,Nota_Fiscal!$G$4:$G$2504),0)),\"\")","v":""},{"$f":"SUMIFS(Nota_Fiscal!I96:I2596,Nota_Fiscal!G96:G2596,Tabela1[[#This Row],[Nome]])","v":0},{"$f":"SUMIFS(Saída!$F$4:$F$38,Saída!E$4:E$38,Tabela1[[#This Row],[Nome]])","v":0}]
[{"$f":"IFERROR(INDEX(Nota_Fiscal!$G$4:$G$2504,MATCH(0,COUNTIF($A$3:A96,Nota_Fiscal!$G$4:$G$2504),0)),\"\")","v":""},{"$f":"SUMIFS(Nota_Fiscal!I97:I2597,Nota_Fiscal!G97:G2597,Tabela1[[#This Row],[Nome]])","v":0},{"$f":"SUMIFS(Saída!$F$4:$F$38,Saída!E$4:E$38,Tabela1[[#This Row],[Nome]])","v":0}]
[{"$f":"IFERROR(INDEX(Nota_Fiscal!$G$4:$G$2504,MATCH(0,COUNTIF($A$3:A97,Nota_Fiscal!$G$4:$G$2504),0)),\"\")","v":""},{"$f":"SUMIFS(Nota_Fiscal!I98:I2598,Nota_Fiscal!G98:G2598,Tabela1[[#This Row],[Nome]])","v":0},{"$f":"SUMIFS(Saída!$F$4:$F$38,Saída!E$4:E$38,Tabela1[[#This Row],[Nome]])","v":0}]
[{"$f":"IFERROR(INDEX(Nota_Fiscal!$G$4:$G$2504,MATCH(0,COUNTIF($A$3:A98,Nota_Fiscal!$G$4:$G$2504),0)),\"\")","v":""},{"$f":"SUMIFS(Nota_Fiscal!I99:I2599,Nota_Fiscal!G99:G2599,Tabela1[[#This Row],[Nome]])","v":0},{"$f":"SUMIFS(Saída!$F$4:$F$38,Saída!E$4:E$38,Tabela1[[#This Row],[Nome]])","v":0}]
[{"$f":"IFERROR(INDEX(Nota_Fiscal!$G$4:$G$2504,MATCH(0,COUNTIF($A$3:A99,Nota_Fiscal!$G$4:$G$2504),0)),\"\")","v":""},{"$f":"SUMIFS(Nota_Fiscal!I100:I2600,Nota_Fiscal!G100:G2600,Tabela1[[#This Row],[Nome]])","v":0},{"$f":"SUMIFS(Saída!$F$4:$F$38,Saída!E$4:E$38,Tabela1[[#This Row],[Nome]])","v":0}]
[{"$f":"IFERROR(INDEX(Nota_Fiscal!$G$4:$G$2504,MATCH(0,COUNTIF($A$3:A100,Nota_Fiscal!$G$4:$G$2504),0)),\"\")","v":""},{"$f":"SUMIFS(Nota_Fiscal!I101:I2601,Nota_Fiscal!G101:G2601,Tabela1[[#This Row],[Nome]])","v":0},{"$f":"SUMIFS(Saída!$F$4:$F$38,Saída!E$4:E$38,Tabela1[[#This Row],[Nome]])","v":0}]
[{"$f":"IFERROR(INDEX(Nota_Fiscal!$G$4:$G$2504,MATCH(0,COUNTIF($A$3:A101,Nota_Fiscal!$G$4:$G$2504),0)),\"\")","v":""},{"$f":"SUMIFS(Nota_Fiscal!I102:I2602,Nota_Fiscal!G102:G2602,Tabela1[[#This Row],[Nome]])","v":0},{"$f":"SUMIFS(Saída!$F$4:$F$38,Saída!E$4:E$38,Tabela1[[#This Row],[Nome]])","v":0}]
[{"$f":"IFERROR(INDEX(Nota_Fiscal!$G$4:$G$2504,MATCH(0,COUNTIF($A$3:A102,Nota_Fiscal!$G$4:$G$2504),0)),\"\")","v":""},{"$f":"SUMIFS(Nota_Fiscal!I103:I2603,Nota_Fiscal!G103:G2603,Tabela1[[#This Row],[Nome]])","v":0},{"$f":"SUMIFS(Saída!$F$4:$F$38,Saída!E$4:E$38,Tabela1[[#This Row],[Nome]])","v":0}]
[{"$f":"IFERROR(INDEX(Nota_Fiscal!$G$4:$G$2504,MATCH(0,COUNTIF($A$3:A103,Nota_Fiscal!$G$4:$G$2504),0)),\"\")","v":""},{"$f":"SUMIFS(Nota_Fiscal!I104:I2604,Nota_Fiscal!G104:G2604,Tabela1[[#This Row],[Nome]])","v":0},{"$f":"SUMIFS(Saída!$F$4:$F$38,Saída!E$4:E$38,Tabela1[[#This Row],[Nome]])","v":0}]
[{"$f":"IFERROR(INDEX(Nota_Fiscal!$G$4:$G$2504,MATCH(0,COUNTIF($A$3:A104,Nota_Fiscal!$G$4:$G$2504),0)),\"\")","v":""},{"$f":"SUMIFS(Nota_Fiscal!I105:I2605,Nota_Fiscal!G105:G2605,Tabela1[[#This Row],[Nome]])","v":0},{"$f":"SUMIFS(Saída!$F$4:$F$38,Saída!E$4:E$38,Tabela1[[#This Row],[Nome]])","v":0}]
[{"$f":"IFERROR(INDEX(Nota_Fiscal!$G$4:$G$2504,MATCH(0,COUNTIF($A$3:A105,Nota_Fiscal!$G$4:$G$2504),0)),\"\")","v":""},{"$f":"SUMIFS(Nota_Fiscal!I106:I2606,Nota_Fiscal!G106:G2606,Tabela1[[#This Row],[Nome]])","v":0},{"$f":"SUMIFS(Saída!$F$4:$F$38,Saída!E$4:E$38,Tabela1[[#This Row],[Nome]])","v":0}]
[{"$f":"IFERROR(INDEX(Nota_Fiscal!$G$4:$G$2504,MATCH(0,COUNTIF($A$3:A106,Nota_Fiscal!$G$4:$G$2504),0)),\"\")","v":""},{"$f":"SUMIFS(Nota_Fiscal!I107:I2607,Nota_Fiscal!G107:G2607,Tabela1[[#This Row],[Nome]])","v":0},{"$f":"SUMIFS(Saída!$F$4:$F$38,Saída!E$4:E$38,Tabela1[[#This Row],[Nome]])","v":0}]
[{"$f":"IFERROR(INDEX(Nota_Fiscal!$G$4:$G$2504,MATCH(0,COUNTIF($A$3:A107,Nota_Fiscal!$G$4:$G$2504),0)),\"\")","v":""},{"$f":"SUMIFS(Nota_Fiscal!I108:I2608,Nota_Fiscal!G108:G2608,Tabela1[[#This Row],[Nome]])","v":0},{"$f":"SUMIFS(Saída!$F$4:$F$38,Saída!E$4:E$38,Tabela1[[#This Row],[Nome]])","v":0}]
[{"$f":"IFERROR(INDEX(Nota_Fiscal!$G$4:$G$2504,MATCH(0,COUNTIF($A$3:A108,Nota_Fiscal!$G$4:$G$2504),0)),\"\")","v":""},{"$f":"SUMIFS(Nota_Fiscal!I109:I2609,Nota_Fiscal!G109:G2609,Tabela1[[#This Row],[Nome]])","v":0},{"$f":"SUMIFS(Saída!$F$4:$F$38,Saída!E$4:E$38,Tabela1[[#This Row],[Nome]])","v":0}]
[{"$f":"IFERROR(INDEX(Nota_Fiscal!$G$4:$G$2504,MATCH(0,COUNTIF($A$3:A109,Nota_Fiscal!$G$4:$G$2504),0)),\"\")","v":""},{"$f":"SUMIFS(Nota_Fiscal!I110:I2610,Nota_Fiscal!G110:G2610,Tabela1[[#This Row],[Nome]])","v":0},{"$f":"SUMIFS(Saída!$F$4:$F$38,Saída!E$4:E$38,Tabela1[[#This Row],[Nome]])","v":0}]
[{"$f":"IFERROR(INDEX(Nota_Fiscal!$G$4:$G$2504,MATCH(0,COUNTIF($A$3:A110,Nota_Fiscal!$G$4:$G$2504),0)),\"\")","v":""},{"$f":"SUMIFS(Nota_Fiscal!I111:I2611,Nota_Fiscal!G111:G2611,Tabela1[[#This Row],[Nome]])","v":0},{"$f":"SUMIFS(Saída!$F$4:$F$38,Saída!E$4:E$38,Tabela1[[#This Row],[Nome]])","v":0}]
[{"$f":"IFERROR(INDEX(Nota_Fiscal!$G$4:$G$2504,MATCH(0,COUNTIF($A$3:A111,Nota_Fiscal!$G$4:$G$2504),0)),\"\")","v":""},{"$f":"SUMIFS(Nota_Fiscal!I112:I2612,Nota_Fiscal!G112:G2612,Tabela1[[#This Row],[Nome]])","v":0},{"$f":"SUMIFS(Saída!$F$4:$F$38,Saída!E$4:E$38,Tabela1[[#This Row],[Nome]])","v":0}]
[{"$f":"IFERROR(INDEX(Nota_Fiscal!$G$4:$G$2504,MATCH(0,COUNTIF($A$3:A112,Nota_Fiscal!$G$4:$G$2504),0)),\"\")","v":""},{"$f":"SUMIFS(Nota_Fiscal!I113:I2613,Nota_Fiscal!G113:G2613,Tabela1[[#This Row],[Nome]])","v":0},{"$f":"SUMIFS(Saída!$F$4:$F$38,Saída!E$4:E$38,Tabela1[[#This Row],[Nome]])","v":0}]
[{"$f":"IFERROR(INDEX(Nota_Fiscal!$G$4:$G$2504,MATCH(0,COUNTIF($A$3:A113,Nota_Fiscal!$G$4:$G$2504),0)),\"\")","v":""},{"$f":"SUMIFS(Nota_Fiscal!I114:I2614,Nota_Fiscal!G114:G2614,Tabela1[[#This Row],[Nome]])","v":0},{"$f":"SUMIFS(Saída!$F$4:$F$38,Saída!E$4:E$38,Tabela1[[#This Row],[Nome]])","v":0}]
[{"$f":"IFERROR(INDEX(Nota_Fiscal!$G$4:$G$2504,MATCH(0,COUNTIF($A$3:A114,Nota_Fiscal!$G$4:$G$2504),0)),\"\")","v":""},{"$f":"SUMIFS(Nota_Fiscal!I115:I2615,Nota_Fiscal!G115:G2615,Tabela1[[#This Row],[Nome]])","v":0},{"$f":"SUMIFS(Saída!$F$4:$F$38,Saída!E$4:E$38,Tabela1[[#This Row],[Nome]])","v":0}]
[{"$f":"IFERROR(INDEX(Nota_Fiscal!$G$4:$G$2504,MATCH(0,COUNTIF($A$3:A115,Nota_Fiscal!$G$4:$G$2504),0)),\"\")","v":""},{"$f":"SUMIFS(Nota_Fiscal!I116:I2616,Nota_Fiscal!G116:G2616,Tabela1[[#This Row],[Nome]])","v":0},{"$f":"SUMIFS(Saída!$F$4:$F$38,Saída!E$4:E$38,Tabela1[[#This Row],[Nome]])","v":0}]
[{"$f":"IFERROR(INDEX(Nota_Fiscal!$G$4:$G$2504,MATCH(0,COUNTIF($A$3:A116,Nota_Fiscal!$G$4:$G$2504),0)),\"\")","v":""},{"$f":"SUMIFS(Nota_Fiscal!I117:I2617,Nota_Fiscal!G117:G2617,Tabela1[[#This Row],[Nome]])","v":0},{"$f":"SUMIFS(Saída!$F$4:$F$38,Saída!E$4:E$38,Tabela1[[#This Row],[Nome]])","v":0}]
[{"$f":"IFERROR(INDEX(Nota_Fiscal!$G$4:$G$2504,MATCH(0,COUNTIF($A$3:A117,Nota_Fiscal!$G$4:$G$2504),0)),\"\")","v":""},{"$f":"SUMIFS(Nota_Fiscal!I118:I2618,Nota_Fiscal!G118:G2618,Tabela1[[#This Row],[Nome]])","v":0},{"$f":"SUMIFS(Saída!$F$4:$F$38,Saída!E$4:E$38,Tabela1[[#This Row],[Nome]])","v":0}]
[{"$f":"IFERROR(INDEX(Nota_Fiscal!$G$4:$G$2504,MATCH(0,COUNTIF($A$3:A118,Nota_Fiscal!$G$4:$G$2504),0)),\"\")","v":""},{"$f":"SUMIFS(Nota_Fiscal!I119:I2619,Nota_Fiscal!G119:G2619,Tabela1[[#This Row],[Nome]])","v":0},{"$f":"SUMIFS(Saída!$F$4:$F$38,Saída!E$4:E$38,Tabela1[[#This Row],[Nome]])","v":0}]
[{"$f":"IFERROR(INDEX(Nota_Fiscal!$G$4:$G$2504,MATCH(0,COUNTIF($A$3:A119,Nota_Fiscal!$G$4:$G$2504),0)),\"\")","v":""},{"$f":"SUMIFS(Nota_Fiscal!I120:I2620,Nota_Fiscal!G120:G2620,Tabela1[[#This Row],[Nome]])","v":0},{"$f":"SUMIFS(Saída!$F$4:$F$38,Saída!E$4:E$38,Tabela1[[#This Row],[Nome]])","v":0}]
[{"$f":"IFERROR(INDEX(Nota_Fiscal!$G$4:$G$2504,MATCH(0,COUNTIF($A$3:A120,Nota_Fiscal!$G$4:$G$2504),0)),\"\")","v":""},{"$f":"SUMIFS(Nota_Fiscal!I121:I2621,Nota_Fiscal!G121:G2621,Tabela1[[#This Row],[Nome]])","v":0},{"$f":"SUMIFS(Saída!$F$4:$F$38,Saída!E$4:E$38,Tabela1[[#This Row],[Nome]])","v":0}]
[{"$f":"IFERROR(INDEX(Nota_Fiscal!$G$4:$G$2504,MATCH(0,COUNTIF($A$3:A121,Nota_Fiscal!$G$4:$G$2504),0)),\"\")","v":""},{"$f":"SUMIFS(Nota_Fiscal!I122:I2622,Nota_Fiscal!G122:G2622,Tabela1[[#This Row],[Nome]])","v":0},{"$f":"SUMIFS(Saída!$F$4:$F$38,Saída!E$4:E$38,Tabela1[[#This Row],[Nome]])","v":0}]
[{"$f":"IFERROR(INDEX(Nota_Fiscal!$G$4:$G$2504,MATCH(0,COUNTIF($A$3:A122,Nota_Fiscal!$G$4:$G$2504),0)),\"\")","v":""},{"$f":"SUMIFS(Nota_Fiscal!I123:I2623,Nota_Fiscal!G123:G2623,Tabela1[[#This Row],[Nome]])","v":0},{"$f":"SUMIFS(Saída!$F$4:$F$38,Saída!E$4:E$38,Tabela1[[#This Row],[Nome]])","v":0}]
[{"$f":"IFERROR(INDEX(Nota_Fiscal!$G$4:$G$2504,MATCH(0,COUNTIF($A$3:A123,Nota_Fiscal!$G$4:$G$2504),0)),\"\")","v":""},{"$f":"SUMIFS(Nota_Fiscal!I124:I2624,Nota_Fiscal!G124:G2624,Tabela1[[#This Row],[Nome]])","v":0},{"$f":"SUMIFS(Saída!$F$4:$F$38,Saída!E$4:E$38,Tabela1[[#This Row],[Nome]])","v":0}]
[{"$f":"IFERROR(INDEX(Nota_Fiscal!$G$4:$G$2504,MATCH(0,COUNTIF($A$3:A124,Nota_Fiscal!$G$4:$G$2504),0)),\"\")","v":""},{"$f":"SUMIFS(Nota_Fiscal!I125:I2625,Nota_Fiscal!G125:G2625,Tabela1[[#This Row],[Nome]])","v":0},{"$f":"SUMIFS(Saída!$F$4:$F$38,Saída!E$4:E$38,Tabela1[[#This Row],[Nome]])","v":0}]
[{"$f":"IFERROR(INDEX(Nota_Fiscal!$G$4:$G$2504,MATCH(0,COUNTIF($A$3:A125,Nota_Fiscal!$G$4:$G$2504),0)),\"\")","v":""},{"$f":"SUMIFS(Nota_Fiscal!I126:I2626,Nota_Fiscal!G126:G2626,Tabela1[[#This Row],[Nome]])","v":0},{"$f":"SUMIFS(Saída!$F$4:$F$38,Saída!E$4:E$38,Tabela1[[#This Row],[Nome]])","v":0}]
[{"$f":"IFERROR(INDEX(Nota_Fiscal!$G$4:$G$2504,MATCH(0,COUNTIF($A$3:A126,Nota_Fiscal!$G$4:$G$2504),0)),\"\")","v":""},{"$f":"SUMIFS(Nota_Fiscal!I127:I2627,Nota_Fiscal!G127:G2627,Tabela1[[#This Row],[Nome]])","v":0},{"$f":"SUMIFS(Saída!$F$4:$F$38,Saída!E$4:E$38,Tabela1[[#This Row],[Nome]])","v":0}]
[{"$f":"IFERROR(INDEX(Nota_Fiscal!$G$4:$G$2504,MATCH(0,COUNTIF($A$3:A127,Nota_Fiscal!$G$4:$G$2504),0)),\"\")","v":""},{"$f":"SUMIFS(Nota_Fiscal!I128:I2628,Nota_Fiscal!G128:G2628,Tabela1[[#This Row],[Nome]])","v":0},{"$f":"SUMIFS(Saída!$F$4:$F$38,Saída!E$4:E$38,Tabela1[[#This Row],[Nome]])","v":0}]
[{"$f":"IFERROR(INDEX(Nota_Fiscal!$G$4:$G$2504,MATCH(0,COUNTIF($A$3:A128,Nota_Fiscal!$G$4:$G$2504),0)),\"\")","v":""},{"$f":"SUMIFS(Nota_Fiscal!I129:I2629,Nota_Fiscal!G129:G2629,Tabela1[[#This Row],[Nome]])","v":0},{"$f":"SUMIFS(Saída!$F$4:$F$38,Saída!E$4:E$38,Tabela1[[#This Row],[Nome]])","v":0}]
[{"$f":"IFERROR(INDEX(Nota_Fiscal!$G$4:$G$2504,MATCH(0,COUNTIF($A$3:A129,Nota_Fiscal!$G$4:$G$2504),0)),\"\")","v":""},{"$f":"SUMIFS(Nota_Fiscal!I130:I2630,Nota_Fiscal!G130:G2630,Tabela1[[#This Row],[Nome]])","v":0},{"$f":"SUMIFS(Saída!$F$4:$F$38,Saída!E$4:E$38,Tabela1[[#This Row],[Nome]])","v":0}]
[{"$f":"IFERROR(INDEX(Nota_Fiscal!$G$4:$G$2504,MATCH(0,COUNTIF($A$3:A130,Nota_Fiscal!$G$4:$G$2504),0)),\"\")","v":""},{"$f":"SUMIFS(Nota_Fiscal!I131:I2631,Nota_Fiscal!G131:G2631,Tabela1[[#This Row],[Nome]])","v":0},{"$f":"SUMIFS(Saída!$F$4:$F$38,Saída!E$4:E$38,Tabela1[[#This Row],[Nome]])","v":0}]
[{"$f":"IFERROR(INDEX(Nota_Fiscal!$G$4:$G$2504,MATCH(0,COUNTIF($A$3:A131,Nota_Fiscal!$G$4:$G$2504),0)),\"\")","v":""},{"$f":"SUMIFS(Nota_Fiscal!I132:I2632,Nota_Fiscal!G132:G2632,Tabela1[[#This Row],[Nome]])","v":0},{"$f":"SUMIFS(Saída!$F$4:$F$38,Saída!E$4:E$38,Tabela1[[#This Row],[Nome]])","v":0}]
[{"$f":"IFERROR(INDEX(Nota_Fiscal!$G$4:$G$2504,MATCH(0,COUNTIF($A$3:A132,Nota_Fiscal!$G$4:$G$2504),0)),\"\")","v":""},{"$f":"SUMIFS(Nota_Fiscal!I133:I2633,Nota_Fiscal!G133:G2633,Tabela1[[#This Row],[Nome]])","v":0},{"$f":"SUMIFS(Saída!$F$4:$F$38,Saída!E$4:E$38,Tabela1[[#This Row],[Nome]])","v":0}]
[{"$f":"IFERROR(INDEX(Nota_Fiscal!$G$4:$G$2504,MATCH(0,COUNTIF($A$3:A133,Nota_Fiscal!$G$4:$G$2504),0)),\"\")","v":""},{"$f":"SUMIFS(Nota_Fiscal!I134:I2634,Nota_Fiscal!G134:G2634,Tabela1[[#This Row],[Nome]])","v":0},{"$f":"SUMIFS(Saída!$F$4:$F$38,Saída!E$4:E$38,Tabela1[[#This Row],[Nome]])","v":0}]

{"sheet":"Consulta_Estoque","index":8,"n_rows":726,"n_cols":6,"rows_kept":726,"cut":false,"hidden":true,"merged":[[1,2,1,5]]}
[]
[null,null,"CONSULTA DO ESTOQUE"]
[]
[null,null,"INSUMO","QUANTIDADE EM ESTOQUE","QUANTIDADE RETIRADA","SALDO NO ESTOQUE"]
[null,null,"Defensivo Granulado",{"$f":"(SUMIF(Nota_Fiscal!E4:E994,Consulta_Estoque!C5,Nota_Fiscal!I4:I994))+(SUMIF(Insumos!A4:A8,Consulta_Estoque!C5,Insumos!C4:C997))","v":2000},{"$f":"SUMIF(Saída!A:A,Consulta_Estoque!C5,Saída!F:F)","v":575},{"$f":"IF(D5-E5>=0,D5-E5,D5-E5&\"   Produto em Falta\")","v":1425}]
[]
[]
[]
[]
[]
[]
[]
[]
[]
[]
[]
[]
[]
[]
[]
[]
[]
[]
[]
[]
[]
[]
[]
[]
[]
[]
[]
[]
[]
[]
[null,null,null,{"$f":"IFERROR(VLOOKUP(C36,Nota_Fiscal!E28:I29,2,0),\"\")","v":""}]
[null,null,null,{"$f":"IFERROR(VLOOKUP(C37,Nota_Fiscal!E29:I30,2,0),\"\")","v":""}]
[null,null,null,{"$f":"IFERROR(VLOOKUP(C38,Nota_Fiscal!E30:I31,2,0),\"\")","v":""}]
[null,null,null,{"$f":"IFERROR(VLOOKUP(C39,Nota_Fiscal!E31:I32,2,0),\"\")","v":""}]
[null,null,null,{"$f":"IFERROR(VLOOKUP(C40,Nota_Fiscal!E32:I33,2,0),\"\")","v":""}]
[null,null,null,{"$f":"IFERROR(VLOOKUP(C41,Nota_Fiscal!E33:I34,2,0),\"\")","v":""}]
[null,null,null,{"$f":"IFERROR(VLOOKUP(C42,Nota_Fiscal!E34:I35,2,0),\"\")","v":""}]
[null,null,null,{"$f":"IFERROR(VLOOKUP(C43,Nota_Fiscal!E35:I36,2,0),\"\")","v":""}]
[null,null,null,{"$f":"IFERROR(VLOOKUP(C44,Nota_Fiscal!E36:I37,2,0),\"\")","v":""}]
[null,null,null,{"$f":"IFERROR(VLOOKUP(C45,Nota_Fiscal!E37:I38,2,0),\"\")","v":""}]
[null,null,null,{"$f":"IFERROR(VLOOKUP(C46,Nota_Fiscal!E38:I39,2,0),\"\")","v":""}]
[null,null,null,{"$f":"IFERROR(VLOOKUP(C47,Nota_Fiscal!E39:I40,2,0),\"\")","v":""}]
[null,null,null,{"$f":"IFERROR(VLOOKUP(C48,Nota_Fiscal!E40:I41,2,0),\"\")","v":""}]
[null,null,null,{"$f":"IFERROR(VLOOKUP(C49,Nota_Fiscal!E41:I42,2,0),\"\")","v":""}]
[null,null,null,{"$f":"IFERROR(VLOOKUP(C50,Nota_Fiscal!E42:I43,2,0),\"\")","v":""}]
[null,null,null,{"$f":"IFERROR(VLOOKUP(C51,Nota_Fiscal!E43:I44,2,0),\"\")","v":""}]
[null,null,null,{"$f":"IFERROR(VLOOKUP(C52,Nota_Fiscal!E44:I45,2,0),\"\")","v":""}]
[null,null,null,{"$f":"IFERROR(VLOOKUP(C53,Nota_Fiscal!E45:I46,2,0),\"\")","v":""}]
[null,null,null,{"$f":"IFERROR(VLOOKUP(C54,Nota_Fiscal!E46:I47,2,0),\"\")","v":""}]
[null,null,null,{"$f":"IFERROR(VLOOKUP(C55,Nota_Fiscal!E47:I48,2,0),\"\")","v":""}]
[null,null,null,{"$f":"IFERROR(VLOOKUP(C56,Nota_Fiscal!E48:I49,2,0),\"\")","v":""}]
[null,null,null,{"$f":"IFERROR(VLOOKUP(C57,Nota_Fiscal!E49:I50,2,0),\"\")","v":""}]
[null,null,null,{"$f":"IFERROR(VLOOKUP(C58,Nota_Fiscal!E50:I51,2,0),\"\")","v":""}]
[null,null,null,{"$f":"IFERROR(VLOOKUP(C59,Nota_Fiscal!E51:I52,2,0),\"\")","v":""}]
[null,null,null,{"$f":"IFERROR(VLOOKUP(C60,Nota_Fiscal!E52:I53,2,0),\"\")","v":""}]
[null,null,null,{"$f":"IFERROR(VLOOKUP(C61,Nota_Fiscal!E53:I54,2,0),\"\")","v":""}]
[null,null,null,{"$f":"IFERROR(VLOOKUP(C62,Nota_Fiscal!E54:I55,2,0),\"\")","v":""}]
[null,null,null,{"$f":"IFERROR(VLOOKUP(C63,Nota_Fiscal!E55:I56,2,0),\"\")","v":""}]
[null,null,null,{"$f":"IFERROR(VLOOKUP(C64,Nota_Fiscal!E56:I57,2,0),\"\")","v":""}]
[null,null,null,{"$f":"IFERROR(VLOOKUP(C65,Nota_Fiscal!E57:I58,2,0),\"\")","v":""}]
[null,null,null,{"$f":"IFERROR(VLOOKUP(C66,Nota_Fiscal!E58:I59,2,0),\"\")","v":""}]
[null,null,null,{"$f":"IFERROR(VLOOKUP(C67,Nota_Fiscal!E59:I60,2,0),\"\")","v":""}]
[null,null,null,{"$f":"IFERROR(VLOOKUP(C68,Nota_Fiscal!E60:I61,2,0),\"\")","v":""}]
[null,null,null,{"$f":"IFERROR(VLOOKUP(C69,Nota_Fiscal!E61:I62,2,0),\"\")","v":""}]
[null,null,null,{"$f":"IFERROR(VLOOKUP(C70,Nota_Fiscal!E62:I63,2,0),\"\")","v":""}]
[null,null,null,{"$f":"IFERROR(VLOOKUP(C71,Nota_Fiscal!E63:I64,2,0),\"\")","v":""}]
[null,null,null,{"$f":"IFERROR(VLOOKUP(C72,Nota_Fiscal!E64:I65,2,0),\"\")","v":""}]
[null,null,null,{"$f":"IFERROR(VLOOKUP(C73,Nota_Fiscal!E65:I66,2,0),\"\")","v":""}]
[null,null,null,{"$f":"IFERROR(VLOOKUP(C74,Nota_Fiscal!E66:I67,2,0),\"\")","v":""}]
[null,null,null,{"$f":"IFERROR(VLOOKUP(C75,Nota_Fiscal!E67:I68,2,0),\"\")","v":""}]
[null,null,null,{"$f":"IFERROR(VLOOKUP(C76,Nota_Fiscal!E68:I69,2,0),\"\")","v":""}]
[null,null,null,{"$f":"IFERROR(VLOOKUP(C77,Nota_Fiscal!E69:I70,2,0),\"\")","v":""}]
[null,null,null,{"$f":"IFERROR(VLOOKUP(C78,Nota_Fiscal!E70:I71,2,0),\"\")","v":""}]
[null,null,null,{"$f":"IFERROR(VLOOKUP(C79,Nota_Fiscal!E71:I72,2,0),\"\")","v":""}]
[null,null,null,{"$f":"IFERROR(VLOOKUP(C80,Nota_Fiscal!E72:I73,2,0),\"\")","v":""}]
[null,null,null,{"$f":"IFERROR(VLOOKUP(C81,Nota_Fiscal!E73:I74,2,0),\"\")","v":""}]
[null,null,null,{"$f":"IFERROR(VLOOKUP(C82,Nota_Fiscal!E74:I75,2,0),\"\")","v":""}]
[null,null,null,{"$f":"IFERROR(VLOOKUP(C83,Nota_Fiscal!E75:I76,2,0),\"\")","v":""}]
[null,null,null,{"$f":"IFERROR(VLOOKUP(C84,Nota_Fiscal!E76:I77,2,0),\"\")","v":""}]
[null,null,null,{"$f":"IFERROR(VLOOKUP(C85,Nota_Fiscal!E77:I78,2,0),\"\")","v":""}]
[null,null,null,{"$f":"IFERROR(VLOOKUP(C86,Nota_Fiscal!E78:I79,2,0),\"\")","v":""}]
[null,null,null,{"$f":"IFERROR(VLOOKUP(C87,Nota_Fiscal!E79:I80,2,0),\"\")","v":""}]
[null,null,null,{"$f":"IFERROR(VLOOKUP(C88,Nota_Fiscal!E80:I81,2,0),\"\")","v":""}]
[null,null,null,{"$f":"IFERROR(VLOOKUP(C89,Nota_Fiscal!E81:I82,2,0),\"\")","v":""}]
[null,null,null,{"$f":"IFERROR(VLOOKUP(C90,Nota_Fiscal!E82:I83,2,0),\"\")","v":""}]
[null,null,null,{"$f":"IFERROR(VLOOKUP(C91,Nota_Fiscal!E83:I84,2,0),\"\")","v":""}]
[null,null,null,{"$f":"IFERROR(VLOOKUP(C92,Nota_Fiscal!E84:I85,2,0),\"\")","v":""}]
[null,null,null,{"$f":"IFERROR(VLOOKUP(C93,Nota_Fiscal!E85:I86,2,0),\"\")","v":""}]
[null,null,null,{"$f":"IFERROR(VLOOKUP(C94,Nota_Fiscal!E86:I87,2,0),\"\")","v":""}]
[null,null,null,{"$f":"IFERROR(VLOOKUP(C95,Nota_Fiscal!E87:I88,2,0),\"\")","v":""}]
[null,null,null,{"$f":"IFERROR(VLOOKUP(C96,Nota_Fiscal!E88:I89,2,0),\"\")","v":""}]
[null,null,null,{"$f":"IFERROR(VLOOKUP(C97,Nota_Fiscal!E89:I90,2,0),\"\")","v":""}]
[null,null,null,{"$f":"IFERROR(VLOOKUP(C98,Nota_Fiscal!E90:I91,2,0),\"\")","v":""}]
[null,null,null,{"$f":"IFERROR(VLOOKUP(C99,Nota_Fiscal!E91:I92,2,0),\"\")","v":""}]
[null,null,null,{"$f":"IFERROR(VLOOKUP(C100,Nota_Fiscal!E92:I93,2,0),\"\")","v":""}]
[null,null,null,{"$f":"IFERROR(VLOOKUP(C101,Nota_Fiscal!E93:I94,2,0),\"\")","v":""}]
[null,null,null,{"$f":"IFERROR(VLOOKUP(C102,Nota_Fiscal!E94:I95,2,0),\"\")","v":""}]
[null,null,null,{"$f":"IFERROR(VLOOKUP(C103,Nota_Fiscal!E95:I96,2,0),\"\")","v":""}]
[null,null,null,{"$f":"IFERROR(VLOOKUP(C104,Nota_Fiscal!E96:I97,2,0),\"\")","v":""}]
[null,null,null,{"$f":"IFERROR(VLOOKUP(C105,Nota_Fiscal!E97:I98,2,0),\"\")","v":""}]
[null,null,null,{"$f":"IFERROR(VLOOKUP(C106,Nota_Fiscal!E98:I99,2,0),\"\")","v":""}]
[null,null,null,{"$f":"IFERROR(VLOOKUP(C107,Nota_Fiscal!E99:I100,2,0),\"\")","v":""}]
[null,null,null,{"$f":"IFERROR(VLOOKUP(C108,Nota_Fiscal!E100:I101,2,0),\"\")","v":""}]
[null,null,null,{"$f":"IFERROR(VLOOKUP(C109,Nota_Fiscal!E101:I102,2,0),\"\")","v":""}]
[null,null,null,{"$f":"IFERROR(VLOOKUP(C110,Nota_Fiscal!E102:I103,2,0),\"\")","v":""}]
[null,null,null,{"$f":"IFERROR(VLOOKUP(C111,Nota_Fiscal!E103:I104,2,0),\"\")","v":""}]
[null,null,null,{"$f":"IFERROR(VLOOKUP(C112,Nota_Fiscal!E104:I105,2,0),\"\")","v":""}]
[null,null,null,{"$f":"IFERROR(VLOOKUP(C113,Nota_Fiscal!E105:I106,2,0),\"\")","v":""}]
[null,null,null,{"$f":"IFERROR(VLOOKUP(C114,Nota_Fiscal!E106:I107,2,0),\"\")","v":""}]
[null,null,null,{"$f":"IFERROR(VLOOKUP(C115,Nota_Fiscal!E107:I108,2,0),\"\")","v":""}]
[null,null,null,{"$f":"IFERROR(VLOOKUP(C116,Nota_Fiscal!E108:I109,2,0),\"\")","v":""}]
[null,null,null,{"$f":"IFERROR(VLOOKUP(C117,Nota_Fiscal!E109:I110,2,0),\"\")","v":""}]
[null,null,null,{"$f":"IFERROR(VLOOKUP(C118,Nota_Fiscal!E110:I111,2,0),\"\")","v":""}]
[null,null,null,{"$f":"IFERROR(VLOOKUP(C119,Nota_Fiscal!E111:I112,2,0),\"\")","v":""}]
[null,null,null,{"$f":"IFERROR(VLOOKUP(C120,Nota_Fiscal!E112:I113,2,0),\"\")","v":""}]
[null,null,null,{"$f":"IFERROR(VLOOKUP(C121,Nota_Fiscal!E113:I114,2,0),\"\")","v":""}]
[null,null,null,{"$f":"IFERROR(VLOOKUP(C122,Nota_Fiscal!E114:I115,2,0),\"\")","v":""}]
[null,null,null,{"$f":"IFERROR(VLOOKUP(C123,Nota_Fiscal!E115:I116,2,0),\"\")","v":""}]
[null,null,null,{"$f":"IFERROR(VLOOKUP(C124,Nota_Fiscal!E116:I117,2,0),\"\")","v":""}]
[null,null,null,{"$f":"IFERROR(VLOOKUP(C125,Nota_Fiscal!E117:I118,2,0),\"\")","v":""}]
[null,null,null,{"$f":"IFERROR(VLOOKUP(C126,Nota_Fiscal!E118:I119,2,0),\"\")","v":""}]
[null,null,null,{"$f":"IFERROR(VLOOKUP(C127,Nota_Fiscal!E119:I120,2,0),\"\")","v":""}]
[null,null,null,{"$f":"IFERROR(VLOOKUP(C128,Nota_Fiscal!E120:I121,2,0),\"\")","v":""}]
[null,null,null,{"$f":"IFERROR(VLOOKUP(C129,Nota_Fiscal!E121:I122,2,0),\"\")","v":""}]
[null,null,null,{"$f":"IFERROR(VLOOKUP(C130,Nota_Fiscal!E122:I123,2,0),\"\")","v":""}]
[null,null,null,{"$f":"IFERROR(VLOOKUP(C131,Nota_Fiscal!E123:I124,2,0),\"\")","v":""}]
[null,null,null,{"$f":"IFERROR(VLOOKUP(C132,Nota_Fiscal!E124:I125,2,0),\"\")","v":""}]
[null,null,null,{"$f":"IFERROR(VLOOKUP(C133,Nota_Fiscal!E125:I126,2,0),\"\")","v":""}]
[null,null,null,{"$f":"IFERROR(VLOOKUP(C134,Nota_Fiscal!E126:I127,2,0),\"\")","v":""}]
[null,null,null,{"$f":"IFERROR(VLOOKUP(C135,Nota_Fiscal!E127:I128,2,0),\"\")","v":""}]
[null,null,null,{"$f":"IFERROR(VLOOKUP(C136,Nota_Fiscal!E128:I129,2,0),\"\")","v":""}]
[null,null,null,{"$f":"IFERROR(VLOOKUP(C137,Nota_Fiscal!E129:I130,2,0),\"\")","v":""}]
[null,null,null,{"$f":"IFERROR(VLOOKUP(C138,Nota_Fiscal!E130:I131,2,0),\"\")","v":""}]
[null,null,null,{"$f":"IFERROR(VLOOKUP(C139,Nota_Fiscal!E131:I132,2,0),\"\")","v":""}]
[null,null,null,{"$f":"IFERROR(VLOOKUP(C140,Nota_Fiscal!E132:I133,2,0),\"\")","v":""}]
[null,null,null,{"$f":"IFERROR(VLOOKUP(C141,Nota_Fiscal!E133:I134,2,0),\"\")","v":""}]
[null,null,null,{"$f":"IFERROR(VLOOKUP(C142,Nota_Fiscal!E134:I135,2,0),\"\")","v":""}]
[null,null,null,{"$f":"IFERROR(VLOOKUP(C143,Nota_Fiscal!E135:I136,2,0),\"\")","v":""}]
[null,null,null,{"$f":"IFERROR(VLOOKUP(C144,Nota_Fiscal!E136:I137,2,0),\"\")","v":""}]
[null,null,null,{"$f":"IFERROR(VLOOKUP(C145,Nota_Fiscal!E137:I138,2,0),\"\")","v":""}]
[null,null,null,{"$f":"IFERROR(VLOOKUP(C146,Nota_Fiscal!E138:I139,2,0),\"\")","v":""}]
[null,null,null,{"$f":"IFERROR(VLOOKUP(C147,Nota_Fiscal!E139:I140,2,0),\"\")","v":""}]
[null,null,null,{"$f":"IFERROR(VLOOKUP(C148,Nota_Fiscal!E140:I141,2,0),\"\")","v":""}]
[null,null,null,{"$f":"IFERROR(VLOOKUP(C149,Nota_Fiscal!E141:I142,2,0),\"\")","v":""}]
[null,null,null,{"$f":"IFERROR(VLOOKUP(C150,Nota_Fiscal!E142:I143,2,0),\"\")","v":""}]
[null,null,null,{"$f":"IFERROR(VLOOKUP(C151,Nota_Fiscal!E143:I144,2,0),\"\")","v":""}]
[null,null,null,{"$f":"IFERROR(VLOOKUP(C152,Nota_Fiscal!E144:I145,2,0),\"\")","v":""}]
[null,null,null,{"$f":"IFERROR(VLOOKUP(C153,Nota_Fiscal!E145:I146,2,0),\"\")","v":""}]
[null,null,null,{"$f":"IFERROR(VLOOKUP(C154,Nota_Fiscal!E146:I147,2,0),\"\")","v":""}]
[null,null,null,{"$f":"IFERROR(VLOOKUP(C155,Nota_Fiscal!E147:I148,2,0),\"\")","v":""}]
[null,null,null,{"$f":"IFERROR(VLOOKUP(C156,Nota_Fiscal!E148:I149,2,0),\"\")","v":""}]
[null,null,null,{"$f":"IFERROR(VLOOKUP(C157,Nota_Fiscal!E149:I150,2,0),\"\")","v":""}]
[null,null,null,{"$f":"IFERROR(VLOOKUP(C158,Nota_Fiscal!E150:I151,2,0),\"\")","v":""}]
[null,null,null,{"$f":"IFERROR(VLOOKUP(C159,Nota_Fiscal!E151:I152,2,0),\"\")","v":""}]
[null,null,null,{"$f":"IFERROR(VLOOKUP(C160,Nota_Fiscal!E152:I153,2,0),\"\")","v":""}]
[null,null,null,{"$f":"IFERROR(VLOOKUP(C161,Nota_Fiscal!E153:I154,2,0),\"\")","v":""}]
[null,null,null,{"$f":"IFERROR(VLOOKUP(C162,Nota_Fiscal!E154:I155,2,0),\"\")","v":""}]
[null,null,null,{"$f":"IFERROR(VLOOKUP(C163,Nota_Fiscal!E155:I156,2,0),\"\")","v":""}]
[null,null,null,{"$f":"IFERROR(VLOOKUP(C164,Nota_Fiscal!E156:I157,2,0),\"\")","v":""}]
[null,null,null,{"$f":"IFERROR(VLOOKUP(C165,Nota_Fiscal!E157:I158,2,0),\"\")","v":""}]
[null,null,null,{"$f":"IFERROR(VLOOKUP(C166,Nota_Fiscal!E158:I159,2,0),\"\")","v":""}]
[null,null,null,{"$f":"IFERROR(VLOOKUP(C167,Nota_Fiscal!E159:I160,2,0),\"\")","v":""}]
[null,null,null,{"$f":"IFERROR(VLOOKUP(C168,Nota_Fiscal!E160:I161,2,0),\"\")","v":""}]
[null,null,null,{"$f":"IFERROR(VLOOKUP(C169,Nota_Fiscal!E161:I162,2,0),\"\")","v":""}]
[null,null,null,{"$f":"IFERROR(VLOOKUP(C170,Nota_Fiscal!E162:I163,2,0),\"\")","v":""}]
[null,null,null,{"$f":"IFERROR(VLOOKUP(C171,Nota_Fiscal!E163:I164,2,0),\"\")","v":""}]
[null,null,null,{"$f":"IFERROR(VLOOKUP(C172,Nota_Fiscal!E164:I165,2,0),\"\")","v":""}]
[null,null,null,{"$f":"IFERROR(VLOOKUP(C173,Nota_Fiscal!E165:I166,2,0),\"\")","v":""}]
[null,null,null,{"$f":"IFERROR(VLOOKUP(C174,Nota_Fiscal!E166:I167,2,0),\"\")","v":""}]
[null,null,null,{"$f":"IFERROR(VLOOKUP(C175,Nota_Fiscal!E167:I168,2,0),\"\")","v":""}]
[null,null,null,{"$f":"IFERROR(VLOOKUP(C176,Nota_Fiscal!E168:I169,2,0),\"\")","v":""}]
[null,null,null,{"$f":"IFERROR(VLOOKUP(C177,Nota_Fiscal!E169:I170,2,0),\"\")","v":""}]
[null,null,null,{"$f":"IFERROR(VLOOKUP(C178,Nota_Fiscal!E170:I171,2,0),\"\")","v":""}]
[null,null,null,{"$f":"IFERROR(VLOOKUP(C179,Nota_Fiscal!E171:I172,2,0),\"\")","v":""}]
[null,null,null,{"$f":"IFERROR(VLOOKUP(C180,Nota_Fiscal!E172:I173,2,0),\"\")","v":""}]
[null,null,null,{"$f":"IFERROR(VLOOKUP(C181,Nota_Fiscal!E173:I174,2,0),\"\")","v":""}]
[null,null,null,{"$f":"IFERROR(VLOOKUP(C182,Nota_Fiscal!E174:I175,2,0),\"\")","v":""}]
[null,null,null,{"$f":"IFERROR(VLOOKUP(C183,Nota_Fiscal!E175:I176,2,0),\"\")","v":""}]
[null,null,null,{"$f":"IFERROR(VLOOKUP(C184,Nota_Fiscal!E176:I177,2,0),\"\")","v":""}]
[null,null,null,{"$f":"IFERROR(VLOOKUP(C185,Nota_Fiscal!E177:I178,2,0),\"\")","v":""}]
[null,null,null,{"$f":"IFERROR(VLOOKUP(C186,Nota_Fiscal!E178:I179,2,0),\"\")","v":""}]
[null,null,null,{"$f":"IFERROR(VLOOKUP(C187,Nota_Fiscal!E179:I180,2,0),\"\")","v":""}]
[null,null,null,{"$f":"IFERROR(VLOOKUP(C188,Nota_Fiscal!E180:I181,2,0),\"\")","v":""}]
[null,null,null,{"$f":"IFERROR(VLOOKUP(C189,Nota_Fiscal!E181:I182,2,0),\"\")","v":""}]
[null,null,null,{"$f":"IFERROR(VLOOKUP(C190,Nota_Fiscal!E182:I183,2,0),\"\")","v":""}]
[null,null,null,{"$f":"IFERROR(VLOOKUP(C191,Nota_Fiscal!E183:I184,2,0),\"\")","v":""}]
[null,null,null,{"$f":"IFERROR(VLOOKUP(C192,Nota_Fiscal!E184:I185,2,0),\"\")","v":""}]
[null,null,null,{"$f":"IFERROR(VLOOKUP(C193,Nota_Fiscal!E185:I186,2,0),\"\")","v":""}]
[null,null,null,{"$f":"IFERROR(VLOOKUP(C194,Nota_Fiscal!E186:I187,2,0),\"\")","v":""}]
[null,null,null,{"$f":"IFERROR(VLOOKUP(C195,Nota_Fiscal!E187:I188,2,0),\"\")","v":""}]
[null,null,null,{"$f":"IFERROR(VLOOKUP(C196,Nota_Fiscal!E188:I189,2,0),\"\")","v":""}]
[null,null,null,{"$f":"IFERROR(VLOOKUP(C197,Nota_Fiscal!E189:I190,2,0),\"\")","v":""}]
[null,null,null,{"$f":"IFERROR(VLOOKUP(C198,Nota_Fiscal!E190:I191,2,0),\"\")","v":""}]
[null,null,null,{"$f":"IFERROR(VLOOKUP(C199,Nota_Fiscal!E191:I192,2,0),\"\")","v":""}]
[null,null,null,{"$f":"IFERROR(VLOOKUP(C200,Nota_Fiscal!E192:I193,2,0),\"\")","v":""}]
[null,null,null,{"$f":"IFERROR(VLOOKUP(C201,Nota_Fiscal!E193:I194,2,0),\"\")","v":""}]
[null,null,null,{"$f":"IFERROR(VLOOKUP(C202,Nota_Fiscal!E194:I195,2,0),\"\")","v":""}]
[null,null,null,{"$f":"IFERROR(VLOOKUP(C203,Nota_Fiscal!E195:I196,2,0),\"\")","v":""}]
[null,null,null,{"$f":"IFERROR(VLOOKUP(C204,Nota_Fiscal!E196:I197,2,0),\"\")","v":""}]
[null,null,null,{"$f":"IFERROR(VLOOKUP(C205,Nota_Fiscal!E197:I198,2,0),\"\")","v":""}]
[null,null,null,{"$f":"IFERROR(VLOOKUP(C206,Nota_Fiscal!E198:I199,2,0),\"\")","v":""}]
[null,null,null,{"$f":"IFERROR(VLOOKUP(C207,Nota_Fiscal!E199:I200,2,0),\"\")","v":""}]
[null,null,null,{"$f":"IFERROR(VLOOKUP(C208,Nota_Fiscal!E200:I201,2,0),\"\")","v":""}]
[null,null,null,{"$f":"IFERROR(VLOOKUP(C209,Nota_Fiscal!E201:I202,2,0),\"\")","v":""}]
[null,null,null,{"$f":"IFERROR(VLOOKUP(C210,Nota_Fiscal!E202:I203,2,0),\"\")","v":""}]
[null,null,null,{"$f":"IFERROR(VLOOKUP(C211,Nota_Fiscal!E203:I204,2,0),\"\")","v":""}]
[null,null,null,{"$f":"IFERROR(VLOOKUP(C212,Nota_Fiscal!E204:I205,2,0),\"\")","v":""}]
[null,null,null,{"$f":"IFERROR(VLOOKUP(C213,Nota_Fiscal!E205:I206,2,0),\"\")","v":""}]
[null,null,null,{"$f":"IFERROR(VLOOKUP(C214,Nota_Fiscal!E206:I207,2,0),\"\")","v":""}]
[null,null,null,{"$f":"IFERROR(VLOOKUP(C215,Nota_Fiscal!E207:I208,2,0),\"\")","v":""}]
[null,null,null,{"$f":"IFERROR(VLOOKUP(C216,Nota_Fiscal!E208:I209,2,0),\"\")","v":""}]
[null,null,null,{"$f":"IFERROR(VLOOKUP(C217,Nota_Fiscal!E209:I210,2,0),\"\")","v":""}]
[null,null,null,{"$f":"IFERROR(VLOOKUP(C218,Nota_Fiscal!E210:I211,2,0),\"\")","v":""}]
[null,null,null,{"$f":"IFERROR(VLOOKUP(C219,Nota_Fiscal!E211:I212,2,0),\"\")","v":""}]
[null,null,null,{"$f":"IFERROR(VLOOKUP(C220,Nota_Fiscal!E212:I213,2,0),\"\")","v":""}]
[null,null,null,{"$f":"IFERROR(VLOOKUP(C221,Nota_Fiscal!E213:I214,2,0),\"\")","v":""}]
[null,null,null,{"$f":"IFERROR(VLOOKUP(C222,Nota_Fiscal!E214:I215,2,0),\"\")","v":""}]
[null,null,null,{"$f":"IFERROR(VLOOKUP(C223,Nota_Fiscal!E215:I216,2,0),\"\")","v":""}]
[null,null,null,{"$f":"IFERROR(VLOOKUP(C224,Nota_Fiscal!E216:I217,2,0),\"\")","v":""}]
[null,null,null,{"$f":"IFERROR(VLOOKUP(C225,Nota_Fiscal!E217:I218,2,0),\"\")","v":""}]
[null,null,null,{"$f":"IFERROR(VLOOKUP(C226,Nota_Fiscal!E218:I219,2,0),\"\")","v":""}]
[null,null,null,{"$f":"IFERROR(VLOOKUP(C227,Nota_Fiscal!E219:I220,2,0),\"\")","v":""}]
[null,null,null,{"$f":"IFERROR(VLOOKUP(C228,Nota_Fiscal!E220:I221,2,0),\"\")","v":""}]
[null,null,null,{"$f":"IFERROR(VLOOKUP(C229,Nota_Fiscal!E221:I222,2,0),\"\")","v":""}]
[null,null,null,{"$f":"IFERROR(VLOOKUP(C230,Nota_Fiscal!E222:I223,2,0),\"\")","v":""}]
[null,null,null,{"$f":"IFERROR(VLOOKUP(C231,Nota_Fiscal!E223:I224,2,0),\"\")","v":""}]
[null,null,null,{"$f":"IFERROR(VLOOKUP(C232,Nota_Fiscal!E224:I225,2,0),\"\")","v":""}]
[null,null,null,{"$f":"IFERROR(VLOOKUP(C233,Nota_Fiscal!E225:I226,2,0),\"\")","v":""}]
[null,null,null,{"$f":"IFERROR(VLOOKUP(C234,Nota_Fiscal!E226:I227,2,0),\"\")","v":""}]
[null,null,null,{"$f":"IFERROR(VLOOKUP(C235,Nota_Fiscal!E227:I228,2,0),\"\")","v":""}]
[null,null,null,{"$f":"IFERROR(VLOOKUP(C236,Nota_Fiscal!E228:I229,2,0),\"\")","v":""}]
[null,null,null,{"$f":"IFERROR(VLOOKUP(C237,Nota_Fiscal!E229:I230,2,0),\"\")","v":""}]
[null,null,null,{"$f":"IFERROR(VLOOKUP(C238,Nota_Fiscal!E230:I231,2,0),\"\")","v":""}]
[null,null,null,{"$f":"IFERROR(VLOOKUP(C239,Nota_Fiscal!E231:I232,2,0),\"\")","v":""}]
[null,null,null,{"$f":"IFERROR(VLOOKUP(C240,Nota_Fiscal!E232:I233,2,0),\"\")","v":""}]
[null,null,null,{"$f":"IFERROR(VLOOKUP(C241,Nota_Fiscal!E233:I234,2,0),\"\")","v":""}]
[null,null,null,{"$f":"IFERROR(VLOOKUP(C242,Nota_Fiscal!E234:I235,2,0),\"\")","v":""}]
[null,null,null,{"$f":"IFERROR(VLOOKUP(C243,Nota_Fiscal!E235:I236,2,0),\"\")","v":""}]
[null,null,null,{"$f":"IFERROR(VLOOKUP(C244,Nota_Fiscal!E236:I237,2,0),\"\")","v":""}]
[null,null,null,{"$f":"IFERROR(VLOOKUP(C245,Nota_Fiscal!E237:I238,2,0),\"\")","v":""}]
[null,null,null,{"$f":"IFERROR(VLOOKUP(C246,Nota_Fiscal!E238:I239,2,0),\"\")","v":""}]
[null,null,null,{"$f":"IFERROR(VLOOKUP(C247,Nota_Fiscal!E239:I240,2,0),\"\")","v":""}]
[null,null,null,{"$f":"IFERROR(VLOOKUP(C248,Nota_Fiscal!E240:I241,2,0),\"\")","v":""}]
[null,null,null,{"$f":"IFERROR(VLOOKUP(C249,Nota_Fiscal!E241:I242,2,0),\"\")","v":""}]
[null,null,null,{"$f":"IFERROR(VLOOKUP(C250,Nota_Fiscal!E242:I243,2,0),\"\")","v":""}]
[null,null,null,{"$f":"IFERROR(VLOOKUP(C251,Nota_Fiscal!E243:I244,2,0),\"\")","v":""}]
[null,null,null,{"$f":"IFERROR(VLOOKUP(C252,Nota_Fiscal!E244:I245,2,0),\"\")","v":""}]
[null,null,null,{"$f":"IFERROR(VLOOKUP(C253,Nota_Fiscal!E245:I246,2,0),\"\")","v":""}]
[null,null,null,{"$f":"IFERROR(VLOOKUP(C254,Nota_Fiscal!E246:I247,2,0),\"\")","v":""}]
[null,null,null,{"$f":"IFERROR(VLOOKUP(C255,Nota_Fiscal!E247:I248,2,0),\"\")","v":""}]
[null,null,null,{"$f":"IFERROR(VLOOKUP(C256,Nota_Fiscal!E248:I249,2,0),\"\")","v":""}]
[null,null,null,{"$f":"IFERROR(VLOOKUP(C257,Nota_Fiscal!E249:I250,2,0),\"\")","v":""}]
[null,null,null,{"$f":"IFERROR(VLOOKUP(C258,Nota_Fiscal!E250:I251,2,0),\"\")","v":""}]
[null,null,null,{"$f":"IFERROR(VLOOKUP(C259,Nota_Fiscal!E251:I252,2,0),\"\")","v":""}]
[null,null,null,{"$f":"IFERROR(VLOOKUP(C260,Nota_Fiscal!E252:I253,2,0),\"\")","v":""}]
[null,null,null,{"$f":"IFERROR(VLOOKUP(C261,Nota_Fiscal!E253:I254,2,0),\"\")","v":""}]
[null,null,null,{"$f":"IFERROR(VLOOKUP(C262,Nota_Fiscal!E254:I255,2,0),\"\")","v":""}]
[null,null,null,{"$f":"IFERROR(VLOOKUP(C263,Nota_Fiscal!E255:I256,2,0),\"\")","v":""}]
[null,null,null,{"$f":"IFERROR(VLOOKUP(C264,Nota_Fiscal!E256:I257,2,0),\"\")","v":""}]
[null,null,null,{"$f":"IFERROR(VLOOKUP(C265,Nota_Fiscal!E257:I258,2,0),\"\")","v":""}]
[null,null,null,{"$f":"IFERROR(VLOOKUP(C266,Nota_Fiscal!E258:I259,2,0),\"\")","v":""}]
[null,null,null,{"$f":"IFERROR(VLOOKUP(C267,Nota_Fiscal!E259:I260,2,0),\"\")","v":""}]
[null,null,null,{"$f":"IFERROR(VLOOKUP(C268,Nota_Fiscal!E260:I261,2,0),\"\")","v":""}]
[null,null,null,{"$f":"IFERROR(VLOOKUP(C269,Nota_Fiscal!E261:I262,2,0),\"\")","v":""}]
[null,null,null,{"$f":"IFERROR(VLOOKUP(C270,Nota_Fiscal!E262:I263,2,0),\"\")","v":""}]
[null,null,null,{"$f":"IFERROR(VLOOKUP(C271,Nota_Fiscal!E263:I264,2,0),\"\")","v":""}]
[null,null,null,{"$f":"IFERROR(VLOOKUP(C272,Nota_Fiscal!E264:I265,2,0),\"\")","v":""}]
[null,null,null,{"$f":"IFERROR(VLOOKUP(C273,Nota_Fiscal!E265:I266,2,0),\"\")","v":""}]
[null,null,null,{"$f":"IFERROR(VLOOKUP(C274,Nota_Fiscal!E266:I267,2,0),\"\")","v":""}]
[null,null,null,{"$f":"IFERROR(VLOOKUP(C275,Nota_Fiscal!E267:I268,2,0),\"\")","v":""}]
[null,null,null,{"$f":"IFERROR(VLOOKUP(C276,Nota_Fiscal!E268:I269,2,0),\"\")","v":""}]
[null,null,null,{"$f":"IFERROR(VLOOKUP(C277,Nota_Fiscal!E269:I270,2,0),\"\")","v":""}]
[null,null,null,{"$f":"IFERROR(VLOOKUP(C278,Nota_Fiscal!E270:I271,2,0),\"\")","v":""}]
[null,null,null,{"$f":"IFERROR(VLOOKUP(C279,Nota_Fiscal!E271:I272,2,0),\"\")","v":""}]
[null,null,null,{"$f":"IFERROR(VLOOKUP(C280,Nota_Fiscal!E272:I273,2,0),\"\")","v":""}]
[null,null,null,{"$f":"IFERROR(VLOOKUP(C281,Nota_Fiscal!E273:I274,2,0),\"\")","v":""}]
[null,null,null,{"$f":"IFERROR(VLOOKUP(C282,Nota_Fiscal!E274:I275,2,0),\"\")","v":""}]
[null,null,null,{"$f":"IFERROR(VLOOKUP(C283,Nota_Fiscal!E275:I276,2,0),\"\")","v":""}]
[null,null,null,{"$f":"IFERROR(VLOOKUP(C284,Nota_Fiscal!E276:I277,2,0),\"\")","v":""}]
[null,null,null,{"$f":"IFERROR(VLOOKUP(C285,Nota_Fiscal!E277:I278,2,0),\"\")","v":""}]
[null,null,null,{"$f":"IFERROR(VLOOKUP(C286,Nota_Fiscal!E278:I279,2,0),\"\")","v":""}]
[null,null,null,{"$f":"IFERROR(VLOOKUP(C287,Nota_Fiscal!E279:I280,2,0),\"\")","v":""}]
[null,null,null,{"$f":"IFERROR(VLOOKUP(C288,Nota_Fiscal!E280:I281,2,0),\"\")","v":""}]
[null,null,null,{"$f":"IFERROR(VLOOKUP(C289,Nota_Fiscal!E281:I282,2,0),\"\")","v":""}]
[null,null,null,{"$f":"IFERROR(VLOOKUP(C290,Nota_Fiscal!E282:I283,2,0),\"\")","v":""}]
[null,null,null,{"$f":"IFERROR(VLOOKUP(C291,Nota_Fiscal!E283:I284,2,0),\"\")","v":""}]
[null,null,null,{"$f":"IFERROR(VLOOKUP(C292,Nota_Fiscal!E284:I285,2,0),\"\")","v":""}]
[null,null,null,{"$f":"IFERROR(VLOOKUP(C293,Nota_Fiscal!E285:I286,2,0),\"\")","v":""}]
[null,null,null,{"$f":"IFERROR(VLOOKUP(C294,Nota_Fiscal!E286:I287,2,0),\"\")","v":""}]
[null,null,null,{"$f":"IFERROR(VLOOKUP(C295,Nota_Fiscal!E287:I288,2,0),\"\")","v":""}]
[null,null,null,{"$f":"IFERROR(VLOOKUP(C296,Nota_Fiscal!E288:I289,2,0),\"\")","v":""}]
[null,null,null,{"$f":"IFERROR(VLOOKUP(C297,Nota_Fiscal!E289:I290,2,0),\"\")","v":""}]
[null,null,null,{"$f":"IFERROR(VLOOKUP(C298,Nota_Fiscal!E290:I291,2,0),\"\")","v":""}]
[null,null,null,{"$f":"IFERROR(VLOOKUP(C299,Nota_Fiscal!E291:I292,2,0),\"\")","v":""}]
[null,null,null,{"$f":"IFERROR(VLOOKUP(C300,Nota_Fiscal!E292:I293,2,0),\"\")","v":""}]
[null,null,null,{"$f":"IFERROR(VLOOKUP(C301,Nota_Fiscal!E293:I294,2,0),\"\")","v":""}]
[null,null,null,{"$f":"IFERROR(VLOOKUP(C302,Nota_Fiscal!E294:I295,2,0),\"\")","v":""}]
[null,null,null,{"$f":"IFERROR(VLOOKUP(C303,Nota_Fiscal!E295:I296,2,0),\"\")","v":""}]
[null,null,null,{"$f":"IFERROR(VLOOKUP(C304,Nota_Fiscal!E296:I297,2,0),\"\")","v":""}]
[null,null,null,{"$f":"IFERROR(VLOOKUP(C305,Nota_Fiscal!E297:I298,2,0),\"\")","v":""}]
[null,null,null,{"$f":"IFERROR(VLOOKUP(C306,Nota_Fiscal!E298:I299,2,0),\"\")","v":""}]
[null,null,null,{"$f":"IFERROR(VLOOKUP(C307,Nota_Fiscal!E299:I300,2,0),\"\")","v":""}]
[null,null,null,{"$f":"IFERROR(VLOOKUP(C308,Nota_Fiscal!E300:I301,2,0),\"\")","v":""}]
[null,null,null,{"$f":"IFERROR(VLOOKUP(C309,Nota_Fiscal!E301:I302,2,0),\"\")","v":""}]
[null,null,null,{"$f":"IFERROR(VLOOKUP(C310,Nota_Fiscal!E302:I303,2,0),\"\")","v":""}]
[null,null,null,{"$f":"IFERROR(VLOOKUP(C311,Nota_Fiscal!E303:I304,2,0),\"\")","v":""}]
[null,null,null,{"$f":"IFERROR(VLOOKUP(C312,Nota_Fiscal!E304:I305,2,0),\"\")","v":""}]
[null,null,null,{"$f":"IFERROR(VLOOKUP(C313,Nota_Fiscal!E305:I306,2,0),\"\")","v":""}]
[null,null,null,{"$f":"IFERROR(VLOOKUP(C314,Nota_Fiscal!E306:I307,2,0),\"\")","v":""}]
[null,null,null,{"$f":"IFERROR(VLOOKUP(C315,Nota_Fiscal!E307:I308,2,0),\"\")","v":""}]
[null,null,null,{"$f":"IFERROR(VLOOKUP(C316,Nota_Fiscal!E308:I309,2,0),\"\")","v":""}]
[null,null,null,{"$f":"IFERROR(VLOOKUP(C317,Nota_Fiscal!E309:I310,2,0),\"\")","v":""}]
[null,null,null,{"$f":"IFERROR(VLOOKUP(C318,Nota_Fiscal!E310:I311,2,0),\"\")","v":""}]
[null,null,null,{"$f":"IFERROR(VLOOKUP(C319,Nota_Fiscal!E311:I312,2,0),\"\")","v":""}]
[null,null,null,{"$f":"IFERROR(VLOOKUP(C320,Nota_Fiscal!E312:I313,2,0),\"\")","v":""}]
[null,null,null,{"$f":"IFERROR(VLOOKUP(C321,Nota_Fiscal!E313:I314,2,0),\"\")","v":""}]
[null,null,null,{"$f":"IFERROR(VLOOKUP(C322,Nota_Fiscal!E314:I315,2,0),\"\")","v":""}]
[null,null,null,{"$f":"IFERROR(VLOOKUP(C323,Nota_Fiscal!E315:I316,2,0),\"\")","v":""}]
[null,null,null,{"$f":"IFERROR(VLOOKUP(C324,Nota_Fiscal!E316:I317,2,0),\"\")","v":""}]
[null,null,null,{"$f":"IFERROR(VLOOKUP(C325,Nota_Fiscal!E317:I318,2,0),\"\")","v":""}]
[null,null,null,{"$f":"IFERROR(VLOOKUP(C326,Nota_Fiscal!E318:I319,2,0),\"\")","v":""}]
[null,null,null,{"$f":"IFERROR(VLOOKUP(C327,Nota_Fiscal!E319:I320,2,0),\"\")","v":""}]
[null,null,null,{"$f":"IFERROR(VLOOKUP(C328,Nota_Fiscal!E320:I321,2,0),\"\")","v":""}]
[null,null,null,{"$f":"IFERROR(VLOOKUP(C329,Nota_Fiscal!E321:I322,2,0),\"\")","v":""}]
[null,null,null,{"$f":"IFERROR(VLOOKUP(C330,Nota_Fiscal!E322:I323,2,0),\"\")","v":""}]
[null,null,null,{"$f":"IFERROR(VLOOKUP(C331,Nota_Fiscal!E323:I324,2,0),\"\")","v":""}]
[null,null,null,{"$f":"IFERROR(VLOOKUP(C332,Nota_Fiscal!E324:I325,2,0),\"\")","v":""}]
[null,null,null,{"$f":"IFERROR(VLOOKUP(C333,Nota_Fiscal!E325:I326,2,0),\"\")","v":""}]
[null,null,null,{"$f":"IFERROR(VLOOKUP(C334,Nota_Fiscal!E326:I327,2,0),\"\")","v":""}]
[null,null,null,{"$f":"IFERROR(VLOOKUP(C335,Nota_Fiscal!E327:I328,2,0),\"\")","v":""}]
[null,null,null,{"$f":"IFERROR(VLOOKUP(C336,Nota_Fiscal!E328:I329,2,0),\"\")","v":""}]
[null,null,null,{"$f":"IFERROR(VLOOKUP(C337,Nota_Fiscal!E329:I330,2,0),\"\")","v":""}]
[null,null,null,{"$f":"IFERROR(VLOOKUP(C338,Nota_Fiscal!E330:I331,2,0),\"\")","v":""}]
[null,null,null,{"$f":"IFERROR(VLOOKUP(C339,Nota_Fiscal!E331:I332,2,0),\"\")","v":""}]
[null,null,null,{"$f":"IFERROR(VLOOKUP(C340,Nota_Fiscal!E332:I333,2,0),\"\")","v":""}]
[null,null,null,{"$f":"IFERROR(VLOOKUP(C341,Nota_Fiscal!E333:I334,2,0),\"\")","v":""}]
[null,null,null,{"$f":"IFERROR(VLOOKUP(C342,Nota_Fiscal!E334:I335,2,0),\"\")","v":""}]
[null,null,null,{"$f":"IFERROR(VLOOKUP(C343,Nota_Fiscal!E335:I336,2,0),\"\")","v":""}]
[null,null,null,{"$f":"IFERROR(VLOOKUP(C344,Nota_Fiscal!E336:I337,2,0),\"\")","v":""}]
[null,null,null,{"$f":"IFERROR(VLOOKUP(C345,Nota_Fiscal!E337:I338,2,0),\"\")","v":""}]
[null,null,null,{"$f":"IFERROR(VLOOKUP(C346,Nota_Fiscal!E338:I339,2,0),\"\")","v":""}]
[null,null,null,{"$f":"IFERROR(VLOOKUP(C347,Nota_Fiscal!E339:I340,2,0),\"\")","v":""}]
[null,null,null,{"$f":"IFERROR(VLOOKUP(C348,Nota_Fiscal!E340:I341,2,0),\"\")","v":""}]
[null,null,null,{"$f":"IFERROR(VLOOKUP(C349,Nota_Fiscal!E341:I342,2,0),\"\")","v":""}]
[null,null,null,{"$f":"IFERROR(VLOOKUP(C350,Nota_Fiscal!E342:I343,2,0),\"\")","v":""}]
[null,null,null,{"$f":"IFERROR(VLOOKUP(C351,Nota_Fiscal!E343:I344,2,0),\"\")","v":""}]
[null,null,null,{"$f":"IFERROR(VLOOKUP(C352,Nota_Fiscal!E344:I345,2,0),\"\")","v":""}]
[null,null,null,{"$f":"IFERROR(VLOOKUP(C353,Nota_Fiscal!E345:I346,2,0),\"\")","v":""}]
[null,null,null,{"$f":"IFERROR(VLOOKUP(C354,Nota_Fiscal!E346:I347,2,0),\"\")","v":""}]
[null,null,null,{"$f":"IFERROR(VLOOKUP(C355,Nota_Fiscal!E347:I348,2,0),\"\")","v":""}]
[null,null,null,{"$f":"IFERROR(VLOOKUP(C356,Nota_Fiscal!E348:I349,2,0),\"\")","v":""}]
[null,null,null,{"$f":"IFERROR(VLOOKUP(C357,Nota_Fiscal!E349:I350,2,0),\"\")","v":""}]
[null,null,null,{"$f":"IFERROR(VLOOKUP(C358,Nota_Fiscal!E350:I351,2,0),\"\")","v":""}]
[null,null,null,{"$f":"IFERROR(VLOOKUP(C359,Nota_Fiscal!E351:I352,2,0),\"\")","v":""}]
[null,null,null,{"$f":"IFERROR(VLOOKUP(C360,Nota_Fiscal!E352:I353,2,0),\"\")","v":""}]
[null,null,null,{"$f":"IFERROR(VLOOKUP(C361,Nota_Fiscal!E353:I354,2,0),\"\")","v":""}]
[null,null,null,{"$f":"IFERROR(VLOOKUP(C362,Nota_Fiscal!E354:I355,2,0),\"\")","v":""}]
[null,null,null,{"$f":"IFERROR(VLOOKUP(C363,Nota_Fiscal!E355:I356,2,0),\"\")","v":""}]
[null,null,null,{"$f":"IFERROR(VLOOKUP(C364,Nota_Fiscal!E356:I357,2,0),\"\")","v":""}]
[null,null,null,{"$f":"IFERROR(VLOOKUP(C365,Nota_Fiscal!E357:I358,2,0),\"\")","v":""}]
[null,null,null,{"$f":"IFERROR(VLOOKUP(C366,Nota_Fiscal!E358:I359,2,0),\"\")","v":""}]
[null,null,null,{"$f":"IFERROR(VLOOKUP(C367,Nota_Fiscal!E359:I360,2,0),\"\")","v":""}]
[null,null,null,{"$f":"IFERROR(VLOOKUP(C368,Nota_Fiscal!E360:I361,2,0),\"\")","v":""}]
[null,null,null,{"$f":"IFERROR(VLOOKUP(C369,Nota_Fiscal!E361:I362,2,0),\"\")","v":""}]
[null,null,null,{"$f":"IFERROR(VLOOKUP(C370,Nota_Fiscal!E362:I363,2,0),\"\")","v":""}]
[null,null,null,{"$f":"IFERROR(VLOOKUP(C371,Nota_Fiscal!E363:I364,2,0),\"\")","v":""}]
[null,null,null,{"$f":"IFERROR(VLOOKUP(C372,Nota_Fiscal!E364:I365,2,0),\"\")","v":""}]
[null,null,null,{"$f":"IFERROR(VLOOKUP(C373,Nota_Fiscal!E365:I366,2,0),\"\")","v":""}]
[null,null,null,{"$f":"IFERROR(VLOOKUP(C374,Nota_Fiscal!E366:I367,2,0),\"\")","v":""}]
[null,null,null,{"$f":"IFERROR(VLOOKUP(C375,Nota_Fiscal!E367:I368,2,0),\"\")","v":""}]
[null,null,null,{"$f":"IFERROR(VLOOKUP(C376,Nota_Fiscal!E368:I369,2,0),\"\")","v":""}]
[null,null,null,{"$f":"IFERROR(VLOOKUP(C377,Nota_Fiscal!E369:I370,2,0),\"\")","v":""}]
[null,null,null,{"$f":"IFERROR(VLOOKUP(C378,Nota_Fiscal!E370:I371,2,0),\"\")","v":""}]
[null,null,null,{"$f":"IFERROR(VLOOKUP(C379,Nota_Fiscal!E371:I372,2,0),\"\")","v":""}]
[null,null,null,{"$f":"IFERROR(VLOOKUP(C380,Nota_Fiscal!E372:I373,2,0),\"\")","v":""}]
[null,null,null,{"$f":"IFERROR(VLOOKUP(C381,Nota_Fiscal!E373:I374,2,0),\"\")","v":""}]
[null,null,null,{"$f":"IFERROR(VLOOKUP(C382,Nota_Fiscal!E374:I375,2,0),\"\")","v":""}]
[null,null,null,{"$f":"IFERROR(VLOOKUP(C383,Nota_Fiscal!E375:I376,2,0),\"\")","v":""}]
[null,null,null,{"$f":"IFERROR(VLOOKUP(C384,Nota_Fiscal!E376:I377,2,0),\"\")","v":""}]
[null,null,null,{"$f":"IFERROR(VLOOKUP(C385,Nota_Fiscal!E377:I378,2,0),\"\")","v":""}]
[null,null,null,{"$f":"IFERROR(VLOOKUP(C386,Nota_Fiscal!E378:I379,2,0),\"\")","v":""}]
[null,null,null,{"$f":"IFERROR(VLOOKUP(C387,Nota_Fiscal!E379:I380,2,0),\"\")","v":""}]
[null,null,null,{"$f":"IFERROR(VLOOKUP(C388,Nota_Fiscal!E380:I381,2,0),\"\")","v":""}]
[null,null,null,{"$f":"IFERROR(VLOOKUP(C389,Nota_Fiscal!E381:I382,2,0),\"\")","v":""}]
[null,null,null,{"$f":"IFERROR(VLOOKUP(C390,Nota_Fiscal!E382:I383,2,0),\"\")","v":""}]
[null,null,null,{"$f":"IFERROR(VLOOKUP(C391,Nota_Fiscal!E383:I384,2,0),\"\")","v":""}]
[null,null,null,{"$f":"IFERROR(VLOOKUP(C392,Nota_Fiscal!E384:I385,2,0),\"\")","v":""}]
[null,null,null,{"$f":"IFERROR(VLOOKUP(C393,Nota_Fiscal!E385:I386,2,0),\"\")","v":""}]
[null,null,null,{"$f":"IFERROR(VLOOKUP(C394,Nota_Fiscal!E386:I387,2,0),\"\")","v":""}]
[null,null,null,{"$f":"IFERROR(VLOOKUP(C395,Nota_Fiscal!E387:I388,2,0),\"\")","v":""}]
[null,null,null,{"$f":"IFERROR(VLOOKUP(C396,Nota_Fiscal!E388:I389,2,0),\"\")","v":""}]
[null,null,null,{"$f":"IFERROR(VLOOKUP(C397,Nota_Fiscal!E389:I390,2,0),\"\")","v":""}]
[null,null,null,{"$f":"IFERROR(VLOOKUP(C398,Nota_Fiscal!E390:I391,2,0),\"\")","v":""}]
[null,null,null,{"$f":"IFERROR(VLOOKUP(C399,Nota_Fiscal!E391:I392,2,0),\"\")","v":""}]
[null,null,null,{"$f":"IFERROR(VLOOKUP(C400,Nota_Fiscal!E392:I393,2,0),\"\")","v":""}]
[null,null,null,{"$f":"IFERROR(VLOOKUP(C401,Nota_Fiscal!E393:I394,2,0),\"\")","v":""}]
[null,null,null,{"$f":"IFERROR(VLOOKUP(C402,Nota_Fiscal!E394:I395,2,0),\"\")","v":""}]
[null,null,null,{"$f":"IFERROR(VLOOKUP(C403,Nota_Fiscal!E395:I396,2,0),\"\")","v":""}]
[null,null,null,{"$f":"IFERROR(VLOOKUP(C404,Nota_Fiscal!E396:I397,2,0),\"\")","v":""}]
[null,null,null,{"$f":"IFERROR(VLOOKUP(C405,Nota_Fiscal!E397:I398,2,0),\"\")","v":""}]
[null,null,null,{"$f":"IFERROR(VLOOKUP(C406,Nota_Fiscal!E398:I399,2,0),\"\")","v":""}]
[null,null,null,{"$f":"IFERROR(VLOOKUP(C407,Nota_Fiscal!E399:I400,2,0),\"\")","v":""}]
[null,null,null,{"$f":"IFERROR(VLOOKUP(C408,Nota_Fiscal!E400:I401,2,0),\"\")","v":""}]
[null,null,null,{"$f":"IFERROR(VLOOKUP(C409,Nota_Fiscal!E401:I402,2,0),\"\")","v":""}]
[null,null,null,{"$f":"IFERROR(VLOOKUP(C410,Nota_Fiscal!E402:I403,2,0),\"\")","v":""}]
[null,null,null,{"$f":"IFERROR(VLOOKUP(C411,Nota_Fiscal!E403:I404,2,0),\"\")","v":""}]
[null,null,null,{"$f":"IFERROR(VLOOKUP(C412,Nota_Fiscal!E404:I405,2,0),\"\")","v":""}]
[null,null,null,{"$f":"IFERROR(VLOOKUP(C413,Nota_Fiscal!E405:I406,2,0),\"\")","v":""}]
[null,null,null,{"$f":"IFERROR(VLOOKUP(C414,Nota_Fiscal!E406:I407,2,0),\"\")","v":""}]
[null,null,null,{"$f":"IFERROR(VLOOKUP(C415,Nota_Fiscal!E407:I408,2,0),\"\")","v":""}]
[null,null,null,{"$f":"IFERROR(VLOOKUP(C416,Nota_Fiscal!E408:I409,2,0),\"\")","v":""}]
[null,null,null,{"$f":"IFERROR(VLOOKUP(C417,Nota_Fiscal!E409:I410,2,0),\"\")","v":""}]
[null,null,null,{"$f":"IFERROR(VLOOKUP(C418,Nota_Fiscal!E410:I411,2,0),\"\")","v":""}]
[null,null,null,{"$f":"IFERROR(VLOOKUP(C419,Nota_Fiscal!E411:I412,2,0),\"\")","v":""}]
[null,null,null,{"$f":"IFERROR(VLOOKUP(C420,Nota_Fiscal!E412:I413,2,0),\"\")","v":""}]
[null,null,null,{"$f":"IFERROR(VLOOKUP(C421,Nota_Fiscal!E413:I414,2,0),\"\")","v":""}]
[null,null,null,{"$f":"IFERROR(VLOOKUP(C422,Nota_Fiscal!E414:I415,2,0),\"\")","v":""}]
[null,null,null,{"$f":"IFERROR(VLOOKUP(C423,Nota_Fiscal!E415:I416,2,0),\"\")","v":""}]
[null,null,null,{"$f":"IFERROR(VLOOKUP(C424,Nota_Fiscal!E416:I417,2,0),\"\")","v":""}]
[null,null,null,{"$f":"IFERROR(VLOOKUP(C425,Nota_Fiscal!E417:I418,2,0),\"\")","v":""}]
[null,null,null,{"$f":"IFERROR(VLOOKUP(C426,Nota_Fiscal!E418:I419,2,0),\"\")","v":""}]
[null,null,null,{"$f":"IFERROR(VLOOKUP(C427,Nota_Fiscal!E419:I420,2,0),\"\")","v":""}]
[null,null,null,{"$f":"IFERROR(VLOOKUP(C428,Nota_Fiscal!E420:I421,2,0),\"\")","v":""}]
[null,null,null,{"$f":"IFERROR(VLOOKUP(C429,Nota_Fiscal!E421:I422,2,0),\"\")","v":""}]
[null,null,null,{"$f":"IFERROR(VLOOKUP(C430,Nota_Fiscal!E422:I423,2,0),\"\")","v":""}]
[null,null,null,{"$f":"IFERROR(VLOOKUP(C431,Nota_Fiscal!E423:I424,2,0),\"\")","v":""}]
[null,null,null,{"$f":"IFERROR(VLOOKUP(C432,Nota_Fiscal!E424:I425,2,0),\"\")","v":""}]
[null,null,null,{"$f":"IFERROR(VLOOKUP(C433,Nota_Fiscal!E425:I426,2,0),\"\")","v":""}]
[null,null,null,{"$f":"IFERROR(VLOOKUP(C434,Nota_Fiscal!E426:I427,2,0),\"\")","v":""}]
[null,null,null,{"$f":"IFERROR(VLOOKUP(C435,Nota_Fiscal!E427:I428,2,0),\"\")","v":""}]
[null,null,null,{"$f":"IFERROR(VLOOKUP(C436,Nota_Fiscal!E428:I429,2,0),\"\")","v":""}]
[null,null,null,{"$f":"IFERROR(VLOOKUP(C437,Nota_Fiscal!E429:I430,2,0),\"\")","v":""}]
[null,null,null,{"$f":"IFERROR(VLOOKUP(C438,Nota_Fiscal!E430:I431,2,0),\"\")","v":""}]
[null,null,null,{"$f":"IFERROR(VLOOKUP(C439,Nota_Fiscal!E431:I432,2,0),\"\")","v":""}]
[null,null,null,{"$f":"IFERROR(VLOOKUP(C440,Nota_Fiscal!E432:I433,2,0),\"\")","v":""}]
[null,null,null,{"$f":"IFERROR(VLOOKUP(C441,Nota_Fiscal!E433:I434,2,0),\"\")","v":""}]
[null,null,null,{"$f":"IFERROR(VLOOKUP(C442,Nota_Fiscal!E434:I435,2,0),\"\")","v":""}]
[null,null,null,{"$f":"IFERROR(VLOOKUP(C443,Nota_Fiscal!E435:I436,2,0),\"\")","v":""}]
[null,null,null,{"$f":"IFERROR(VLOOKUP(C444,Nota_Fiscal!E436:I437,2,0),\"\")","v":""}]
[null,null,null,{"$f":"IFERROR(VLOOKUP(C445,Nota_Fiscal!E437:I438,2,0),\"\")","v":""}]
[null,null,null,{"$f":"IFERROR(VLOOKUP(C446,Nota_Fiscal!E438:I439,2,0),\"\")","v":""}]
[null,null,null,{"$f":"IFERROR(VLOOKUP(C447,Nota_Fiscal!E439:I440,2,0),\"\")","v":""}]
[null,null,null,{"$f":"IFERROR(VLOOKUP(C448,Nota_Fiscal!E440:I441,2,0),\"\")","v":""}]
[null,null,null,{"$f":"IFERROR(VLOOKUP(C449,Nota_Fiscal!E441:I442,2,0),\"\")","v":""}]
[null,null,null,{"$f":"IFERROR(VLOOKUP(C450,Nota_Fiscal!E442:I443,2,0),\"\")","v":""}]
[null,null,null,{"$f":"IFERROR(VLOOKUP(C451,Nota_Fiscal!E443:I444,2,0),\"\")","v":""}]
[null,null,null,{"$f":"IFERROR(VLOOKUP(C452,Nota_Fiscal!E444:I445,2,0),\"\")","v":""}]
[null,null,null,{"$f":"IFERROR(VLOOKUP(C453,Nota_Fiscal!E445:I446,2,0),\"\")","v":""}]
[null,null,null,{"$f":"IFERROR(VLOOKUP(C454,Nota_Fiscal!E446:I447,2,0),\"\")","v":""}]
[null,null,null,{"$f":"IFERROR(VLOOKUP(C455,Nota_Fiscal!E447:I448,2,0),\"\")","v":""}]
[null,null,null,{"$f":"IFERROR(VLOOKUP(C456,Nota_Fiscal!E448:I449,2,0),\"\")","v":""}]
[null,null,null,{"$f":"IFERROR(VLOOKUP(C457,Nota_Fiscal!E449:I450,2,0),\"\")","v":""}]
[null,null,null,{"$f":"IFERROR(VLOOKUP(C458,Nota_Fiscal!E450:I451,2,0),\"\")","v":""}]
[null,null,null,{"$f":"IFERROR(VLOOKUP(C459,Nota_Fiscal!E451:I452,2,0),\"\")","v":""}]
[null,null,null,{"$f":"IFERROR(VLOOKUP(C460,Nota_Fiscal!E452:I453,2,0),\"\")","v":""}]
[null,null,null,{"$f":"IFERROR(VLOOKUP(C461,Nota_Fiscal!E453:I454,2,0),\"\")","v":""}]
[null,null,null,{"$f":"IFERROR(VLOOKUP(C462,Nota_Fiscal!E454:I455,2,0),\"\")","v":""}]
[null,null,null,{"$f":"IFERROR(VLOOKUP(C463,Nota_Fiscal!E455:I456,2,0),\"\")","v":""}]
[null,null,null,{"$f":"IFERROR(VLOOKUP(C464,Nota_Fiscal!E456:I457,2,0),\"\")","v":""}]
[null,null,null,{"$f":"IFERROR(VLOOKUP(C465,Nota_Fiscal!E457:I458,2,0),\"\")","v":""}]
[null,null,null,{"$f":"IFERROR(VLOOKUP(C466,Nota_Fiscal!E458:I459,2,0),\"\")","v":""}]
[null,null,null,{"$f":"IFERROR(VLOOKUP(C467,Nota_Fiscal!E459:I460,2,0),\"\")","v":""}]
[null,null,null,{"$f":"IFERROR(VLOOKUP(C468,Nota_Fiscal!E460:I461,2,0),\"\")","v":""}]
[null,null,null,{"$f":"IFERROR(VLOOKUP(C469,Nota_Fiscal!E461:I462,2,0),\"\")","v":""}]
[null,null,null,{"$f":"IFERROR(VLOOKUP(C470,Nota_Fiscal!E462:I463,2,0),\"\")","v":""}]
[null,null,null,{"$f":"IFERROR(VLOOKUP(C471,Nota_Fiscal!E463:I464,2,0),\"\")","v":""}]
[null,null,null,{"$f":"IFERROR(VLOOKUP(C472,Nota_Fiscal!E464:I465,2,0),\"\")","v":""}]
[null,null,null,{"$f":"IFERROR(VLOOKUP(C473,Nota_Fiscal!E465:I466,2,0),\"\")","v":""}]
[null,null,null,{"$f":"IFERROR(VLOOKUP(C474,Nota_Fiscal!E466:I467,2,0),\"\")","v":""}]
[null,null,null,{"$f":"IFERROR(VLOOKUP(C475,Nota_Fiscal!E467:I468,2,0),\"\")","v":""}]
[null,null,null,{"$f":"IFERROR(VLOOKUP(C476,Nota_Fiscal!E468:I469,2,0),\"\")","v":""}]
[null,null,null,{"$f":"IFERROR(VLOOKUP(C477,Nota_Fiscal!E469:I470,2,0),\"\")","v":""}]
[null,null,null,{"$f":"IFERROR(VLOOKUP(C478,Nota_Fiscal!E470:I471,2,0),\"\")","v":""}]
[null,null,null,{"$f":"IFERROR(VLOOKUP(C479,Nota_Fiscal!E471:I472,2,0),\"\")","v":""}]
[null,null,null,{"$f":"IFERROR(VLOOKUP(C480,Nota_Fiscal!E472:I473,2,0),\"\")","v":""}]
[null,null,null,{"$f":"IFERROR(VLOOKUP(C481,Nota_Fiscal!E473:I474,2,0),\"\")","v":""}]
[null,null,null,{"$f":"IFERROR(VLOOKUP(C482,Nota_Fiscal!E474:I475,2,0),\"\")","v":""}]
[null,null,null,{"$f":"IFERROR(VLOOKUP(C483,Nota_Fiscal!E475:I476,2,0),\"\")","v":""}]
[null,null,null,{"$f":"IFERROR(VLOOKUP(C484,Nota_Fiscal!E476:I477,2,0),\"\")","v":""}]
[null,null,null,{"$f":"IFERROR(VLOOKUP(C485,Nota_Fiscal!E477:I478,2,0),\"\")","v":""}]
[null,null,null,{"$f":"IFERROR(VLOOKUP(C486,Nota_Fiscal!E478:I479,2,0),\"\")","v":""}]
[null,null,null,{"$f":"IFERROR(VLOOKUP(C487,Nota_Fiscal!E479:I480,2,0),\"\")","v":""}]
[null,null,null,{"$f":"IFERROR(VLOOKUP(C488,Nota_Fiscal!E480:I481,2,0),\"\")","v":""}]
[null,null,null,{"$f":"IFERROR(VLOOKUP(C489,Nota_Fiscal!E481:I482,2,0),\"\")","v":""}]
[null,null,null,{"$f":"IFERROR(VLOOKUP(C490,Nota_Fiscal!E482:I483,2,0),\"\")","v":""}]
[null,null,null,{"$f":"IFERROR(VLOOKUP(C491,Nota_Fiscal!E483:I484,2,0),\"\")","v":""}]
[null,null,null,{"$f":"IFERROR(VLOOKUP(C492,Nota_Fiscal!E484:I485,2,0),\"\")","v":""}]
[null,null,null,{"$f":"IFERROR(VLOOKUP(C493,Nota_Fiscal!E485:I486,2,0),\"\")","v":""}]
[null,null,null,{"$f":"IFERROR(VLOOKUP(C494,Nota_Fiscal!E486:I487,2,0),\"\")","v":""}]
[null,null,null,{"$f":"IFERROR(VLOOKUP(C495,Nota_Fiscal!E487:I488,2,0),\"\")","v":""}]
[null,null,null,{"$f":"IFERROR(VLOOKUP(C496,Nota_Fiscal!E488:I489,2,0),\"\")","v":""}]
[null,null,null,{"$f":"IFERROR(VLOOKUP(C497,Nota_Fiscal!E489:I490,2,0),\"\")","v":""}]
[null,null,null,{"$f":"IFERROR(VLOOKUP(C498,Nota_Fiscal!E490:I491,2,0),\"\")","v":""}]
[null,null,null,{"$f":"IFERROR(VLOOKUP(C499,Nota_Fiscal!E491:I492,2,0),\"\")","v":""}]
[null,null,null,{"$f":"IFERROR(VLOOKUP(C500,Nota_Fiscal!E492:I493,2,0),\"\")","v":""}]
[null,null,null,{"$f":"IFERROR(VLOOKUP(C501,Nota_Fiscal!E493:I494,2,0),\"\")","v":""}]
[null,null,null,{"$f":"IFERROR(VLOOKUP(C502,Nota_Fiscal!E494:I495,2,0),\"\")","v":""}]
[null,null,null,{"$f":"IFERROR(VLOOKUP(C503,Nota_Fiscal!E495:I496,2,0),\"\")","v":""}]
[null,null,null,{"$f":"IFERROR(VLOOKUP(C504,Nota_Fiscal!E496:I497,2,0),\"\")","v":""}]
[null,null,null,{"$f":"IFERROR(VLOOKUP(C505,Nota_Fiscal!E497:I498,2,0),\"\")","v":""}]
[null,null,null,{"$f":"IFERROR(VLOOKUP(C506,Nota_Fiscal!E498:I499,2,0),\"\")","v":""}]
[null,null,null,{"$f":"IFERROR(VLOOKUP(C507,Nota_Fiscal!E499:I500,2,0),\"\")","v":""}]
[null,null,null,{"$f":"IFERROR(VLOOKUP(C508,Nota_Fiscal!E500:I501,2,0),\"\")","v":""}]
[null,null,null,{"$f":"IFERROR(VLOOKUP(C509,Nota_Fiscal!E501:I502,2,0),\"\")","v":""}]
[null,null,null,{"$f":"IFERROR(VLOOKUP(C510,Nota_Fiscal!E502:I503,2,0),\"\")","v":""}]
[null,null,null,{"$f":"IFERROR(VLOOKUP(C511,Nota_Fiscal!E503:I504,2,0),\"\")","v":""}]
[null,null,null,{"$f":"IFERROR(VLOOKUP(C512,Nota_Fiscal!E504:I505,2,0),\"\")","v":""}]
[null,null,null,{"$f":"IFERROR(VLOOKUP(C513,Nota_Fiscal!E505:I506,2,0),\"\")","v":""}]
[null,null,null,{"$f":"IFERROR(VLOOKUP(C514,Nota_Fiscal!E506:I507,2,0),\"\")","v":""}]
[null,null,null,{"$f":"IFERROR(VLOOKUP(C515,Nota_Fiscal!E507:I508,2,0),\"\")","v":""}]
[null,null,null,{"$f":"IFERROR(VLOOKUP(C516,Nota_Fiscal!E508:I509,2,0),\"\")","v":""}]
[null,null,null,{"$f":"IFERROR(VLOOKUP(C517,Nota_Fiscal!E509:I510,2,0),\"\")","v":""}]
[null,null,null,{"$f":"IFERROR(VLOOKUP(C518,Nota_Fiscal!E510:I511,2,0),\"\")","v":""}]
[null,null,null,{"$f":"IFERROR(VLOOKUP(C519,Nota_Fiscal!E511:I512,2,0),\"\")","v":""}]
[null,null,null,{"$f":"IFERROR(VLOOKUP(C520,Nota_Fiscal!E512:I513,2,0),\"\")","v":""}]
[null,null,null,{"$f":"IFERROR(VLOOKUP(C521,Nota_Fiscal!E513:I514,2,0),\"\")","v":""}]
[null,null,null,{"$f":"IFERROR(VLOOKUP(C522,Nota_Fiscal!E514:I515,2,0),\"\")","v":""}]
[null,null,null,{"$f":"IFERROR(VLOOKUP(C523,Nota_Fiscal!E515:I516,2,0),\"\")","v":""}]
[null,null,null,{"$f":"IFERROR(VLOOKUP(C524,Nota_Fiscal!E516:I517,2,0),\"\")","v":""}]
[null,null,null,{"$f":"IFERROR(VLOOKUP(C525,Nota_Fiscal!E517:I518,2,0),\"\")","v":""}]
[null,null,null,{"$f":"IFERROR(VLOOKUP(C526,Nota_Fiscal!E518:I519,2,0),\"\")","v":""}]
[null,null,null,{"$f":"IFERROR(VLOOKUP(C527,Nota_Fiscal!E519:I520,2,0),\"\")","v":""}]
[null,null,null,{"$f":"IFERROR(VLOOKUP(C528,Nota_Fiscal!E520:I521,2,0),\"\")","v":""}]
[null,null,null,{"$f":"IFERROR(VLOOKUP(C529,Nota_Fiscal!E521:I522,2,0),\"\")","v":""}]
[null,null,null,{"$f":"IFERROR(VLOOKUP(C530,Nota_Fiscal!E522:I523,2,0),\"\")","v":""}]
[null,null,null,{"$f":"IFERROR(VLOOKUP(C531,Nota_Fiscal!E523:I524,2,0),\"\")","v":""}]
[null,null,null,{"$f":"IFERROR(VLOOKUP(C532,Nota_Fiscal!E524:I525,2,0),\"\")","v":""}]
[null,null,null,{"$f":"IFERROR(VLOOKUP(C533,Nota_Fiscal!E525:I526,2,0),\"\")","v":""}]
[null,null,null,{"$f":"IFERROR(VLOOKUP(C534,Nota_Fiscal!E526:I527,2,0),\"\")","v":""}]
[null,null,null,{"$f":"IFERROR(VLOOKUP(C535,Nota_Fiscal!E527:I528,2,0),\"\")","v":""}]
[null,null,null,{"$f":"IFERROR(VLOOKUP(C536,Nota_Fiscal!E528:I529,2,0),\"\")","v":""}]
[null,null,null,{"$f":"IFERROR(VLOOKUP(C537,Nota_Fiscal!E529:I530,2,0),\"\")","v":""}]
[null,null,null,{"$f":"IFERROR(VLOOKUP(C538,Nota_Fiscal!E530:I531,2,0),\"\")","v":""}]
[null,null,null,{"$f":"IFERROR(VLOOKUP(C539,Nota_Fiscal!E531:I532,2,0),\"\")","v":""}]
[null,null,null,{"$f":"IFERROR(VLOOKUP(C540,Nota_Fiscal!E532:I533,2,0),\"\")","v":""}]
[null,null,null,{"$f":"IFERROR(VLOOKUP(C541,Nota_Fiscal!E533:I534,2,0),\"\")","v":""}]
[null,null,null,{"$f":"IFERROR(VLOOKUP(C542,Nota_Fiscal!E534:I535,2,0),\"\")","v":""}]
[null,null,null,{"$f":"IFERROR(VLOOKUP(C543,Nota_Fiscal!E535:I536,2,0),\"\")","v":""}]
[null,null,null,{"$f":"IFERROR(VLOOKUP(C544,Nota_Fiscal!E536:I537,2,0),\"\")","v":""}]
[null,null,null,{"$f":"IFERROR(VLOOKUP(C545,Nota_Fiscal!E537:I538,2,0),\"\")","v":""}]
[null,null,null,{"$f":"IFERROR(VLOOKUP(C546,Nota_Fiscal!E538:I539,2,0),\"\")","v":""}]
[null,null,null,{"$f":"IFERROR(VLOOKUP(C547,Nota_Fiscal!E539:I540,2,0),\"\")","v":""}]
[null,null,null,{"$f":"IFERROR(VLOOKUP(C548,Nota_Fiscal!E540:I541,2,0),\"\")","v":""}]
[null,null,null,{"$f":"IFERROR(VLOOKUP(C549,Nota_Fiscal!E541:I542,2,0),\"\")","v":""}]
[null,null,null,{"$f":"IFERROR(VLOOKUP(C550,Nota_Fiscal!E542:I543,2,0),\"\")","v":""}]
[null,null,null,{"$f":"IFERROR(VLOOKUP(C551,Nota_Fiscal!E543:I544,2,0),\"\")","v":""}]
[null,null,null,{"$f":"IFERROR(VLOOKUP(C552,Nota_Fiscal!E544:I545,2,0),\"\")","v":""}]
[null,null,null,{"$f":"IFERROR(VLOOKUP(C553,Nota_Fiscal!E545:I546,2,0),\"\")","v":""}]
[null,null,null,{"$f":"IFERROR(VLOOKUP(C554,Nota_Fiscal!E546:I547,2,0),\"\")","v":""}]
[null,null,null,{"$f":"IFERROR(VLOOKUP(C555,Nota_Fiscal!E547:I548,2,0),\"\")","v":""}]
[null,null,null,{"$f":"IFERROR(VLOOKUP(C556,Nota_Fiscal!E548:I549,2,0),\"\")","v":""}]
[null,null,null,{"$f":"IFERROR(VLOOKUP(C557,Nota_Fiscal!E549:I550,2,0),\"\")","v":""}]
[null,null,null,{"$f":"IFERROR(VLOOKUP(C558,Nota_Fiscal!E550:I551,2,0),\"\")","v":""}]
[null,null,null,{"$f":"IFERROR(VLOOKUP(C559,Nota_Fiscal!E551:I552,2,0),\"\")","v":""}]
[null,null,null,{"$f":"IFERROR(VLOOKUP(C560,Nota_Fiscal!E552:I553,2,0),\"\")","v":""}]
[null,null,null,{"$f":"IFERROR(VLOOKUP(C561,Nota_Fiscal!E553:I554,2,0),\"\")","v":""}]
[null,null,null,{"$f":"IFERROR(VLOOKUP(C562,Nota_Fiscal!E554:I555,2,0),\"\")","v":""}]
[null,null,null,{"$f":"IFERROR(VLOOKUP(C563,Nota_Fiscal!E555:I556,2,0),\"\")","v":""}]
[null,null,null,{"$f":"IFERROR(VLOOKUP(C564,Nota_Fiscal!E556:I557,2,0),\"\")","v":""}]
[null,null,null,{"$f":"IFERROR(VLOOKUP(C565,Nota_Fiscal!E557:I558,2,0),\"\")","v":""}]
[null,null,null,{"$f":"IFERROR(VLOOKUP(C566,Nota_Fiscal!E558:I559,2,0),\"\")","v":""}]
[null,null,null,{"$f":"IFERROR(VLOOKUP(C567,Nota_Fiscal!E559:I560,2,0),\"\")","v":""}]
[null,null,null,{"$f":"IFERROR(VLOOKUP(C568,Nota_Fiscal!E560:I561,2,0),\"\")","v":""}]
[null,null,null,{"$f":"IFERROR(VLOOKUP(C569,Nota_Fiscal!E561:I562,2,0),\"\")","v":""}]
[null,null,null,{"$f":"IFERROR(VLOOKUP(C570,Nota_Fiscal!E562:I563,2,0),\"\")","v":""}]
[null,null,null,{"$f":"IFERROR(VLOOKUP(C571,Nota_Fiscal!E563:I564,2,0),\"\")","v":""}]
[null,null,null,{"$f":"IFERROR(VLOOKUP(C572,Nota_Fiscal!E564:I565,2,0),\"\")","v":""}]
[null,null,null,{"$f":"IFERROR(VLOOKUP(C573,Nota_Fiscal!E565:I566,2,0),\"\")","v":""}]
[null,null,null,{"$f":"IFERROR(VLOOKUP(C574,Nota_Fiscal!E566:I567,2,0),\"\")","v":""}]
[null,null,null,{"$f":"IFERROR(VLOOKUP(C575,Nota_Fiscal!E567:I568,2,0),\"\")","v":""}]
[null,null,null,{"$f":"IFERROR(VLOOKUP(C576,Nota_Fiscal!E568:I569,2,0),\"\")","v":""}]
[null,null,null,{"$f":"IFERROR(VLOOKUP(C577,Nota_Fiscal!E569:I570,2,0),\"\")","v":""}]
[null,null,null,{"$f":"IFERROR(VLOOKUP(C578,Nota_Fiscal!E570:I571,2,0),\"\")","v":""}]
[null,null,null,{"$f":"IFERROR(VLOOKUP(C579,Nota_Fiscal!E571:I572,2,0),\"\")","v":""}]
[null,null,null,{"$f":"IFERROR(VLOOKUP(C580,Nota_Fiscal!E572:I573,2,0),\"\")","v":""}]
[null,null,null,{"$f":"IFERROR(VLOOKUP(C581,Nota_Fiscal!E573:I574,2,0),\"\")","v":""}]
[null,null,null,{"$f":"IFERROR(VLOOKUP(C582,Nota_Fiscal!E574:I575,2,0),\"\")","v":""}]
[null,null,null,{"$f":"IFERROR(VLOOKUP(C583,Nota_Fiscal!E575:I576,2,0),\"\")","v":""}]
[null,null,null,{"$f":"IFERROR(VLOOKUP(C584,Nota_Fiscal!E576:I577,2,0),\"\")","v":""}]
[null,null,null,{"$f":"IFERROR(VLOOKUP(C585,Nota_Fiscal!E577:I578,2,0),\"\")","v":""}]
[null,null,null,{"$f":"IFERROR(VLOOKUP(C586,Nota_Fiscal!E578:I579,2,0),\"\")","v":""}]
[null,null,null,{"$f":"IFERROR(VLOOKUP(C587,Nota_Fiscal!E579:I580,2,0),\"\")","v":""}]
[null,null,null,{"$f":"IFERROR(VLOOKUP(C588,Nota_Fiscal!E580:I581,2,0),\"\")","v":""}]
[null,null,null,{"$f":"IFERROR(VLOOKUP(C589,Nota_Fiscal!E581:I582,2,0),\"\")","v":""}]
[null,null,null,{"$f":"IFERROR(VLOOKUP(C590,Nota_Fiscal!E582:I583,2,0),\"\")","v":""}]
[null,null,null,{"$f":"IFERROR(VLOOKUP(C591,Nota_Fiscal!E583:I584,2,0),\"\")","v":""}]
[null,null,null,{"$f":"IFERROR(VLOOKUP(C592,Nota_Fiscal!E584:I585,2,0),\"\")","v":""}]
[null,null,null,{"$f":"IFERROR(VLOOKUP(C593,Nota_Fiscal!E585:I586,2,0),\"\")","v":""}]
[null,null,null,{"$f":"IFERROR(VLOOKUP(C594,Nota_Fiscal!E586:I587,2,0),\"\")","v":""}]
[null,null,null,{"$f":"IFERROR(VLOOKUP(C595,Nota_Fiscal!E587:I588,2,0),\"\")","v":""}]
[null,null,null,{"$f":"IFERROR(VLOOKUP(C596,Nota_Fiscal!E588:I589,2,0),\"\")","v":""}]
[null,null,null,{"$f":"IFERROR(VLOOKUP(C597,Nota_Fiscal!E589:I590,2,0),\"\")","v":""}]
[null,null,null,{"$f":"IFERROR(VLOOKUP(C598,Nota_Fiscal!E590:I591,2,0),\"\")","v":""}]
[null,null,null,{"$f":"IFERROR(VLOOKUP(C599,Nota_Fiscal!E591:I592,2,0),\"\")","v":""}]
[null,null,null,{"$f":"IFERROR(VLOOKUP(C600,Nota_Fiscal!E592:I593,2,0),\"\")","v":""}]
[null,null,null,{"$f":"IFERROR(VLOOKUP(C601,Nota_Fiscal!E593:I594,2,0),\"\")","v":""}]
[null,null,null,{"$f":"IFERROR(VLOOKUP(C602,Nota_Fiscal!E594:I595,2,0),\"\")","v":""}]
[null,null,null,{"$f":"IFERROR(VLOOKUP(C603,Nota_Fiscal!E595:I596,2,0),\"\")","v":""}]
[null,null,null,{"$f":"IFERROR(VLOOKUP(C604,Nota_Fiscal!E596:I597,2,0),\"\")","v":""}]
[null,null,null,{"$f":"IFERROR(VLOOKUP(C605,Nota_Fiscal!E597:I598,2,0),\"\")","v":""}]
[null,null,null,{"$f":"IFERROR(VLOOKUP(C606,Nota_Fiscal!E598:I599,2,0),\"\")","v":""}]
[null,null,null,{"$f":"IFERROR(VLOOKUP(C607,Nota_Fiscal!E599:I600,2,0),\"\")","v":""}]
[null,null,null,{"$f":"IFERROR(VLOOKUP(C608,Nota_Fiscal!E600:I601,2,0),\"\")","v":""}]
[null,null,null,{"$f":"IFERROR(VLOOKUP(C609,Nota_Fiscal!E601:I602,2,0),\"\")","v":""}]
[null,null,null,{"$f":"IFERROR(VLOOKUP(C610,Nota_Fiscal!E602:I603,2,0),\"\")","v":""}]
[null,null,null,{"$f":"IFERROR(VLOOKUP(C611,Nota_Fiscal!E603:I604,2,0),\"\")","v":""}]
[null,null,null,{"$f":"IFERROR(VLOOKUP(C612,Nota_Fiscal!E604:I605,2,0),\"\")","v":""}]
[null,null,null,{"$f":"IFERROR(VLOOKUP(C613,Nota_Fiscal!E605:I606,2,0),\"\")","v":""}]
[null,null,null,{"$f":"IFERROR(VLOOKUP(C614,Nota_Fiscal!E606:I607,2,0),\"\")","v":""}]
[null,null,null,{"$f":"IFERROR(VLOOKUP(C615,Nota_Fiscal!E607:I608,2,0),\"\")","v":""}]
[null,null,null,{"$f":"IFERROR(VLOOKUP(C616,Nota_Fiscal!E608:I609,2,0),\"\")","v":""}]
[null,null,null,{"$f":"IFERROR(VLOOKUP(C617,Nota_Fiscal!E609:I610,2,0),\"\")","v":""}]
[null,null,null,{"$f":"IFERROR(VLOOKUP(C618,Nota_Fiscal!E610:I611,2,0),\"\")","v":""}]
[null,null,null,{"$f":"IFERROR(VLOOKUP(C619,Nota_Fiscal!E611:I612,2,0),\"\")","v":""}]
[null,null,null,{"$f":"IFERROR(VLOOKUP(C620,Nota_Fiscal!E612:I613,2,0),\"\")","v":""}]
[null,null,null,{"$f":"IFERROR(VLOOKUP(C621,Nota_Fiscal!E613:I614,2,0),\"\")","v":""}]
[null,null,null,{"$f":"IFERROR(VLOOKUP(C622,Nota_Fiscal!E614:I615,2,0),\"\")","v":""}]
[null,null,null,{"$f":"IFERROR(VLOOKUP(C623,Nota_Fiscal!E615:I616,2,0),\"\")","v":""}]
[null,null,null,{"$f":"IFERROR(VLOOKUP(C624,Nota_Fiscal!E616:I617,2,0),\"\")","v":""}]
[null,null,null,{"$f":"IFERROR(VLOOKUP(C625,Nota_Fiscal!E617:I618,2,0),\"\")","v":""}]
[null,null,null,{"$f":"IFERROR(VLOOKUP(C626,Nota_Fiscal!E618:I619,2,0),\"\")","v":""}]
[null,null,null,{"$f":"IFERROR(VLOOKUP(C627,Nota_Fiscal!E619:I620,2,0),\"\")","v":""}]
[null,null,null,{"$f":"IFERROR(VLOOKUP(C628,Nota_Fiscal!E620:I621,2,0),\"\")","v":""}]
[null,null,null,{"$f":"IFERROR(VLOOKUP(C629,Nota_Fiscal!E621:I622,2,0),\"\")","v":""}]
[null,null,null,{"$f":"IFERROR(VLOOKUP(C630,Nota_Fiscal!E622:I623,2,0),\"\")","v":""}]
[null,null,null,{"$f":"IFERROR(VLOOKUP(C631,Nota_Fiscal!E623:I624,2,0),\"\")","v":""}]
[null,null,null,{"$f":"IFERROR(VLOOKUP(C632,Nota_Fiscal!E624:I625,2,0),\"\")","v":""}]
[null,null,null,{"$f":"IFERROR(VLOOKUP(C633,Nota_Fiscal!E625:I626,2,0),\"\")","v":""}]
[null,null,null,{"$f":"IFERROR(VLOOKUP(C634,Nota_Fiscal!E626:I627,2,0),\"\")","v":""}]
[null,null,null,{"$f":"IFERROR(VLOOKUP(C635,Nota_Fiscal!E627:I628,2,0),\"\")","v":""}]
[null,null,null,{"$f":"IFERROR(VLOOKUP(C636,Nota_Fiscal!E628:I629,2,0),\"\")","v":""}]
[null,null,null,{"$f":"IFERROR(VLOOKUP(C637,Nota_Fiscal!E629:I630,2,0),\"\")","v":""}]
[null,null,null,{"$f":"IFERROR(VLOOKUP(C638,Nota_Fiscal!E630:I631,2,0),\"\")","v":""}]
[null,null,null,{"$f":"IFERROR(VLOOKUP(C639,Nota_Fiscal!E631:I632,2,0),\"\")","v":""}]
[null,null,null,{"$f":"IFERROR(VLOOKUP(C640,Nota_Fiscal!E632:I633,2,0),\"\")","v":""}]
[null,null,null,{"$f":"IFERROR(VLOOKUP(C641,Nota_Fiscal!E633:I634,2,0),\"\")","v":""}]
[null,null,null,{"$f":"IFERROR(VLOOKUP(C642,Nota_Fiscal!E634:I635,2,0),\"\")","v":""}]
[null,null,null,{"$f":"IFERROR(VLOOKUP(C643,Nota_Fiscal!E635:I636,2,0),\"\")","v":""}]
[null,null,null,{"$f":"IFERROR(VLOOKUP(C644,Nota_Fiscal!E636:I637,2,0),\"\")","v":""}]
[null,null,null,{"$f":"IFERROR(VLOOKUP(C645,Nota_Fiscal!E637:I638,2,0),\"\")","v":""}]
[null,null,null,{"$f":"IFERROR(VLOOKUP(C646,Nota_Fiscal!E638:I639,2,0),\"\")","v":""}]
[null,null,null,{"$f":"IFERROR(VLOOKUP(C647,Nota_Fiscal!E639:I640,2,0),\"\")","v":""}]
[null,null,null,{"$f":"IFERROR(VLOOKUP(C648,Nota_Fiscal!E640:I641,2,0),\"\")","v":""}]
[null,null,null,{"$f":"IFERROR(VLOOKUP(C649,Nota_Fiscal!E641:I642,2,0),\"\")","v":""}]
[null,null,null,{"$f":"IFERROR(VLOOKUP(C650,Nota_Fiscal!E642:I643,2,0),\"\")","v":""}]
[null,null,null,{"$f":"IFERROR(VLOOKUP(C651,Nota_Fiscal!E643:I644,2,0),\"\")","v":""}]
[null,null,null,{"$f":"IFERROR(VLOOKUP(C652,Nota_Fiscal!E644:I645,2,0),\"\")","v":""}]
[null,null,null,{"$f":"IFERROR(VLOOKUP(C653,Nota_Fiscal!E645:I646,2,0),\"\")","v":""}]
[null,null,null,{"$f":"IFERROR(VLOOKUP(C654,Nota_Fiscal!E646:I647,2,0),\"\")","v":""}]
[null,null,null,{"$f":"IFERROR(VLOOKUP(C655,Nota_Fiscal!E647:I648,2,0),\"\")","v":""}]
[null,null,null,{"$f":"IFERROR(VLOOKUP(C656,Nota_Fiscal!E648:I649,2,0),\"\")","v":""}]
[null,null,null,{"$f":"IFERROR(VLOOKUP(C657,Nota_Fiscal!E649:I650,2,0),\"\")","v":""}]
[null,null,null,{"$f":"IFERROR(VLOOKUP(C658,Nota_Fiscal!E650:I651,2,0),\"\")","v":""}]
[null,null,null,{"$f":"IFERROR(VLOOKUP(C659,Nota_Fiscal!E651:I652,2,0),\"\")","v":""}]
[null,null,null,{"$f":"IFERROR(VLOOKUP(C660,Nota_Fiscal!E652:I653,2,0),\"\")","v":""}]
[null,null,null,{"$f":"IFERROR(VLOOKUP(C661,Nota_Fiscal!E653:I654,2,0),\"\")","v":""}]
[null,null,null,{"$f":"IFERROR(VLOOKUP(C662,Nota_Fiscal!E654:I655,2,0),\"\")","v":""}]
[null,null,null,{"$f":"IFERROR(VLOOKUP(C663,Nota_Fiscal!E655:I656,2,0),\"\")","v":""}]
[null,null,null,{"$f":"IFERROR(VLOOKUP(C664,Nota_Fiscal!E656:I657,2,0),\"\")","v":""}]
[null,null,null,{"$f":"IFERROR(VLOOKUP(C665,Nota_Fiscal!E657:I658,2,0),\"\")","v":""}]
[null,null,null,{"$f":"IFERROR(VLOOKUP(C666,Nota_Fiscal!E658:I659,2,0),\"\")","v":""}]
[null,null,null,{"$f":"IFERROR(VLOOKUP(C667,Nota_Fiscal!E659:I660,2,0),\"\")","v":""}]
[null,null,null,{"$f":"IFERROR(VLOOKUP(C668,Nota_Fiscal!E660:I661,2,0),\"\")","v":""}]
[null,null,null,{"$f":"IFERROR(VLOOKUP(C669,Nota_Fiscal!E661:I662,2,0),\"\")","v":""}]
[null,null,null,{"$f":"IFERROR(VLOOKUP(C670,Nota_Fiscal!E662:I663,2,0),\"\")","v":""}]
[null,null,null,{"$f":"IFERROR(VLOOKUP(C671,Nota_Fiscal!E663:I664,2,0),\"\")","v":""}]
[null,null,null,{"$f":"IFERROR(VLOOKUP(C672,Nota_Fiscal!E664:I665,2,0),\"\")","v":""}]
[null,null,null,{"$f":"IFERROR(VLOOKUP(C673,Nota_Fiscal!E665:I666,2,0),\"\")","v":""}]
[null,null,null,{"$f":"IFERROR(VLOOKUP(C674,Nota_Fiscal!E666:I667,2,0),\"\")","v":""}]
[null,null,null,{"$f":"IFERROR(VLOOKUP(C675,Nota_Fiscal!E667:I668,2,0),\"\")","v":""}]
[null,null,null,{"$f":"IFERROR(VLOOKUP(C676,Nota_Fiscal!E668:I669,2,0),\"\")","v":""}]
[null,null,null,{"$f":"IFERROR(VLOOKUP(C677,Nota_Fiscal!E669:I670,2,0),\"\")","v":""}]
[null,null,null,{"$f":"IFERROR(VLOOKUP(C678,Nota_Fiscal!E670:I671,2,0),\"\")","v":""}]
[null,null,null,{"$f":"IFERROR(VLOOKUP(C679,Nota_Fiscal!E671:I672,2,0),\"\")","v":""}]
[null,null,null,{"$f":"IFERROR(VLOOKUP(C680,Nota_Fiscal!E672:I673,2,0),\"\")","v":""}]
[null,null,null,{"$f":"IFERROR(VLOOKUP(C681,Nota_Fiscal!E673:I674,2,0),\"\")","v":""}]
[null,null,null,{"$f":"IFERROR(VLOOKUP(C682,Nota_Fiscal!E674:I675,2,0),\"\")","v":""}]
[null,null,null,{"$f":"IFERROR(VLOOKUP(C683,Nota_Fiscal!E675:I676,2,0),\"\")","v":""}]
[null,null,null,{"$f":"IFERROR(VLOOKUP(C684,Nota_Fiscal!E676:I677,2,0),\"\")","v":""}]
[null,null,null,{"$f":"IFERROR(VLOOKUP(C685,Nota_Fiscal!E677:I678,2,0),\"\")","v":""}]
[null,null,null,{"$f":"IFERROR(VLOOKUP(C686,Nota_Fiscal!E678:I679,2,0),\"\")","v":""}]
[null,null,null,{"$f":"IFERROR(VLOOKUP(C687,Nota_Fiscal!E679:I680,2,0),\"\")","v":""}]
[null,null,null,{"$f":"IFERROR(VLOOKUP(C688,Nota_Fiscal!E680:I681,2,0),\"\")","v":""}]
[null,null,null,{"$f":"IFERROR(VLOOKUP(C689,Nota_Fiscal!E681:I682,2,0),\"\")","v":""}]
[null,null,null,{"$f":"IFERROR(VLOOKUP(C690,Nota_Fiscal!E682:I683,2,0),\"\")","v":""}]
[null,null,null,{"$f":"IFERROR(VLOOKUP(C691,Nota_Fiscal!E683:I684,2,0),\"\")","v":""}]
[null,null,null,{"$f":"IFERROR(VLOOKUP(C692,Nota_Fiscal!E684:I685,2,0),\"\")","v":""}]
[null,null,null,{"$f":"IFERROR(VLOOKUP(C693,Nota_Fiscal!E685:I686,2,0),\"\")","v":""}]
[null,null,null,{"$f":"IFERROR(VLOOKUP(C694,Nota_Fiscal!E686:I687,2,0),\"\")","v":""}]
[null,null,null,{"$f":"IFERROR(VLOOKUP(C695,Nota_Fiscal!E687:I688,2,0),\"\")","v":""}]
[null,null,null,{"$f":"IFERROR(VLOOKUP(C696,Nota_Fiscal!E688:I689,2,0),\"\")","v":""}]
[null,null,null,{"$f":"IFERROR(VLOOKUP(C697,Nota_Fiscal!E689:I690,2,0),\"\")","v":""}]
[null,null,null,{"$f":"IFERROR(VLOOKUP(C698,Nota_Fiscal!E690:I691,2,0),\"\")","v":""}]
[null,null,null,{"$f":"IFERROR(VLOOKUP(C699,Nota_Fiscal!E691:I692,2,0),\"\")","v":""}]
[null,null,null,{"$f":"IFERROR(VLOOKUP(C700,Nota_Fiscal!E692:I693,2,0),\"\")","v":""}]
[null,null,null,{"$f":"IFERROR(VLOOKUP(C701,Nota_Fiscal!E693:I694,2,0),\"\")","v":""}]
[null,null,null,{"$f":"IFERROR(VLOOKUP(C702,Nota_Fiscal!E694:I695,2,0),\"\")","v":""}]
[null,null,null,{"$f":"IFERROR(VLOOKUP(C703,Nota_Fiscal!E695:I696,2,0),\"\")","v":""}]
[null,null,null,{"$f":"IFERROR(VLOOKUP(C704,Nota_Fiscal!E696:I697,2,0),\"\")","v":""}]
[null,null,null,{"$f":"IFERROR(VLOOKUP(C705,Nota_Fiscal!E697:I698,2,0),\"\")","v":""}]
[null,null,null,{"$f":"IFERROR(VLOOKUP(C706,Nota_Fiscal!E698:I699,2,0),\"\")","v":""}]
[null,null,null,{"$f":"IFERROR(VLOOKUP(C707,Nota_Fiscal!E699:I700,2,0),\"\")","v":""}]
[null,null,null,{"$f":"IFERROR(VLOOKUP(C708,Nota_Fiscal!E700:I701,2,0),\"\")","v":""}]
[null,null,null,{"$f":"IFERROR(VLOOKUP(C709,Nota_Fiscal!E701:I702,2,0),\"\")","v":""}]
[null,null,null,{"$f":"IFERROR(VLOOKUP(C710,Nota_Fiscal!E702:I703,2,0),\"\")","v":""}]
[null,null,null,{"$f":"IFERROR(VLOOKUP(C711,Nota_Fiscal!E703:I704,2,0),\"\")","v":""}]
[null,null,null,{"$f":"IFERROR(VLOOKUP(C712,Nota_Fiscal!E704:I705,2,0),\"\")","v":""}]
[null,null,null,{"$f":"IFERROR(VLOOKUP(C713,Nota_Fiscal!E705:I706,2,0),\"\")","v":""}]
[null,null,null,{"$f":"IFERROR(VLOOKUP(C714,Nota_Fiscal!E706:I707,2,0),\"\")","v":""}]
[null,null,null,{"$f":"IFERROR(VLOOKUP(C715,Nota_Fiscal!E707:I708,2,0),\"\")","v":""}]
[null,null,null,{"$f":"IFERROR(VLOOKUP(C716,Nota_Fiscal!E708:I709,2,0),\"\")","v":""}]
[null,null,null,{"$f":"IFERROR(VLOOKUP(C717,Nota_Fiscal!E709:I710,2,0),\"\")","v":""}]
[null,null,null,{"$f":"IFERROR(VLOOKUP(C718,Nota_Fiscal!E710:I711,2,0),\"\")","v":""}]
[null,null,null,{"$f":"IFERROR(VLOOKUP(C719,Nota_Fiscal!E711:I712,2,0),\"\")","v":""}]
[null,null,null,{"$f":"IFERROR(VLOOKUP(C720,Nota_Fiscal!E712:I713,2,0),\"\")","v":""}]
[null,null,null,{"$f":"IFERROR(VLOOKUP(C721,Nota_Fiscal!E713:I714,2,0),\"\")","v":""}]
[null,null,null,{"$f":"IFERROR(VLOOKUP(C722,Nota_Fiscal!E714:I715,2,0),\"\")","v":""}]
[null,null,null,{"$f":"IFERROR(VLOOKUP(C723,Nota_Fiscal!E715:I716,2,0),\"\")","v":""}]
[null,null,null,{"$f":"IFERROR(VLOOKUP(C724,Nota_Fiscal!E716:I717,2,0),\"\")","v":""}]
[null,null,null,{"$f":"IFERROR(VLOOKUP(C725,Nota_Fiscal!E717:I718,2,0),\"\")","v":""}]
[null,null,null,{"$f":"IFERROR(VLOOKUP(C726,Nota_Fiscal!E718:I719,2,0),\"\")","v":""}]

{"sheet":"Relatorio_Atividades","index":9,"n_rows":1000,"n_cols":4,"rows_kept":1000,"cut":false,"hidden":false,"merged":[[1,1,1,3]]}
[]
[null,"RELATÓRIO DE ATIVIDADES E UTILIZAÇÃO DE INSUMOS"]
[]
[null,null,"Escolha a Atividade"]
[null,null,"dessecação"]
[]
[]
[null,"INSUMOS","QUANTIDADE UTILIZADAS","UNIDADE"]
[null,{"$f":"IFERROR(INDEX(Saída!$A$4:$A$38,SMALL((Saída!$G$4:$G$38=$C$5)*ROW(Saída!$G$4:$G$38),SUMPRODUCT(N(((Saída!$G$4:$G$38=$C$5)*ROW(Saída!$G$4:$G$38))=0))+ROW(Saída!$G$4:$G$38)-3)-3),\"\")","v":"Defensivo Granulado"},{"$f":"IFERROR(INDEX(Saída!$F$4:$F$38,SMALL((Saída!$G$4:$G$38=$C$5)*ROW(Saída!$G$4:$G$38),SUMPRODUCT(N(((Saída!$G$4:$G$38=$C$5)*ROW(Saída!$G$4:$G$38))=0))+ROW(Saída!$G$4:$G$38)-3)-3),\"\")","v":220},{"$f":"IFERROR(VLOOKUP(B9,Insumos!$A$4:$B$8,2,FALSE),\"\")","v":"Kg"}]
[null,"Defensivo Galão",165,{"$f":"IFERROR(VLOOKUP(B10,Insumos!$A$4:$B$8,2,FALSE),\"\")","v":"Lt"}]
[null,"Defensivo Galão",30,{"$f":"IFERROR(VLOOKUP(B11,Insumos!$A$4:$B$8,2,FALSE),\"\")","v":"Lt"}]
[null,"Defensivo Galão",8,{"$f":"IFERROR(VLOOKUP(B12,Insumos!$A$4:$B$8,2,FALSE),\"\")","v":"Lt"}]
[null,"Defensivo Granulado",120,{"$f":"IFERROR(VLOOKUP(B13,Insumos!$A$4:$B$8,2,FALSE),\"\")","v":"Kg"}]
[null,"Defensivo Galão",90,{"$f":"IFERROR(VLOOKUP(B14,Insumos!$A$4:$B$8,2,FALSE),\"\")","v":"Lt"}]
[null,"Defensivo Galão",4,{"$f":"IFERROR(VLOOKUP(B15,Insumos!$A$4:$B$8,2,FALSE),\"\")","v":"Lt"}]
[null,"Defensivo Galão",20,{"$f":"IFERROR(VLOOKUP(B16,Insumos!$A$4:$B$8,2,FALSE),\"\")","v":"Lt"}]
[null,"Defensivo Granulado",155,{"$f":"IFERROR(VLOOKUP(B17,Insumos!$A$4:$B$8,2,FALSE),\"\")","v":"Kg"}]
[null,"Defensivo Granulado",40,{"$f":"IFERROR(VLOOKUP(B18,Insumos!$A$4:$B$8,2,FALSE),\"\")","v":"Kg"}]
[null,"Defensivo Galão",15,{"$f":"IFERROR(VLOOKUP(B19,Insumos!$A$4:$B$8,2,FALSE),\"\")","v":"Lt"}]
[null,"Defensivo Galão",7.5,{"$f":"IFERROR(VLOOKUP(B20,Insumos!$A$4:$B$8,2,FALSE),\"\")","v":"Lt"}]
[null,"Defensivo Galão",1,{"$f":"IFERROR(VLOOKUP(B21,Insumos!$A$4:$B$8,2,FALSE),\"\")","v":"Lt"}]
[null,"Defensivo Granulado",40,{"$f":"IFERROR(VLOOKUP(B22,Insumos!$A$4:$B$8,2,FALSE),\"\")","v":"Kg"}]
[null,"Defensivo Galão",15,{"$f":"IFERROR(VLOOKUP(B23,Insumos!$A$4:$B$8,2,FALSE),\"\")","v":"Lt"}]
[null,"Defensivo Galão",7.5,{"$f":"IFERROR(VLOOKUP(B24,Insumos!$A$4:$B$8,2,FALSE),\"\")","v":"Lt"}]
[null,"Defensivo Galão",1,{"$f":"IFERROR(VLOOKUP(B25,Insumos!$A$4:$B$8,2,FALSE),\"\")","v":"Lt"}]
[null,"Defensivo Galão",45,{"$f":"IFERROR(VLOOKUP(B26,Insumos!$A$4:$B$8,2,FALSE),\"\")","v":"Lt"}]
[null,"Defensivo Galão",18,{"$f":"IFERROR(VLOOKUP(B27,Insumos!$A$4:$B$8,2,FALSE),\"\")","v":"Lt"}]
[null,"Defensivo Galão",9,{"$f":"IFERROR(VLOOKUP(B28,Insumos!$A$4:$B$8,2,FALSE),\"\")","v":"Lt"}]
[null,"Defensivo Galão",1,{"$f":"IFERROR(VLOOKUP(B29,Insumos!$A$4:$B$8,2,FALSE),\"\")","v":"Lt"}]
[null,"Defensivo Galão",2,{"$f":"IFERROR(VLOOKUP(B30,Insumos!$A$4:$B$8,2,FALSE),\"\")","v":"Lt"}]
[null,"Defensivo Galão",90,{"$f":"IFERROR(VLOOKUP(B31,Insumos!$A$4:$B$8,2,FALSE),\"\")","v":"Lt"}]
[null,"Defensivo Galão",36,{"$f":"IFERROR(VLOOKUP(B32,Insumos!$A$4:$B$8,2,FALSE),\"\")","v":"Lt"}]
[null,"Defensivo Galão",18,{"$f":"IFERROR(VLOOKUP(B33,Insumos!$A$4:$B$8,2,FALSE),\"\")","v":"Lt"}]
[null,"Defensivo Galão",2,{"$f":"IFERROR(VLOOKUP(B34,Insumos!$A$4:$B$8,2,FALSE),\"\")","v":"Lt"}]
[null,"Defensivo Galão",2,{"$f":"IFERROR(VLOOKUP(B35,Insumos!$A$4:$B$8,2,FALSE),\"\")","v":"Lt"}]
[null,"Defensivo Galão",65,{"$f":"IFERROR(VLOOKUP(B36,Insumos!$A$4:$B$8,2,FALSE),\"\")","v":"Lt"}]
[null,"Defensivo Galão",27,{"$f":"IFERROR(VLOOKUP(B37,Insumos!$A$4:$B$8,2,FALSE),\"\")","v":"Lt"}]
[null,"Defensivo Galão",13.5,{"$f":"IFERROR(VLOOKUP(B38,Insumos!$A$4:$B$8,2,FALSE),\"\")","v":"Lt"}]
[null,"Defensivo Galão",1.5,{"$f":"IFERROR(VLOOKUP(B39,Insumos!$A$4:$B$8,2,FALSE),\"\")","v":"Lt"}]
[null,"","",{"$f":"IFERROR(VLOOKUP(B40,Insumos!$A$4:$B$8,2,FALSE),\"\")","v":""}]
[null,"","",{"$f":"IFERROR(VLOOKUP(B41,Insumos!$A$4:$B$8,2,FALSE),\"\")","v":""}]
[null,"","",{"$f":"IFERROR(VLOOKUP(B42,Insumos!$A$4:$B$8,2,FALSE),\"\")","v":""}]
[null,"","",{"$f":"IFERROR(VLOOKUP(B43,Insumos!$A$4:$B$8,2,FALSE),\"\")","v":""}]
[null,{"$error":"#N/A"},{"$error":"#N/A"},{"$f":"IFERROR(VLOOKUP(B44,Insumos!$A$4:$B$8,2,FALSE),\"\")","v":""}]
[null,{"$error":"#N/A"},{"$error":"#N/A"},{"$f":"IFERROR(VLOOKUP(B45,Insumos!$A$4:$B$8,2,FALSE),\"\")","v":""}]
[null,{"$error":"#N/A"},{"$error":"#N/A"},{"$f":"IFERROR(VLOOKUP(B46,Insumos!$A$4:$B$8,2,FALSE),\"\")","v":""}]
[null,{"$error":"#N/A"},{"$error":"#N/A"},{"$f":"IFERROR(VLOOKUP(B47,Insumos!$A$4:$B$8,2,FALSE),\"\")","v":""}]
[null,{"$error":"#N/A"},{"$error":"#N/A"},{"$f":"IFERROR(VLOOKUP(B48,Insumos!$A$4:$B$8,2,FALSE),\"\")","v":""}]
[null,{"$error":"#N/A"},{"$error":"#N/A"},{"$f":"IFERROR(VLOOKUP(B49,Insumos!$A$4:$B$8,2,FALSE),\"\")","v":""}]
[null,{"$error":"#N/A"},{"$error":"#N/A"},{"$f":"IFERROR(VLOOKUP(B50,Insumos!$A$4:$B$8,2,FALSE),\"\")","v":""}]
[null,{"$error":"#N/A"},{"$error":"#N/A"},{"$f":"IFERROR(VLOOKUP(B51,Insumos!$A$4:$B$8,2,FALSE),\"\")","v":""}]
[null,{"$error":"#N/A"},{"$error":"#N/A"},{"$f":"IFERROR(VLOOKUP(B52,Insumos!$A$4:$B$8,2,FALSE),\"\")","v":""}]
[null,{"$error":"#N/A"},{"$error":"#N/A"},{"$f":"IFERROR(VLOOKUP(B53,Insumos!$A$4:$B$8,2,FALSE),\"\")","v":""}]
[null,{"$error":"#N/A"},{"$error":"#N/A"},{"$f":"IFERROR(VLOOKUP(B54,Insumos!$A$4:$B$8,2,FALSE),\"\")","v":""}]
[null,{"$error":"#N/A"},{"$error":"#N/A"},{"$f":"IFERROR(VLOOKUP(B55,Insumos!$A$4:$B$8,2,FALSE),\"\")","v":""}]
[null,{"$error":"#N/A"},{"$error":"#N/A"},{"$f":"IFERROR(VLOOKUP(B56,Insumos!$A$4:$B$8,2,FALSE),\"\")","v":""}]
[null,{"$error":"#N/A"},{"$error":"#N/A"},{"$f":"IFERROR(VLOOKUP(B57,Insumos!$A$4:$B$8,2,FALSE),\"\")","v":""}]
[null,{"$error":"#N/A"},{"$error":"#N/A"},{"$f":"IFERROR(VLOOKUP(B58,Insumos!$A$4:$B$8,2,FALSE),\"\")","v":""}]
[null,{"$error":"#N/A"},{"$error":"#N/A"},{"$f":"IFERROR(VLOOKUP(B59,Insumos!$A$4:$B$8,2,FALSE),\"\")","v":""}]
[null,{"$error":"#N/A"},{"$error":"#N/A"},{"$f":"IFERROR(VLOOKUP(B60,Insumos!$A$4:$B$8,2,FALSE),\"\")","v":""}]
[null,{"$error":"#N/A"},{"$error":"#N/A"},{"$f":"IFERROR(VLOOKUP(B61,Insumos!$A$4:$B$8,2,FALSE),\"\")","v":""}]
[null,{"$error":"#N/A"},{"$error":"#N/A"},{"$f":"IFERROR(VLOOKUP(B62,Insumos!$A$4:$B$8,2,FALSE),\"\")","v":""}]
[null,{"$error":"#N/A"},{"$error":"#N/A"},{"$f":"IFERROR(VLOOKUP(B63,Insumos!$A$4:$B$8,2,FALSE),\"\")","v":""}]
[null,{"$error":"#N/A"},{"$error":"#N/A"},{"$f":"IFERROR(VLOOKUP(B64,Insumos!$A$4:$B$8,2,FALSE),\"\")","v":""}]
[null,{"$error":"#N/A"},{"$error":"#N/A"},{"$f":"IFERROR(VLOOKUP(B65,Insumos!$A$4:$B$8,2,FALSE),\"\")","v":""}]
[null,{"$error":"#N/A"},{"$error":"#N/A"},{"$f":"IFERROR(VLOOKUP(B66,Insumos!$A$4:$B$8,2,FALSE),\"\")","v":""}]
[null,{"$error":"#N/A"},{"$error":"#N/A"},{"$f":"IFERROR(VLOOKUP(B67,Insumos!$A$4:$B$8,2,FALSE),\"\")","v":""}]
[null,{"$error":"#N/A"},{"$error":"#N/A"},{"$f":"IFERROR(VLOOKUP(B68,Insumos!$A$4:$B$8,2,FALSE),\"\")","v":""}]
[null,{"$error":"#N/A"},{"$error":"#N/A"},{"$f":"IFERROR(VLOOKUP(B69,Insumos!$A$4:$B$8,2,FALSE),\"\")","v":""}]
[null,{"$error":"#N/A"},{"$error":"#N/A"},{"$f":"IFERROR(VLOOKUP(B70,Insumos!$A$4:$B$8,2,FALSE),\"\")","v":""}]
[null,{"$error":"#N/A"},{"$error":"#N/A"},{"$f":"IFERROR(VLOOKUP(B71,Insumos!$A$4:$B$8,2,FALSE),\"\")","v":""}]
[null,{"$error":"#N/A"},{"$error":"#N/A"},{"$f":"IFERROR(VLOOKUP(B72,Insumos!$A$4:$B$8,2,FALSE),\"\")","v":""}]
[null,{"$error":"#N/A"},{"$error":"#N/A"},{"$f":"IFERROR(VLOOKUP(B73,Insumos!$A$4:$B$8,2,FALSE),\"\")","v":""}]
[null,{"$error":"#N/A"},{"$error":"#N/A"},{"$f":"IFERROR(VLOOKUP(B74,Insumos!$A$4:$B$8,2,FALSE),\"\")","v":""}]
[null,{"$error":"#N/A"},{"$error":"#N/A"},{"$f":"IFERROR(VLOOKUP(B75,Insumos!$A$4:$B$8,2,FALSE),\"\")","v":""}]
[null,{"$error":"#N/A"},{"$error":"#N/A"},{"$f":"IFERROR(VLOOKUP(B76,Insumos!$A$4:$B$8,2,FALSE),\"\")","v":""}]
[null,{"$error":"#N/A"},{"$error":"#N/A"},{"$f":"IFERROR(VLOOKUP(B77,Insumos!$A$4:$B$8,2,FALSE),\"\")","v":""}]
[null,{"$error":"#N/A"},{"$error":"#N/A"},{"$f":"IFERROR(VLOOKUP(B78,Insumos!$A$4:$B$8,2,FALSE),\"\")","v":""}]
[null,{"$error":"#N/A"},{"$error":"#N/A"},{"$f":"IFERROR(VLOOKUP(B79,Insumos!$A$4:$B$8,2,FALSE),\"\")","v":""}]
[null,{"$error":"#N/A"},{"$error":"#N/A"},{"$f":"IFERROR(VLOOKUP(B80,Insumos!$A$4:$B$8,2,FALSE),\"\")","v":""}]
[null,{"$error":"#N/A"},{"$error":"#N/A"},{"$f":"IFERROR(VLOOKUP(B81,Insumos!$A$4:$B$8,2,FALSE),\"\")","v":""}]
[null,{"$error":"#N/A"},{"$error":"#N/A"},{"$f":"IFERROR(VLOOKUP(B82,Insumos!$A$4:$B$8,2,FALSE),\"\")","v":""}]
[null,{"$error":"#N/A"},{"$error":"#N/A"},{"$f":"IFERROR(VLOOKUP(B83,Insumos!$A$4:$B$8,2,FALSE),\"\")","v":""}]
[null,{"$error":"#N/A"},{"$error":"#N/A"},{"$f":"IFERROR(VLOOKUP(B84,Insumos!$A$4:$B$8,2,FALSE),\"\")","v":""}]
[null,{"$error":"#N/A"},{"$error":"#N/A"},{"$f":"IFERROR(VLOOKUP(B85,Insumos!$A$4:$B$8,2,FALSE),\"\")","v":""}]
[null,{"$error":"#N/A"},{"$error":"#N/A"},{"$f":"IFERROR(VLOOKUP(B86,Insumos!$A$4:$B$8,2,FALSE),\"\")","v":""}]
[null,{"$error":"#N/A"},{"$error":"#N/A"},{"$f":"IFERROR(VLOOKUP(B87,Insumos!$A$4:$B$8,2,FALSE),\"\")","v":""}]
[null,{"$error":"#N/A"},{"$error":"#N/A"},{"$f":"IFERROR(VLOOKUP(B88,Insumos!$A$4:$B$8,2,FALSE),\"\")","v":""}]
[null,{"$error":"#N/A"},{"$error":"#N/A"},{"$f":"IFERROR(VLOOKUP(B89,Insumos!$A$4:$B$8,2,FALSE),\"\")","v":""}]
[null,{"$error":"#N/A"},{"$error":"#N/A"},{"$f":"IFERROR(VLOOKUP(B90,Insumos!$A$4:$B$8,2,FALSE),\"\")","v":""}]
[null,{"$error":"#N/A"},{"$error":"#N/A"},{"$f":"IFERROR(VLOOKUP(B91,Insumos!$A$4:$B$8,2,FALSE),\"\")","v":""}]
[null,{"$error":"#N/A"},{"$error":"#N/A"},{"$f":"IFERROR(VLOOKUP(B92,Insumos!$A$4:$B$8,2,FALSE),\"\")","v":""}]
[null,{"$error":"#N/A"},{"$error":"#N/A"},{"$f":"IFERROR(VLOOKUP(B93,Insumos!$A$4:$B$8,2,FALSE),\"\")","v":""}]
[null,{"$error":"#N/A"},{"$error":"#N/A"},{"$f":"IFERROR(VLOOKUP(B94,Insumos!$A$4:$B$8,2,FALSE),\"\")","v":""}]
[null,{"$error":"#N/A"},{"$error":"#N/A"},{"$f":"IFERROR(VLOOKUP(B95,Insumos!$A$4:$B$8,2,FALSE),\"\")","v":""}]
[null,{"$error":"#N/A"},{"$error":"#N/A"},{"$f":"IFERROR(VLOOKUP(B96,Insumos!$A$4:$B$8,2,FALSE),\"\")","v":""}]
[null,{"$error":"#N/A"},{"$error":"#N/A"},{"$f":"IFERROR(VLOOKUP(B97,Insumos!$A$4:$B$8,2,FALSE),\"\")","v":""}]
[null,{"$error":"#N/A"},{"$error":"#N/A"},{"$f":"IFERROR(VLOOKUP(B98,Insumos!$A$4:$B$8,2,FALSE),\"\")","v":""}]
[null,{"$error":"#N/A"},{"$error":"#N/A"},{"$f":"IFERROR(VLOOKUP(B99,Insumos!$A$4:$B$8,2,FALSE),\"\")","v":""}]
[null,{"$error":"#N/A"},{"$error":"#N/A"},{"$f":"IFERROR(VLOOKUP(B100,Insumos!$A$4:$B$8,2,FALSE),\"\")","v":""}]
[null,{"$error":"#N/A"},{"$error":"#N/A"},{"$f":"IFERROR(VLOOKUP(B101,Insumos!$A$4:$B$8,2,FALSE),\"\")","v":""}]
[null,{"$error":"#N/A"},{"$error":"#N/A"},{"$f":"IFERROR(VLOOKUP(B102,Insumos!$A$4:$B$8,2,FALSE),\"\")","v":""}]
[null,{"$error":"#N/A"},{"$error":"#N/A"},{"$f":"IFERROR(VLOOKUP(B103,Insumos!$A$4:$B$8,2,FALSE),\"\")","v":""}]
[null,{"$error":"#N/A"},{"$error":"#N/A"},{"$f":"IFERROR(VLOOKUP(B104,Insumos!$A$4:$B$8,2,FALSE),\"\")","v":""}]
[null,{"$error":"#N/A"},{"$error":"#N/A"},{"$f":"IFERROR(VLOOKUP(B105,Insumos!$A$4:$B$8,2,FALSE),\"\")","v":""}]
[null,{"$error":"#N/A"},{"$error":"#N/A"},{"$f":"IFERROR(VLOOKUP(B106,Insumos!$A$4:$B$8,2,FALSE),\"\")","v":""}]
[null,{"$error":"#N/A"},{"$error":"#N/A"},{"$f":"IFERROR(VLOOKUP(B107,Insumos!$A$4:$B$8,2,FALSE),\"\")","v":""}]
[null,{"$error":"#N/A"},{"$error":"#N/A"},{"$f":"IFERROR(VLOOKUP(B108,Insumos!$A$4:$B$8,2,FALSE),\"\")","v":""}]
[null,{"$error":"#N/A"},{"$error":"#N/A"},{"$f":"IFERROR(VLOOKUP(B109,Insumos!$A$4:$B$8,2,FALSE),\"\")","v":""}]
[null,{"$error":"#N/A"},{"$error":"#N/A"},{"$f":"IFERROR(VLOOKUP(B110,Insumos!$A$4:$B$8,2,FALSE),\"\")","v":""}]
[null,{"$error":"#N/A"},{"$error":"#N/A"},{"$f":"IFERROR(VLOOKUP(B111,Insumos!$A$4:$B$8,2,FALSE),\"\")","v":""}]
[null,{"$error":"#N/A"},{"$error":"#N/A"},{"$f":"IFERROR(VLOOKUP(B112,Insumos!$A$4:$B$8,2,FALSE),\"\")","v":""}]
[null,{"$error":"#N/A"},{"$error":"#N/A"},{"$f":"IFERROR(VLOOKUP(B113,Insumos!$A$4:$B$8,2,FALSE),\"\")","v":""}]
[null,{"$error":"#N/A"},{"$error":"#N/A"},{"$f":"IFERROR(VLOOKUP(B114,Insumos!$A$4:$B$8,2,FALSE),\"\")","v":""}]
[null,{"$error":"#N/A"},{"$error":"#N/A"},{"$f":"IFERROR(VLOOKUP(B115,Insumos!$A$4:$B$8,2,FALSE),\"\")","v":""}]
[null,{"$error":"#N/A"},{"$error":"#N/A"},{"$f":"IFERROR(VLOOKUP(B116,Insumos!$A$4:$B$8,2,FALSE),\"\")","v":""}]
[null,{"$error":"#N/A"},{"$error":"#N/A"},{"$f":"IFERROR(VLOOKUP(B117,Insumos!$A$4:$B$8,2,FALSE),\"\")","v":""}]
[null,{"$error":"#N/A"},{"$error":"#N/A"},{"$f":"IFERROR(VLOOKUP(B118,Insumos!$A$4:$B$8,2,FALSE),\"\")","v":""}]
[null,{"$error":"#N/A"},{"$error":"#N/A"},{"$f":"IFERROR(VLOOKUP(B119,Insumos!$A$4:$B$8,2,FALSE),\"\")","v":""}]
[null,{"$error":"#N/A"},{"$error":"#N/A"},{"$f":"IFERROR(VLOOKUP(B120,Insumos!$A$4:$B$8,2,FALSE),\"\")","v":""}]
[null,{"$error":"#N/A"},{"$error":"#N/A"},{"$f":"IFERROR(VLOOKUP(B121,Insumos!$A$4:$B$8,2,FALSE),\"\")","v":""}]
[null,{"$error":"#N/A"},{"$error":"#N/A"},{"$f":"IFERROR(VLOOKUP(B122,Insumos!$A$4:$B$8,2,FALSE),\"\")","v":""}]
[null,{"$error":"#N/A"},{"$error":"#N/A"},{"$f":"IFERROR(VLOOKUP(B123,Insumos!$A$4:$B$8,2,FALSE),\"\")","v":""}]
[null,{"$error":"#N/A"},{"$error":"#N/A"},{"$f":"IFERROR(VLOOKUP(B124,Insumos!$A$4:$B$8,2,FALSE),\"\")","v":""}]
[null,{"$error":"#N/A"},{"$error":"#N/A"},{"$f":"IFERROR(VLOOKUP(B125,Insumos!$A$4:$B$8,2,FALSE),\"\")","v":""}]
[null,{"$error":"#N/A"},{"$error":"#N/A"},{"$f":"IFERROR(VLOOKUP(B126,Insumos!$A$4:$B$8,2,FALSE),\"\")","v":""}]
[null,{"$error":"#N/A"},{"$error":"#N/A"},{"$f":"IFERROR(VLOOKUP(B127,Insumos!$A$4:$B$8,2,FALSE),\"\")","v":""}]
[null,{"$error":"#N/A"},{"$error":"#N/A"},{"$f":"IFERROR(VLOOKUP(B128,Insumos!$A$4:$B$8,2,FALSE),\"\")","v":""}]
[null,{"$error":"#N/A"},{"$error":"#N/A"},{"$f":"IFERROR(VLOOKUP(B129,Insumos!$A$4:$B$8,2,FALSE),\"\")","v":""}]
[null,{"$error":"#N/A"},{"$error":"#N/A"},{"$f":"IFERROR(VLOOKUP(B130,Insumos!$A$4:$B$8,2,FALSE),\"\")","v":""}]
[null,{"$error":"#N/A"},{"$error":"#N/A"},{"$f":"IFERROR(VLOOKUP(B131,Insumos!$A$4:$B$8,2,FALSE),\"\")","v":""}]
[null,{"$error":"#N/A"},{"$error":"#N/A"},{"$f":"IFERROR(VLOOKUP(B132,Insumos!$A$4:$B$8,2,FALSE),\"\")","v":""}]
[null,{"$error":"#N/A"},{"$error":"#N/A"},{"$f":"IFERROR(VLOOKUP(B133,Insumos!$A$4:$B$8,2,FALSE),\"\")","v":""}]
[null,{"$error":"#N/A"},{"$error":"#N/A"},{"$f":"IFERROR(VLOOKUP(B134,Insumos!$A$4:$B$8,2,FALSE),\"\")","v":""}]
[null,{"$error":"#N/A"},{"$error":"#N/A"},{"$f":"IFERROR(VLOOKUP(B135,Insumos!$A$4:$B$8,2,FALSE),\"\")","v":""}]
[null,{"$error":"#N/A"},{"$error":"#N/A"},{"$f":"IFERROR(VLOOKUP(B136,Insumos!$A$4:$B$8,2,FALSE),\"\")","v":""}]
[null,{"$error":"#N/A"},{"$error":"#N/A"},{"$f":"IFERROR(VLOOKUP(B137,Insumos!$A$4:$B$8,2,FALSE),\"\")","v":""}]
[null,{"$error":"#N/A"},{"$error":"#N/A"},{"$f":"IFERROR(VLOOKUP(B138,Insumos!$A$4:$B$8,2,FALSE),\"\")","v":""}]
[null,{"$error":"#N/A"},{"$error":"#N/A"},{"$f":"IFERROR(VLOOKUP(B139,Insumos!$A$4:$B$8,2,FALSE),\"\")","v":""}]
[null,{"$error":"#N/A"},{"$error":"#N/A"},{"$f":"IFERROR(VLOOKUP(B140,Insumos!$A$4:$B$8,2,FALSE),\"\")","v":""}]
[null,{"$error":"#N/A"},{"$error":"#N/A"},{"$f":"IFERROR(VLOOKUP(B141,Insumos!$A$4:$B$8,2,FALSE),\"\")","v":""}]
[null,{"$error":"#N/A"},{"$error":"#N/A"},{"$f":"IFERROR(VLOOKUP(B142,Insumos!$A$4:$B$8,2,FALSE),\"\")","v":""}]
[null,{"$error":"#N/A"},{"$error":"#N/A"},{"$f":"IFERROR(VLOOKUP(B143,Insumos!$A$4:$B$8,2,FALSE),\"\")","v":""}]
[null,{"$error":"#N/A"},{"$error":"#N/A"},{"$f":"IFERROR(VLOOKUP(B144,Insumos!$A$4:$B$8,2,FALSE),\"\")","v":""}]
[null,{"$error":"#N/A"},{"$error":"#N/A"},{"$f":"IFERROR(VLOOKUP(B145,Insumos!$A$4:$B$8,2,FALSE),\"\")","v":""}]
[null,{"$error":"#N/A"},{"$error":"#N/A"},{"$f":"IFERROR(VLOOKUP(B146,Insumos!$A$4:$B$8,2,FALSE),\"\")","v":""}]
[null,{"$error":"#N/A"},{"$error":"#N/A"},{"$f":"IFERROR(VLOOKUP(B147,Insumos!$A$4:$B$8,2,FALSE),\"\")","v":""}]
[null,{"$error":"#N/A"},{"$error":"#N/A"},{"$f":"IFERROR(VLOOKUP(B148,Insumos!$A$4:$B$8,2,FALSE),\"\")","v":""}]
[null,{"$error":"#N/A"},{"$error":"#N/A"},{"$f":"IFERROR(VLOOKUP(B149,Insumos!$A$4:$B$8,2,FALSE),\"\")","v":""}]
[null,{"$error":"#N/A"},{"$error":"#N/A"},{"$f":"IFERROR(VLOOKUP(B150,Insumos!$A$4:$B$8,2,FALSE),\"\")","v":""}]
[null,{"$error":"#N/A"},{"$error":"#N/A"},{"$f":"IFERROR(VLOOKUP(B151,Insumos!$A$4:$B$8,2,FALSE),\"\")","v":""}]
[null,{"$error":"#N/A"},{"$error":"#N/A"},{"$f":"IFERROR(VLOOKUP(B152,Insumos!$A$4:$B$8,2,FALSE),\"\")","v":""}]
[null,{"$error":"#N/A"},{"$error":"#N/A"},{"$f":"IFERROR(VLOOKUP(B153,Insumos!$A$4:$B$8,2,FALSE),\"\")","v":""}]
[null,{"$error":"#N/A"},{"$error":"#N/A"},{"$f":"IFERROR(VLOOKUP(B154,Insumos!$A$4:$B$8,2,FALSE),\"\")","v":""}]
[null,{"$error":"#N/A"},{"$error":"#N/A"},{"$f":"IFERROR(VLOOKUP(B155,Insumos!$A$4:$B$8,2,FALSE),\"\")","v":""}]
[null,{"$error":"#N/A"},{"$error":"#N/A"},{"$f":"IFERROR(VLOOKUP(B156,Insumos!$A$4:$B$8,2,FALSE),\"\")","v":""}]
[null,{"$error":"#N/A"},{"$error":"#N/A"},{"$f":"IFERROR(VLOOKUP(B157,Insumos!$A$4:$B$8,2,FALSE),\"\")","v":""}]
[null,{"$error":"#N/A"},{"$error":"#N/A"},{"$f":"IFERROR(VLOOKUP(B158,Insumos!$A$4:$B$8,2,FALSE),\"\")","v":""}]
[null,{"$error":"#N/A"},{"$error":"#N/A"},{"$f":"IFERROR(VLOOKUP(B159,Insumos!$A$4:$B$8,2,FALSE),\"\")","v":""}]
[null,{"$error":"#N/A"},{"$error":"#N/A"},{"$f":"IFERROR(VLOOKUP(B160,Insumos!$A$4:$B$8,2,FALSE),\"\")","v":""}]
[null,{"$error":"#N/A"},{"$error":"#N/A"},{"$f":"IFERROR(VLOOKUP(B161,Insumos!$A$4:$B$8,2,FALSE),\"\")","v":""}]
[null,{"$error":"#N/A"},{"$error":"#N/A"},{"$f":"IFERROR(VLOOKUP(B162,Insumos!$A$4:$B$8,2,FALSE),\"\")","v":""}]
[null,{"$error":"#N/A"},{"$error":"#N/A"},{"$f":"IFERROR(VLOOKUP(B163,Insumos!$A$4:$B$8,2,FALSE),\"\")","v":""}]
[null,{"$error":"#N/A"},{"$error":"#N/A"},{"$f":"IFERROR(VLOOKUP(B164,Insumos!$A$4:$B$8,2,FALSE),\"\")","v":""}]
[null,{"$error":"#N/A"},{"$error":"#N/A"},{"$f":"IFERROR(VLOOKUP(B165,Insumos!$A$4:$B$8,2,FALSE),\"\")","v":""}]
[null,{"$error":"#N/A"},{"$error":"#N/A"},{"$f":"IFERROR(VLOOKUP(B166,Insumos!$A$4:$B$8,2,FALSE),\"\")","v":""}]
[null,{"$error":"#N/A"},{"$error":"#N/A"},{"$f":"IFERROR(VLOOKUP(B167,Insumos!$A$4:$B$8,2,FALSE),\"\")","v":""}]
[null,{"$error":"#N/A"},{"$error":"#N/A"},{"$f":"IFERROR(VLOOKUP(B168,Insumos!$A$4:$B$8,2,FALSE),\"\")","v":""}]
[null,{"$error":"#N/A"},{"$error":"#N/A"},{"$f":"IFERROR(VLOOKUP(B169,Insumos!$A$4:$B$8,2,FALSE),\"\")","v":""}]
[null,{"$error":"#N/A"},{"$error":"#N/A"},{"$f":"IFERROR(VLOOKUP(B170,Insumos!$A$4:$B$8,2,FALSE),\"\")","v":""}]
[null,{"$error":"#N/A"},{"$error":"#N/A"},{"$f":"IFERROR(VLOOKUP(B171,Insumos!$A$4:$B$8,2,FALSE),\"\")","v":""}]
[null,{"$error":"#N/A"},{"$error":"#N/A"},{"$f":"IFERROR(VLOOKUP(B172,Insumos!$A$4:$B$8,2,FALSE),\"\")","v":""}]
[null,{"$error":"#N/A"},{"$error":"#N/A"},{"$f":"IFERROR(VLOOKUP(B173,Insumos!$A$4:$B$8,2,FALSE),\"\")","v":""}]
[null,{"$error":"#N/A"},{"$error":"#N/A"},{"$f":"IFERROR(VLOOKUP(B174,Insumos!$A$4:$B$8,2,FALSE),\"\")","v":""}]
[null,{"$error":"#N/A"},{"$error":"#N/A"},{"$f":"IFERROR(VLOOKUP(B175,Insumos!$A$4:$B$8,2,FALSE),\"\")","v":""}]
[null,{"$error":"#N/A"},{"$error":"#N/A"},{"$f":"IFERROR(VLOOKUP(B176,Insumos!$A$4:$B$8,2,FALSE),\"\")","v":""}]
[null,{"$error":"#N/A"},{"$error":"#N/A"},{"$f":"IFERROR(VLOOKUP(B177,Insumos!$A$4:$B$8,2,FALSE),\"\")","v":""}]
[null,{"$error":"#N/A"},{"$error":"#N/A"},{"$f":"IFERROR(VLOOKUP(B178,Insumos!$A$4:$B$8,2,FALSE),\"\")","v":""}]
[null,{"$error":"#N/A"},{"$error":"#N/A"},{"$f":"IFERROR(VLOOKUP(B179,Insumos!$A$4:$B$8,2,FALSE),\"\")","v":""}]
[null,{"$error":"#N/A"},{"$error":"#N/A"},{"$f":"IFERROR(VLOOKUP(B180,Insumos!$A$4:$B$8,2,FALSE),\"\")","v":""}]
[null,{"$error":"#N/A"},{"$error":"#N/A"},{"$f":"IFERROR(VLOOKUP(B181,Insumos!$A$4:$B$8,2,FALSE),\"\")","v":""}]
[null,{"$error":"#N/A"},{"$error":"#N/A"},{"$f":"IFERROR(VLOOKUP(B182,Insumos!$A$4:$B$8,2,FALSE),\"\")","v":""}]
[null,{"$error":"#N/A"},{"$error":"#N/A"},{"$f":"IFERROR(VLOOKUP(B183,Insumos!$A$4:$B$8,2,FALSE),\"\")","v":""}]
[null,{"$error":"#N/A"},{"$error":"#N/A"},{"$f":"IFERROR(VLOOKUP(B184,Insumos!$A$4:$B$8,2,FALSE),\"\")","v":""}]
[null,{"$error":"#N/A"},{"$error":"#N/A"},{"$f":"IFERROR(VLOOKUP(B185,Insumos!$A$4:$B$8,2,FALSE),\"\")","v":""}]
[null,{"$error":"#N/A"},{"$error":"#N/A"},{"$f":"IFERROR(VLOOKUP(B186,Insumos!$A$4:$B$8,2,FALSE),\"\")","v":""}]
[null,{"$error":"#N/A"},{"$error":"#N/A"},{"$f":"IFERROR(VLOOKUP(B187,Insumos!$A$4:$B$8,2,FALSE),\"\")","v":""}]
[null,{"$error":"#N/A"},{"$error":"#N/A"},{"$f":"IFERROR(VLOOKUP(B188,Insumos!$A$4:$B$8,2,FALSE),\"\")","v":""}]
[null,{"$error":"#N/A"},{"$error":"#N/A"},{"$f":"IFERROR(VLOOKUP(B189,Insumos!$A$4:$B$8,2,FALSE),\"\")","v":""}]
[null,{"$error":"#N/A"},{"$error":"#N/A"},{"$f":"IFERROR(VLOOKUP(B190,Insumos!$A$4:$B$8,2,FALSE),\"\")","v":""}]
[null,{"$error":"#N/A"},{"$error":"#N/A"},{"$f":"IFERROR(VLOOKUP(B191,Insumos!$A$4:$B$8,2,FALSE),\"\")","v":""}]
[null,{"$error":"#N/A"},{"$error":"#N/A"},{"$f":"IFERROR(VLOOKUP(B192,Insumos!$A$4:$B$8,2,FALSE),\"\")","v":""}]
[null,{"$error":"#N/A"},{"$error":"#N/A"},{"$f":"IFERROR(VLOOKUP(B193,Insumos!$A$4:$B$8,2,FALSE),\"\")","v":""}]
[null,{"$error":"#N/A"},{"$error":"#N/A"},{"$f":"IFERROR(VLOOKUP(B194,Insumos!$A$4:$B$8,2,FALSE),\"\")","v":""}]
[null,{"$error":"#N/A"},{"$error":"#N/A"},{"$f":"IFERROR(VLOOKUP(B195,Insumos!$A$4:$B$8,2,FALSE),\"\")","v":""}]
[null,{"$error":"#N/A"},{"$error":"#N/A"},{"$f":"IFERROR(VLOOKUP(B196,Insumos!$A$4:$B$8,2,FALSE),\"\")","v":""}]
[null,{"$error":"#N/A"},{"$error":"#N/A"},{"$f":"IFERROR(VLOOKUP(B197,Insumos!$A$4:$B$8,2,FALSE),\"\")","v":""}]
[null,{"$error":"#N/A"},{"$error":"#N/A"},{"$f":"IFERROR(VLOOKUP(B198,Insumos!$A$4:$B$8,2,FALSE),\"\")","v":""}]
[null,{"$error":"#N/A"},{"$error":"#N/A"},{"$f":"IFERROR(VLOOKUP(B199,Insumos!$A$4:$B$8,2,FALSE),\"\")","v":""}]
[null,{"$error":"#N/A"},{"$error":"#N/A"},{"$f":"IFERROR(VLOOKUP(B200,Insumos!$A$4:$B$8,2,FALSE),\"\")","v":""}]
[null,{"$error":"#N/A"},{"$error":"#N/A"},{"$f":"IFERROR(VLOOKUP(B201,Insumos!$A$4:$B$8,2,FALSE),\"\")","v":""}]
[null,{"$error":"#N/A"},{"$error":"#N/A"},{"$f":"IFERROR(VLOOKUP(B202,Insumos!$A$4:$B$8,2,FALSE),\"\")","v":""}]
[null,{"$error":"#N/A"},{"$error":"#N/A"},{"$f":"IFERROR(VLOOKUP(B203,Insumos!$A$4:$B$8,2,FALSE),\"\")","v":""}]
[null,{"$error":"#N/A"},{"$error":"#N/A"},{"$f":"IFERROR(VLOOKUP(B204,Insumos!$A$4:$B$8,2,FALSE),\"\")","v":""}]
[null,{"$error":"#N/A"},{"$error":"#N/A"},{"$f":"IFERROR(VLOOKUP(B205,Insumos!$A$4:$B$8,2,FALSE),\"\")","v":""}]
[null,{"$error":"#N/A"},{"$error":"#N/A"},{"$f":"IFERROR(VLOOKUP(B206,Insumos!$A$4:$B$8,2,FALSE),\"\")","v":""}]
[null,{"$error":"#N/A"},{"$error":"#N/A"},{"$f":"IFERROR(VLOOKUP(B207,Insumos!$A$4:$B$8,2,FALSE),\"\")","v":""}]
[null,{"$error":"#N/A"},{"$error":"#N/A"},{"$f":"IFERROR(VLOOKUP(B208,Insumos!$A$4:$B$8,2,FALSE),\"\")","v":""}]
[null,{"$error":"#N/A"},{"$error":"#N/A"},{"$f":"IFERROR(VLOOKUP(B209,Insumos!$A$4:$B$8,2,FALSE),\"\")","v":""}]
[null,{"$error":"#N/A"},{"$error":"#N/A"},{"$f":"IFERROR(VLOOKUP(B210,Insumos!$A$4:$B$8,2,FALSE),\"\")","v":""}]
[null,{"$error":"#N/A"},{"$error":"#N/A"},{"$f":"IFERROR(VLOOKUP(B211,Insumos!$A$4:$B$8,2,FALSE),\"\")","v":""}]
[null,{"$error":"#N/A"},{"$error":"#N/A"},{"$f":"IFERROR(VLOOKUP(B212,Insumos!$A$4:$B$8,2,FALSE),\"\")","v":""}]
[null,{"$error":"#N/A"},{"$error":"#N/A"},{"$f":"IFERROR(VLOOKUP(B213,Insumos!$A$4:$B$8,2,FALSE),\"\")","v":""}]
[null,{"$error":"#N/A"},{"$error":"#N/A"},{"$f":"IFERROR(VLOOKUP(B214,Insumos!$A$4:$B$8,2,FALSE),\"\")","v":""}]
[null,{"$error":"#N/A"},{"$error":"#N/A"},{"$f":"IFERROR(VLOOKUP(B215,Insumos!$A$4:$B$8,2,FALSE),\"\")","v":""}]
[null,{"$error":"#N/A"},{"$error":"#N/A"},{"$f":"IFERROR(VLOOKUP(B216,Insumos!$A$4:$B$8,2,FALSE),\"\")","v":""}]
[null,{"$error":"#N/A"},{"$error":"#N/A"},{"$f":"IFERROR(VLOOKUP(B217,Insumos!$A$4:$B$8,2,FALSE),\"\")","v":""}]
[null,{"$error":"#N/A"},{"$error":"#N/A"},{"$f":"IFERROR(VLOOKUP(B218,Insumos!$A$4:$B$8,2,FALSE),\"\")","v":""}]
[null,{"$error":"#N/A"},{"$error":"#N/A"},{"$f":"IFERROR(VLOOKUP(B219,Insumos!$A$4:$B$8,2,FALSE),\"\")","v":""}]
[null,{"$error":"#N/A"},{"$error":"#N/A"},{"$f":"IFERROR(VLOOKUP(B220,Insumos!$A$4:$B$8,2,FALSE),\"\")","v":""}]
[null,{"$error":"#N/A"},{"$error":"#N/A"},{"$f":"IFERROR(VLOOKUP(B221,Insumos!$A$4:$B$8,2,FALSE),\"\")","v":""}]
[null,{"$error":"#N/A"},{"$error":"#N/A"},{"$f":"IFERROR(VLOOKUP(B222,Insumos!$A$4:$B$8,2,FALSE),\"\")","v":""}]
[null,{"$error":"#N/A"},{"$error":"#N/A"},{"$f":"IFERROR(VLOOKUP(B223,Insumos!$A$4:$B$8,2,FALSE),\"\")","v":""}]
[null,{"$error":"#N/A"},{"$error":"#N/A"},{"$f":"IFERROR(VLOOKUP(B224,Insumos!$A$4:$B$8,2,FALSE),\"\")","v":""}]
[null,{"$error":"#N/A"},{"$error":"#N/A"},{"$f":"IFERROR(VLOOKUP(B225,Insumos!$A$4:$B$8,2,FALSE),\"\")","v":""}]
[null,{"$error":"#N/A"},{"$error":"#N/A"},{"$f":"IFERROR(VLOOKUP(B226,Insumos!$A$4:$B$8,2,FALSE),\"\")","v":""}]
[null,{"$error":"#N/A"},{"$error":"#N/A"},{"$f":"IFERROR(VLOOKUP(B227,Insumos!$A$4:$B$8,2,FALSE),\"\")","v":""}]
[null,{"$error":"#N/A"},{"$error":"#N/A"},{"$f":"IFERROR(VLOOKUP(B228,Insumos!$A$4:$B$8,2,FALSE),\"\")","v":""}]
[null,{"$error":"#N/A"},{"$error":"#N/A"},{"$f":"IFERROR(VLOOKUP(B229,Insumos!$A$4:$B$8,2,FALSE),\"\")","v":""}]
[null,{"$error":"#N/A"},{"$error":"#N/A"},{"$f":"IFERROR(VLOOKUP(B230,Insumos!$A$4:$B$8,2,FALSE),\"\")","v":""}]
[null,{"$error":"#N/A"},{"$error":"#N/A"},{"$f":"IFERROR(VLOOKUP(B231,Insumos!$A$4:$B$8,2,FALSE),\"\")","v":""}]
[null,{"$error":"#N/A"},{"$error":"#N/A"},{"$f":"IFERROR(VLOOKUP(B232,Insumos!$A$4:$B$8,2,FALSE),\"\")","v":""}]
[null,{"$error":"#N/A"},{"$error":"#N/A"},{"$f":"IFERROR(VLOOKUP(B233,Insumos!$A$4:$B$8,2,FALSE),\"\")","v":""}]
[null,{"$error":"#N/A"},{"$error":"#N/A"},{"$f":"IFERROR(VLOOKUP(B234,Insumos!$A$4:$B$8,2,FALSE),\"\")","v":""}]
[null,{"$error":"#N/A"},{"$error":"#N/A"},{"$f":"IFERROR(VLOOKUP(B235,Insumos!$A$4:$B$8,2,FALSE),\"\")","v":""}]
[null,{"$error":"#N/A"},{"$error":"#N/A"},{"$f":"IFERROR(VLOOKUP(B236,Insumos!$A$4:$B$8,2,FALSE),\"\")","v":""}]
[null,{"$error":"#N/A"},{"$error":"#N/A"},{"$f":"IFERROR(VLOOKUP(B237,Insumos!$A$4:$B$8,2,FALSE),\"\")","v":""}]
[null,{"$error":"#N/A"},{"$error":"#N/A"},{"$f":"IFERROR(VLOOKUP(B238,Insumos!$A$4:$B$8,2,FALSE),\"\")","v":""}]
[null,{"$error":"#N/A"},{"$error":"#N/A"},{"$f":"IFERROR(VLOOKUP(B239,Insumos!$A$4:$B$8,2,FALSE),\"\")","v":""}]
[null,{"$error":"#N/A"},{"$error":"#N/A"},{"$f":"IFERROR(VLOOKUP(B240,Insumos!$A$4:$B$8,2,FALSE),\"\")","v":""}]
[null,{"$error":"#N/A"},{"$error":"#N/A"},{"$f":"IFERROR(VLOOKUP(B241,Insumos!$A$4:$B$8,2,FALSE),\"\")","v":""}]
[null,{"$error":"#N/A"},{"$error":"#N/A"},{"$f":"IFERROR(VLOOKUP(B242,Insumos!$A$4:$B$8,2,FALSE),\"\")","v":""}]
[null,{"$error":"#N/A"},{"$error":"#N/A"},{"$f":"IFERROR(VLOOKUP(B243,Insumos!$A$4:$B$8,2,FALSE),\"\")","v":""}]
[null,{"$error":"#N/A"},{"$error":"#N/A"},{"$f":"IFERROR(VLOOKUP(B244,Insumos!$A$4:$B$8,2,FALSE),\"\")","v":""}]
[null,{"$error":"#N/A"},{"$error":"#N/A"},{"$f":"IFERROR(VLOOKUP(B245,Insumos!$A$4:$B$8,2,FALSE),\"\")","v":""}]
[null,{"$error":"#N/A"},{"$error":"#N/A"},{"$f":"IFERROR(VLOOKUP(B246,Insumos!$A$4:$B$8,2,FALSE),\"\")","v":""}]
[null,{"$error":"#N/A"},{"$error":"#N/A"},{"$f":"IFERROR(VLOOKUP(B247,Insumos!$A$4:$B$8,2,FALSE),\"\")","v":""}]
[null,{"$error":"#N/A"},{"$error":"#N/A"},{"$f":"IFERROR(VLOOKUP(B248,Insumos!$A$4:$B$8,2,FALSE),\"\")","v":""}]
[null,{"$error":"#N/A"},{"$error":"#N/A"},{"$f":"IFERROR(VLOOKUP(B249,Insumos!$A$4:$B$8,2,FALSE),\"\")","v":""}]
[null,{"$error":"#N/A"},{"$error":"#N/A"},{"$f":"IFERROR(VLOOKUP(B250,Insumos!$A$4:$B$8,2,FALSE),\"\")","v":""}]
[null,{"$error":"#N/A"},{"$error":"#N/A"},{"$f":"IFERROR(VLOOKUP(B251,Insumos!$A$4:$B$8,2,FALSE),\"\")","v":""}]
[null,{"$error":"#N/A"},{"$error":"#N/A"},{"$f":"IFERROR(VLOOKUP(B252,Insumos!$A$4:$B$8,2,FALSE),\"\")","v":""}]
[null,{"$error":"#N/A"},{"$error":"#N/A"},{"$f":"IFERROR(VLOOKUP(B253,Insumos!$A$4:$B$8,2,FALSE),\"\")","v":""}]
[null,{"$error":"#N/A"},{"$error":"#N/A"},{"$f":"IFERROR(VLOOKUP(B254,Insumos!$A$4:$B$8,2,FALSE),\"\")","v":""}]
[null,{"$error":"#N/A"},{"$error":"#N/A"},{"$f":"IFERROR(VLOOKUP(B255,Insumos!$A$4:$B$8,2,FALSE),\"\")","v":""}]
[null,{"$error":"#N/A"},{"$error":"#N/A"},{"$f":"IFERROR(VLOOKUP(B256,Insumos!$A$4:$B$8,2,FALSE),\"\")","v":""}]
[null,{"$error":"#N/A"},{"$error":"#N/A"},{"$f":"IFERROR(VLOOKUP(B257,Insumos!$A$4:$B$8,2,FALSE),\"\")","v":""}]
[null,{"$error":"#N/A"},{"$error":"#N/A"},{"$f":"IFERROR(VLOOKUP(B258,Insumos!$A$4:$B$8,2,FALSE),\"\")","v":""}]
[null,{"$error":"#N/A"},{"$error":"#N/A"},{"$f":"IFERROR(VLOOKUP(B259,Insumos!$A$4:$B$8,2,FALSE),\"\")","v":""}]
[null,{"$error":"#N/A"},{"$error":"#N/A"},{"$f":"IFERROR(VLOOKUP(B260,Insumos!$A$4:$B$8,2,FALSE),\"\")","v":""}]
[null,{"$error":"#N/A"},{"$error":"#N/A"},{"$f":"IFERROR(VLOOKUP(B261,Insumos!$A$4:$B$8,2,FALSE),\"\")","v":""}]
[null,{"$error":"#N/A"},{"$error":"#N/A"},{"$f":"IFERROR(VLOOKUP(B262,Insumos!$A$4:$B$8,2,FALSE),\"\")","v":""}]
[null,{"$error":"#N/A"},{"$error":"#N/A"},{"$f":"IFERROR(VLOOKUP(B263,Insumos!$A$4:$B$8,2,FALSE),\"\")","v":""}]
[null,{"$error":"#N/A"},{"$error":"#N/A"},{"$f":"IFERROR(VLOOKUP(B264,Insumos!$A$4:$B$8,2,FALSE),\"\")","v":""}]
[null,{"$error":"#N/A"},{"$error":"#N/A"},{"$f":"IFERROR(VLOOKUP(B265,Insumos!$A$4:$B$8,2,FALSE),\"\")","v":""}]
[null,{"$error":"#N/A"},{"$error":"#N/A"},{"$f":"IFERROR(VLOOKUP(B266,Insumos!$A$4:$B$8,2,FALSE),\"\")","v":""}]
[null,{"$error":"#N/A"},{"$error":"#N/A"},{"$f":"IFERROR(VLOOKUP(B267,Insumos!$A$4:$B$8,2,FALSE),\"\")","v":""}]
[null,{"$error":"#N/A"},{"$error":"#N/A"},{"$f":"IFERROR(VLOOKUP(B268,Insumos!$A$4:$B$8,2,FALSE),\"\")","v":""}]
[null,{"$error":"#N/A"},{"$error":"#N/A"},{"$f":"IFERROR(VLOOKUP(B269,Insumos!$A$4:$B$8,2,FALSE),\"\")","v":""}]
[null,{"$error":"#N/A"},{"$error":"#N/A"},{"$f":"IFERROR(VLOOKUP(B270,Insumos!$A$4:$B$8,2,FALSE),\"\")","v":""}]
[null,{"$error":"#N/A"},{"$error":"#N/A"},{"$f":"IFERROR(VLOOKUP(B271,Insumos!$A$4:$B$8,2,FALSE),\"\")","v":""}]
[null,{"$error":"#N/A"},{"$error":"#N/A"},{"$f":"IFERROR(VLOOKUP(B272,Insumos!$A$4:$B$8,2,FALSE),\"\")","v":""}]
[null,{"$error":"#N/A"},{"$error":"#N/A"},{"$f":"IFERROR(VLOOKUP(B273,Insumos!$A$4:$B$8,2,FALSE),\"\")","v":""}]
[null,{"$error":"#N/A"},{"$error":"#N/A"},{"$f":"IFERROR(VLOOKUP(B274,Insumos!$A$4:$B$8,2,FALSE),\"\")","v":""}]
[null,{"$error":"#N/A"},{"$error":"#N/A"},{"$f":"IFERROR(VLOOKUP(B275,Insumos!$A$4:$B$8,2,FALSE),\"\")","v":""}]
[null,{"$error":"#N/A"},{"$error":"#N/A"},{"$f":"IFERROR(VLOOKUP(B276,Insumos!$A$4:$B$8,2,FALSE),\"\")","v":""}]
[null,{"$error":"#N/A"},{"$error":"#N/A"},{"$f":"IFERROR(VLOOKUP(B277,Insumos!$A$4:$B$8,2,FALSE),\"\")","v":""}]
[null,{"$error":"#N/A"},{"$error":"#N/A"},{"$f":"IFERROR(VLOOKUP(B278,Insumos!$A$4:$B$8,2,FALSE),\"\")","v":""}]
[null,{"$error":"#N/A"},{"$error":"#N/A"},{"$f":"IFERROR(VLOOKUP(B279,Insumos!$A$4:$B$8,2,FALSE),\"\")","v":""}]
[null,{"$error":"#N/A"},{"$error":"#N/A"},{"$f":"IFERROR(VLOOKUP(B280,Insumos!$A$4:$B$8,2,FALSE),\"\")","v":""}]
[null,{"$error":"#N/A"},{"$error":"#N/A"},{"$f":"IFERROR(VLOOKUP(B281,Insumos!$A$4:$B$8,2,FALSE),\"\")","v":""}]
[null,{"$error":"#N/A"},{"$error":"#N/A"},{"$f":"IFERROR(VLOOKUP(B282,Insumos!$A$4:$B$8,2,FALSE),\"\")","v":""}]
[null,{"$error":"#N/A"},{"$error":"#N/A"},{"$f":"IFERROR(VLOOKUP(B283,Insumos!$A$4:$B$8,2,FALSE),\"\")","v":""}]
[null,{"$error":"#N/A"},{"$error":"#N/A"},{"$f":"IFERROR(VLOOKUP(B284,Insumos!$A$4:$B$8,2,FALSE),\"\")","v":""}]
[null,{"$error":"#N/A"},{"$error":"#N/A"},{"$f":"IFERROR(VLOOKUP(B285,Insumos!$A$4:$B$8,2,FALSE),\"\")","v":""}]
[null,{"$error":"#N/A"},{"$error":"#N/A"},{"$f":"IFERROR(VLOOKUP(B286,Insumos!$A$4:$B$8,2,FALSE),\"\")","v":""}]
[null,{"$error":"#N/A"},{"$error":"#N/A"},{"$f":"IFERROR(VLOOKUP(B287,Insumos!$A$4:$B$8,2,FALSE),\"\")","v":""}]
[null,{"$error":"#N/A"},{"$error":"#N/A"},{"$f":"IFERROR(VLOOKUP(B288,Insumos!$A$4:$B$8,2,FALSE),\"\")","v":""}]
[null,{"$error":"#N/A"},{"$error":"#N/A"},{"$f":"IFERROR(VLOOKUP(B289,Insumos!$A$4:$B$8,2,FALSE),\"\")","v":""}]
[null,{"$error":"#N/A"},{"$error":"#N/A"},{"$f":"IFERROR(VLOOKUP(B290,Insumos!$A$4:$B$8,2,FALSE),\"\")","v":""}]
[null,{"$error":"#N/A"},{"$error":"#N/A"},{"$f":"IFERROR(VLOOKUP(B291,Insumos!$A$4:$B$8,2,FALSE),\"\")","v":""}]
[null,{"$error":"#N/A"},{"$error":"#N/A"},{"$f":"IFERROR(VLOOKUP(B292,Insumos!$A$4:$B$8,2,FALSE),\"\")","v":""}]
[null,{"$error":"#N/A"},{"$error":"#N/A"},{"$f":"IFERROR(VLOOKUP(B293,Insumos!$A$4:$B$8,2,FALSE),\"\")","v":""}]
[null,{"$error":"#N/A"},{"$error":"#N/A"},{"$f":"IFERROR(VLOOKUP(B294,Insumos!$A$4:$B$8,2,FALSE),\"\")","v":""}]
[null,{"$error":"#N/A"},{"$error":"#N/A"},{"$f":"IFERROR(VLOOKUP(B295,Insumos!$A$4:$B$8,2,FALSE),\"\")","v":""}]
[null,{"$error":"#N/A"},{"$error":"#N/A"},{"$f":"IFERROR(VLOOKUP(B296,Insumos!$A$4:$B$8,2,FALSE),\"\")","v":""}]
[null,{"$error":"#N/A"},{"$error":"#N/A"},{"$f":"IFERROR(VLOOKUP(B297,Insumos!$A$4:$B$8,2,FALSE),\"\")","v":""}]
[null,{"$error":"#N/A"},{"$error":"#N/A"},{"$f":"IFERROR(VLOOKUP(B298,Insumos!$A$4:$B$8,2,FALSE),\"\")","v":""}]
[null,{"$error":"#N/A"},{"$error":"#N/A"},{"$f":"IFERROR(VLOOKUP(B299,Insumos!$A$4:$B$8,2,FALSE),\"\")","v":""}]
[null,{"$error":"#N/A"},{"$error":"#N/A"},{"$f":"IFERROR(VLOOKUP(B300,Insumos!$A$4:$B$8,2,FALSE),\"\")","v":""}]
[null,{"$error":"#N/A"},{"$error":"#N/A"},{"$f":"IFERROR(VLOOKUP(B301,Insumos!$A$4:$B$8,2,FALSE),\"\")","v":""}]
[null,{"$error":"#N/A"},{"$error":"#N/A"},{"$f":"IFERROR(VLOOKUP(B302,Insumos!$A$4:$B$8,2,FALSE),\"\")","v":""}]
[null,{"$error":"#N/A"},{"$error":"#N/A"},{"$f":"IFERROR(VLOOKUP(B303,Insumos!$A$4:$B$8,2,FALSE),\"\")","v":""}]
[null,{"$error":"#N/A"},{"$error":"#N/A"},{"$f":"IFERROR(VLOOKUP(B304,Insumos!$A$4:$B$8,2,FALSE),\"\")","v":""}]
[null,{"$error":"#N/A"},{"$error":"#N/A"},{"$f":"IFERROR(VLOOKUP(B305,Insumos!$A$4:$B$8,2,FALSE),\"\")","v":""}]
[null,{"$error":"#N/A"},{"$error":"#N/A"},{"$f":"IFERROR(VLOOKUP(B306,Insumos!$A$4:$B$8,2,FALSE),\"\")","v":""}]
[null,{"$error":"#N/A"},{"$error":"#N/A"},{"$f":"IFERROR(VLOOKUP(B307,Insumos!$A$4:$B$8,2,FALSE),\"\")","v":""}]
[null,{"$error":"#N/A"},{"$error":"#N/A"},{"$f":"IFERROR(VLOOKUP(B308,Insumos!$A$4:$B$8,2,FALSE),\"\")","v":""}]
[null,{"$error":"#N/A"},{"$error":"#N/A"},{"$f":"IFERROR(VLOOKUP(B309,Insumos!$A$4:$B$8,2,FALSE),\"\")","v":""}]
[null,{"$error":"#N/A"},{"$error":"#N/A"},{"$f":"IFERROR(VLOOKUP(B310,Insumos!$A$4:$B$8,2,FALSE),\"\")","v":""}]
[null,{"$error":"#N/A"},{"$error":"#N/A"},{"$f":"IFERROR(VLOOKUP(B311,Insumos!$A$4:$B$8,2,FALSE),\"\")","v":""}]
[null,{"$error":"#N/A"},{"$error":"#N/A"},{"$f":"IFERROR(VLOOKUP(B312,Insumos!$A$4:$B$8,2,FALSE),\"\")","v":""}]
[null,{"$error":"#N/A"},{"$error":"#N/A"},{"$f":"IFERROR(VLOOKUP(B313,Insumos!$A$4:$B$8,2,FALSE),\"\")","v":""}]
[null,{"$error":"#N/A"},{"$error":"#N/A"},{"$f":"IFERROR(VLOOKUP(B314,Insumos!$A$4:$B$8,2,FALSE),\"\")","v":""}]
[null,{"$error":"#N/A"},{"$error":"#N/A"},{"$f":"IFERROR(VLOOKUP(B315,Insumos!$A$4:$B$8,2,FALSE),\"\")","v":""}]
[null,{"$error":"#N/A"},{"$error":"#N/A"},{"$f":"IFERROR(VLOOKUP(B316,Insumos!$A$4:$B$8,2,FALSE),\"\")","v":""}]
[null,{"$error":"#N/A"},{"$error":"#N/A"},{"$f":"IFERROR(VLOOKUP(B317,Insumos!$A$4:$B$8,2,FALSE),\"\")","v":""}]
[null,{"$error":"#N/A"},{"$error":"#N/A"},{"$f":"IFERROR(VLOOKUP(B318,Insumos!$A$4:$B$8,2,FALSE),\"\")","v":""}]
[null,{"$error":"#N/A"},{"$error":"#N/A"},{"$f":"IFERROR(VLOOKUP(B319,Insumos!$A$4:$B$8,2,FALSE),\"\")","v":""}]
[null,{"$error":"#N/A"},{"$error":"#N/A"},{"$f":"IFERROR(VLOOKUP(B320,Insumos!$A$4:$B$8,2,FALSE),\"\")","v":""}]
[null,{"$error":"#N/A"},{"$error":"#N/A"},{"$f":"IFERROR(VLOOKUP(B321,Insumos!$A$4:$B$8,2,FALSE),\"\")","v":""}]
[null,{"$error":"#N/A"},{"$error":"#N/A"},{"$f":"IFERROR(VLOOKUP(B322,Insumos!$A$4:$B$8,2,FALSE),\"\")","v":""}]
[null,{"$error":"#N/A"},{"$error":"#N/A"},{"$f":"IFERROR(VLOOKUP(B323,Insumos!$A$4:$B$8,2,FALSE),\"\")","v":""}]
[null,{"$error":"#N/A"},{"$error":"#N/A"},{"$f":"IFERROR(VLOOKUP(B324,Insumos!$A$4:$B$8,2,FALSE),\"\")","v":""}]
[null,{"$error":"#N/A"},{"$error":"#N/A"},{"$f":"IFERROR(VLOOKUP(B325,Insumos!$A$4:$B$8,2,FALSE),\"\")","v":""}]
[null,{"$error":"#N/A"},{"$error":"#N/A"},{"$f":"IFERROR(VLOOKUP(B326,Insumos!$A$4:$B$8,2,FALSE),\"\")","v":""}]
[null,{"$error":"#N/A"},{"$error":"#N/A"},{"$f":"IFERROR(VLOOKUP(B327,Insumos!$A$4:$B$8,2,FALSE),\"\")","v":""}]
[null,{"$error":"#N/A"},{"$error":"#N/A"},{"$f":"IFERROR(VLOOKUP(B328,Insumos!$A$4:$B$8,2,FALSE),\"\")","v":""}]
[null,{"$error":"#N/A"},{"$error":"#N/A"},{"$f":"IFERROR(VLOOKUP(B329,Insumos!$A$4:$B$8,2,FALSE),\"\")","v":""}]
[null,{"$error":"#N/A"},{"$error":"#N/A"},{"$f":"IFERROR(VLOOKUP(B330,Insumos!$A$4:$B$8,2,FALSE),\"\")","v":""}]
[null,{"$error":"#N/A"},{"$error":"#N/A"},{"$f":"IFERROR(VLOOKUP(B331,Insumos!$A$4:$B$8,2,FALSE),\"\")","v":""}]
[null,{"$error":"#N/A"},{"$error":"#N/A"},{"$f":"IFERROR(VLOOKUP(B332,Insumos!$A$4:$B$8,2,FALSE),\"\")","v":""}]
[null,{"$error":"#N/A"},{"$error":"#N/A"},{"$f":"IFERROR(VLOOKUP(B333,Insumos!$A$4:$B$8,2,FALSE),\"\")","v":""}]
[null,{"$error":"#N/A"},{"$error":"#N/A"},{"$f":"IFERROR(VLOOKUP(B334,Insumos!$A$4:$B$8,2,FALSE),\"\")","v":""}]
[null,{"$error":"#N/A"},{"$error":"#N/A"},{"$f":"IFERROR(VLOOKUP(B335,Insumos!$A$4:$B$8,2,FALSE),\"\")","v":""}]
[null,{"$error":"#N/A"},{"$error":"#N/A"},{"$f":"IFERROR(VLOOKUP(B336,Insumos!$A$4:$B$8,2,FALSE),\"\")","v":""}]
[null,{"$error":"#N/A"},{"$error":"#N/A"},{"$f":"IFERROR(VLOOKUP(B337,Insumos!$A$4:$B$8,2,FALSE),\"\")","v":""}]
[null,{"$error":"#N/A"},{"$error":"#N/A"},{"$f":"IFERROR(VLOOKUP(B338,Insumos!$A$4:$B$8,2,FALSE),\"\")","v":""}]
[null,{"$error":"#N/A"},{"$error":"#N/A"},{"$f":"IFERROR(VLOOKUP(B339,Insumos!$A$4:$B$8,2,FALSE),\"\")","v":""}]
[null,{"$error":"#N/A"},{"$error":"#N/A"},{"$f":"IFERROR(VLOOKUP(B340,Insumos!$A$4:$B$8,2,FALSE),\"\")","v":""}]
[null,{"$error":"#N/A"},{"$error":"#N/A"},{"$f":"IFERROR(VLOOKUP(B341,Insumos!$A$4:$B$8,2,FALSE),\"\")","v":""}]
[null,{"$error":"#N/A"},{"$error":"#N/A"},{"$f":"IFERROR(VLOOKUP(B342,Insumos!$A$4:$B$8,2,FALSE),\"\")","v":""}]
[null,{"$error":"#N/A"},{"$error":"#N/A"},{"$f":"IFERROR(VLOOKUP(B343,Insumos!$A$4:$B$8,2,FALSE),\"\")","v":""}]
[null,{"$error":"#N/A"},{"$error":"#N/A"},{"$f":"IFERROR(VLOOKUP(B344,Insumos!$A$4:$B$8,2,FALSE),\"\")","v":""}]
[null,{"$error":"#N/A"},{"$error":"#N/A"},{"$f":"IFERROR(VLOOKUP(B345,Insumos!$A$4:$B$8,2,FALSE),\"\")","v":""}]
[null,{"$error":"#N/A"},{"$error":"#N/A"},{"$f":"IFERROR(VLOOKUP(B346,Insumos!$A$4:$B$8,2,FALSE),\"\")","v":""}]
[null,{"$error":"#N/A"},{"$error":"#N/A"},{"$f":"IFERROR(VLOOKUP(B347,Insumos!$A$4:$B$8,2,FALSE),\"\")","v":""}]
[null,{"$error":"#N/A"},{"$error":"#N/A"},{"$f":"IFERROR(VLOOKUP(B348,Insumos!$A$4:$B$8,2,FALSE),\"\")","v":""}]
[null,{"$error":"#N/A"},{"$error":"#N/A"},{"$f":"IFERROR(VLOOKUP(B349,Insumos!$A$4:$B$8,2,FALSE),\"\")","v":""}]
[null,{"$error":"#N/A"},{"$error":"#N/A"},{"$f":"IFERROR(VLOOKUP(B350,Insumos!$A$4:$B$8,2,FALSE),\"\")","v":""}]
[null,{"$error":"#N/A"},{"$error":"#N/A"},{"$f":"IFERROR(VLOOKUP(B351,Insumos!$A$4:$B$8,2,FALSE),\"\")","v":""}]
[null,{"$error":"#N/A"},{"$error":"#N/A"},{"$f":"IFERROR(VLOOKUP(B352,Insumos!$A$4:$B$8,2,FALSE),\"\")","v":""}]
[null,{"$error":"#N/A"},{"$error":"#N/A"},{"$f":"IFERROR(VLOOKUP(B353,Insumos!$A$4:$B$8,2,FALSE),\"\")","v":""}]
[null,{"$error":"#N/A"},{"$error":"#N/A"},{"$f":"IFERROR(VLOOKUP(B354,Insumos!$A$4:$B$8,2,FALSE),\"\")","v":""}]
[null,{"$error":"#N/A"},{"$error":"#N/A"},{"$f":"IFERROR(VLOOKUP(B355,Insumos!$A$4:$B$8,2,FALSE),\"\")","v":""}]
[null,{"$error":"#N/A"},{"$error":"#N/A"},{"$f":"IFERROR(VLOOKUP(B356,Insumos!$A$4:$B$8,2,FALSE),\"\")","v":""}]
[null,{"$error":"#N/A"},{"$error":"#N/A"},{"$f":"IFERROR(VLOOKUP(B357,Insumos!$A$4:$B$8,2,FALSE),\"\")","v":""}]
[null,{"$error":"#N/A"},{"$error":"#N/A"},{"$f":"IFERROR(VLOOKUP(B358,Insumos!$A$4:$B$8,2,FALSE),\"\")","v":""}]
[null,{"$error":"#N/A"},{"$error":"#N/A"},{"$f":"IFERROR(VLOOKUP(B359,Insumos!$A$4:$B$8,2,FALSE),\"\")","v":""}]
[null,{"$error":"#N/A"},{"$error":"#N/A"},{"$f":"IFERROR(VLOOKUP(B360,Insumos!$A$4:$B$8,2,FALSE),\"\")","v":""}]
[null,{"$error":"#N/A"},{"$error":"#N/A"},{"$f":"IFERROR(VLOOKUP(B361,Insumos!$A$4:$B$8,2,FALSE),\"\")","v":""}]
[null,{"$error":"#N/A"},{"$error":"#N/A"},{"$f":"IFERROR(VLOOKUP(B362,Insumos!$A$4:$B$8,2,FALSE),\"\")","v":""}]
[null,{"$error":"#N/A"},{"$error":"#N/A"},{"$f":"IFERROR(VLOOKUP(B363,Insumos!$A$4:$B$8,2,FALSE),\"\")","v":""}]
[null,{"$error":"#N/A"},{"$error":"#N/A"},{"$f":"IFERROR(VLOOKUP(B364,Insumos!$A$4:$B$8,2,FALSE),\"\")","v":""}]
[null,{"$error":"#N/A"},{"$error":"#N/A"},{"$f":"IFERROR(VLOOKUP(B365,Insumos!$A$4:$B$8,2,FALSE),\"\")","v":""}]
[null,{"$error":"#N/A"},{"$error":"#N/A"},{"$f":"IFERROR(VLOOKUP(B366,Insumos!$A$4:$B$8,2,FALSE),\"\")","v":""}]
[null,{"$error":"#N/A"},{"$error":"#N/A"},{"$f":"IFERROR(VLOOKUP(B367,Insumos!$A$4:$B$8,2,FALSE),\"\")","v":""}]
[null,{"$error":"#N/A"},{"$error":"#N/A"},{"$f":"IFERROR(VLOOKUP(B368,Insumos!$A$4:$B$8,2,FALSE),\"\")","v":""}]
[null,{"$error":"#N/A"},{"$error":"#N/A"},{"$f":"IFERROR(VLOOKUP(B369,Insumos!$A$4:$B$8,2,FALSE),\"\")","v":""}]
[null,{"$error":"#N/A"},{"$error":"#N/A"},{"$f":"IFERROR(VLOOKUP(B370,Insumos!$A$4:$B$8,2,FALSE),\"\")","v":""}]
[null,{"$error":"#N/A"},{"$error":"#N/A"},{"$f":"IFERROR(VLOOKUP(B371,Insumos!$A$4:$B$8,2,FALSE),\"\")","v":""}]
[null,{"$error":"#N/A"},{"$error":"#N/A"},{"$f":"IFERROR(VLOOKUP(B372,Insumos!$A$4:$B$8,2,FALSE),\"\")","v":""}]
[null,{"$error":"#N/A"},{"$error":"#N/A"},{"$f":"IFERROR(VLOOKUP(B373,Insumos!$A$4:$B$8,2,FALSE),\"\")","v":""}]
[null,{"$error":"#N/A"},{"$error":"#N/A"},{"$f":"IFERROR(VLOOKUP(B374,Insumos!$A$4:$B$8,2,FALSE),\"\")","v":""}]
[null,{"$error":"#N/A"},{"$error":"#N/A"},{"$f":"IFERROR(VLOOKUP(B375,Insumos!$A$4:$B$8,2,FALSE),\"\")","v":""}]
[null,{"$error":"#N/A"},{"$error":"#N/A"},{"$f":"IFERROR(VLOOKUP(B376,Insumos!$A$4:$B$8,2,FALSE),\"\")","v":""}]
[null,{"$error":"#N/A"},{"$error":"#N/A"},{"$f":"IFERROR(VLOOKUP(B377,Insumos!$A$4:$B$8,2,FALSE),\"\")","v":""}]
[null,{"$error":"#N/A"},{"$error":"#N/A"},{"$f":"IFERROR(VLOOKUP(B378,Insumos!$A$4:$B$8,2,FALSE),\"\")","v":""}]
[null,{"$error":"#N/A"},{"$error":"#N/A"},{"$f":"IFERROR(VLOOKUP(B379,Insumos!$A$4:$B$8,2,FALSE),\"\")","v":""}]
[null,{"$error":"#N/A"},{"$error":"#N/A"},{"$f":"IFERROR(VLOOKUP(B380,Insumos!$A$4:$B$8,2,FALSE),\"\")","v":""}]
[null,{"$error":"#N/A"},{"$error":"#N/A"},{"$f":"IFERROR(VLOOKUP(B381,Insumos!$A$4:$B$8,2,FALSE),\"\")","v":""}]
[null,{"$error":"#N/A"},{"$error":"#N/A"},{"$f":"IFERROR(VLOOKUP(B382,Insumos!$A$4:$B$8,2,FALSE),\"\")","v":""}]
[null,{"$error":"#N/A"},{"$error":"#N/A"},{"$f":"IFERROR(VLOOKUP(B383,Insumos!$A$4:$B$8,2,FALSE),\"\")","v":""}]
[null,{"$error":"#N/A"},{"$error":"#N/A"},{"$f":"IFERROR(VLOOKUP(B384,Insumos!$A$4:$B$8,2,FALSE),\"\")","v":""}]
[null,{"$error":"#N/A"},{"$error":"#N/A"},{"$f":"IFERROR(VLOOKUP(B385,Insumos!$A$4:$B$8,2,FALSE),\"\")","v":""}]
[null,{"$error":"#N/A"},{"$error":"#N/A"},{"$f":"IFERROR(VLOOKUP(B386,Insumos!$A$4:$B$8,2,FALSE),\"\")","v":""}]
[null,{"$error":"#N/A"},{"$error":"#N/A"},{"$f":"IFERROR(VLOOKUP(B387,Insumos!$A$4:$B$8,2,FALSE),\"\")","v":""}]
[null,{"$error":"#N/A"},{"$error":"#N/A"},{"$f":"IFERROR(VLOOKUP(B388,Insumos!$A$4:$B$8,2,FALSE),\"\")","v":""}]
[null,{"$error":"#N/A"},{"$error":"#N/A"},{"$f":"IFERROR(VLOOKUP(B389,Insumos!$A$4:$B$8,2,FALSE),\"\")","v":""}]
[null,{"$error":"#N/A"},{"$error":"#N/A"},{"$f":"IFERROR(VLOOKUP(B390,Insumos!$A$4:$B$8,2,FALSE),\"\")","v":""}]
[null,{"$error":"#N/A"},{"$error":"#N/A"},{"$f":"IFERROR(VLOOKUP(B391,Insumos!$A$4:$B$8,2,FALSE),\"\")","v":""}]
[null,{"$error":"#N/A"},{"$error":"#N/A"},{"$f":"IFERROR(VLOOKUP(B392,Insumos!$A$4:$B$8,2,FALSE),\"\")","v":""}]
[null,{"$error":"#N/A"},{"$error":"#N/A"},{"$f":"IFERROR(VLOOKUP(B393,Insumos!$A$4:$B$8,2,FALSE),\"\")","v":""}]
[null,{"$error":"#N/A"},{"$error":"#N/A"},{"$f":"IFERROR(VLOOKUP(B394,Insumos!$A$4:$B$8,2,FALSE),\"\")","v":""}]
[null,{"$error":"#N/A"},{"$error":"#N/A"},{"$f":"IFERROR(VLOOKUP(B395,Insumos!$A$4:$B$8,2,FALSE),\"\")","v":""}]
[null,{"$error":"#N/A"},{"$error":"#N/A"},{"$f":"IFERROR(VLOOKUP(B396,Insumos!$A$4:$B$8,2,FALSE),\"\")","v":""}]
[null,{"$error":"#N/A"},{"$error":"#N/A"},{"$f":"IFERROR(VLOOKUP(B397,Insumos!$A$4:$B$8,2,FALSE),\"\")","v":""}]
[null,{"$error":"#N/A"},{"$error":"#N/A"},{"$f":"IFERROR(VLOOKUP(B398,Insumos!$A$4:$B$8,2,FALSE),\"\")","v":""}]
[null,{"$error":"#N/A"},{"$error":"#N/A"},{"$f":"IFERROR(VLOOKUP(B399,Insumos!$A$4:$B$8,2,FALSE),\"\")","v":""}]
[null,{"$error":"#N/A"},{"$error":"#N/A"},{"$f":"IFERROR(VLOOKUP(B400,Insumos!$A$4:$B$8,2,FALSE),\"\")","v":""}]
[null,{"$error":"#N/A"},{"$error":"#N/A"},{"$f":"IFERROR(VLOOKUP(B401,Insumos!$A$4:$B$8,2,FALSE),\"\")","v":""}]
[null,{"$error":"#N/A"},{"$error":"#N/A"},{"$f":"IFERROR(VLOOKUP(B402,Insumos!$A$4:$B$8,2,FALSE),\"\")","v":""}]
[null,{"$error":"#N/A"},{"$error":"#N/A"},{"$f":"IFERROR(VLOOKUP(B403,Insumos!$A$4:$B$8,2,FALSE),\"\")","v":""}]
[null,{"$error":"#N/A"},{"$error":"#N/A"},{"$f":"IFERROR(VLOOKUP(B404,Insumos!$A$4:$B$8,2,FALSE),\"\")","v":""}]
[null,{"$error":"#N/A"},{"$error":"#N/A"},{"$f":"IFERROR(VLOOKUP(B405,Insumos!$A$4:$B$8,2,FALSE),\"\")","v":""}]
[null,{"$error":"#N/A"},{"$error":"#N/A"},{"$f":"IFERROR(VLOOKUP(B406,Insumos!$A$4:$B$8,2,FALSE),\"\")","v":""}]
[null,{"$error":"#N/A"},{"$error":"#N/A"},{"$f":"IFERROR(VLOOKUP(B407,Insumos!$A$4:$B$8,2,FALSE),\"\")","v":""}]
[null,{"$error":"#N/A"},{"$error":"#N/A"},{"$f":"IFERROR(VLOOKUP(B408,Insumos!$A$4:$B$8,2,FALSE),\"\")","v":""}]
[null,{"$error":"#N/A"},{"$error":"#N/A"},{"$f":"IFERROR(VLOOKUP(B409,Insumos!$A$4:$B$8,2,FALSE),\"\")","v":""}]
[null,{"$error":"#N/A"},{"$error":"#N/A"},{"$f":"IFERROR(VLOOKUP(B410,Insumos!$A$4:$B$8,2,FALSE),\"\")","v":""}]
[null,{"$error":"#N/A"},{"$error":"#N/A"},{"$f":"IFERROR(VLOOKUP(B411,Insumos!$A$4:$B$8,2,FALSE),\"\")","v":""}]
[null,{"$error":"#N/A"},{"$error":"#N/A"},{"$f":"IFERROR(VLOOKUP(B412,Insumos!$A$4:$B$8,2,FALSE),\"\")","v":""}]
[null,{"$error":"#N/A"},{"$error":"#N/A"},{"$f":"IFERROR(VLOOKUP(B413,Insumos!$A$4:$B$8,2,FALSE),\"\")","v":""}]
[null,{"$error":"#N/A"},{"$error":"#N/A"},{"$f":"IFERROR(VLOOKUP(B414,Insumos!$A$4:$B$8,2,FALSE),\"\")","v":""}]
[null,{"$error":"#N/A"},{"$error":"#N/A"},{"$f":"IFERROR(VLOOKUP(B415,Insumos!$A$4:$B$8,2,FALSE),\"\")","v":""}]
[null,{"$error":"#N/A"},{"$error":"#N/A"},{"$f":"IFERROR(VLOOKUP(B416,Insumos!$A$4:$B$8,2,FALSE),\"\")","v":""}]
[null,{"$error":"#N/A"},{"$error":"#N/A"},{"$f":"IFERROR(VLOOKUP(B417,Insumos!$A$4:$B$8,2,FALSE),\"\")","v":""}]
[null,{"$error":"#N/A"},{"$error":"#N/A"},{"$f":"IFERROR(VLOOKUP(B418,Insumos!$A$4:$B$8,2,FALSE),\"\")","v":""}]
[null,{"$error":"#N/A"},{"$error":"#N/A"},{"$f":"IFERROR(VLOOKUP(B419,Insumos!$A$4:$B$8,2,FALSE),\"\")","v":""}]
[null,{"$error":"#N/A"},{"$error":"#N/A"},{"$f":"IFERROR(VLOOKUP(B420,Insumos!$A$4:$B$8,2,FALSE),\"\")","v":""}]
[null,{"$error":"#N/A"},{"$error":"#N/A"},{"$f":"IFERROR(VLOOKUP(B421,Insumos!$A$4:$B$8,2,FALSE),\"\")","v":""}]
[null,{"$error":"#N/A"},{"$error":"#N/A"},{"$f":"IFERROR(VLOOKUP(B422,Insumos!$A$4:$B$8,2,FALSE),\"\")","v":""}]
[null,{"$error":"#N/A"},{"$error":"#N/A"},{"$f":"IFERROR(VLOOKUP(B423,Insumos!$A$4:$B$8,2,FALSE),\"\")","v":""}]
[null,{"$error":"#N/A"},{"$error":"#N/A"},{"$f":"IFERROR(VLOOKUP(B424,Insumos!$A$4:$B$8,2,FALSE),\"\")","v":""}]
[null,{"$error":"#N/A"},{"$error":"#N/A"},{"$f":"IFERROR(VLOOKUP(B425,Insumos!$A$4:$B$8,2,FALSE),\"\")","v":""}]
[null,{"$error":"#N/A"},{"$error":"#N/A"},{"$f":"IFERROR(VLOOKUP(B426,Insumos!$A$4:$B$8,2,FALSE),\"\")","v":""}]
[null,{"$error":"#N/A"},{"$error":"#N/A"},{"$f":"IFERROR(VLOOKUP(B427,Insumos!$A$4:$B$8,2,FALSE),\"\")","v":""}]
[null,{"$error":"#N/A"},{"$error":"#N/A"},{"$f":"IFERROR(VLOOKUP(B428,Insumos!$A$4:$B$8,2,FALSE),\"\")","v":""}]
[null,{"$error":"#N/A"},{"$error":"#N/A"},{"$f":"IFERROR(VLOOKUP(B429,Insumos!$A$4:$B$8,2,FALSE),\"\")","v":""}]
[null,{"$error":"#N/A"},{"$error":"#N/A"},{"$f":"IFERROR(VLOOKUP(B430,Insumos!$A$4:$B$8,2,FALSE),\"\")","v":""}]
[null,{"$error":"#N/A"},{"$error":"#N/A"},{"$f":"IFERROR(VLOOKUP(B431,Insumos!$A$4:$B$8,2,FALSE),\"\")","v":""}]
[null,{"$error":"#N/A"},{"$error":"#N/A"},{"$f":"IFERROR(VLOOKUP(B432,Insumos!$A$4:$B$8,2,FALSE),\"\")","v":""}]
[null,{"$error":"#N/A"},{"$error":"#N/A"},{"$f":"IFERROR(VLOOKUP(B433,Insumos!$A$4:$B$8,2,FALSE),\"\")","v":""}]
[null,{"$error":"#N/A"},{"$error":"#N/A"},{"$f":"IFERROR(VLOOKUP(B434,Insumos!$A$4:$B$8,2,FALSE),\"\")","v":""}]
[null,{"$error":"#N/A"},{"$error":"#N/A"},{"$f":"IFERROR(VLOOKUP(B435,Insumos!$A$4:$B$8,2,FALSE),\"\")","v":""}]
[null,{"$error":"#N/A"},{"$error":"#N/A"},{"$f":"IFERROR(VLOOKUP(B436,Insumos!$A$4:$B$8,2,FALSE),\"\")","v":""}]
[null,{"$error":"#N/A"},{"$error":"#N/A"},{"$f":"IFERROR(VLOOKUP(B437,Insumos!$A$4:$B$8,2,FALSE),\"\")","v":""}]
[null,{"$error":"#N/A"},{"$error":"#N/A"},{"$f":"IFERROR(VLOOKUP(B438,Insumos!$A$4:$B$8,2,FALSE),\"\")","v":""}]
[null,{"$error":"#N/A"},{"$error":"#N/A"},{"$f":"IFERROR(VLOOKUP(B439,Insumos!$A$4:$B$8,2,FALSE),\"\")","v":""}]
[null,{"$error":"#N/A"},{"$error":"#N/A"},{"$f":"IFERROR(VLOOKUP(B440,Insumos!$A$4:$B$8,2,FALSE),\"\")","v":""}]
[null,{"$error":"#N/A"},{"$error":"#N/A"},{"$f":"IFERROR(VLOOKUP(B441,Insumos!$A$4:$B$8,2,FALSE),\"\")","v":""}]
[null,{"$error":"#N/A"},{"$error":"#N/A"},{"$f":"IFERROR(VLOOKUP(B442,Insumos!$A$4:$B$8,2,FALSE),\"\")","v":""}]
[null,{"$error":"#N/A"},{"$error":"#N/A"},{"$f":"IFERROR(VLOOKUP(B443,Insumos!$A$4:$B$8,2,FALSE),\"\")","v":""}]
[null,{"$error":"#N/A"},{"$error":"#N/A"},{"$f":"IFERROR(VLOOKUP(B444,Insumos!$A$4:$B$8,2,FALSE),\"\")","v":""}]
[null,{"$error":"#N/A"},{"$error":"#N/A"},{"$f":"IFERROR(VLOOKUP(B445,Insumos!$A$4:$B$8,2,FALSE),\"\")","v":""}]
[null,{"$error":"#N/A"},{"$error":"#N/A"},{"$f":"IFERROR(VLOOKUP(B446,Insumos!$A$4:$B$8,2,FALSE),\"\")","v":""}]
[null,{"$error":"#N/A"},{"$error":"#N/A"},{"$f":"IFERROR(VLOOKUP(B447,Insumos!$A$4:$B$8,2,FALSE),\"\")","v":""}]
[null,{"$error":"#N/A"},{"$error":"#N/A"},{"$f":"IFERROR(VLOOKUP(B448,Insumos!$A$4:$B$8,2,FALSE),\"\")","v":""}]
[null,{"$error":"#N/A"},{"$error":"#N/A"},{"$f":"IFERROR(VLOOKUP(B449,Insumos!$A$4:$B$8,2,FALSE),\"\")","v":""}]
[null,{"$error":"#N/A"},{"$error":"#N/A"},{"$f":"IFERROR(VLOOKUP(B450,Insumos!$A$4:$B$8,2,FALSE),\"\")","v":""}]
[null,{"$error":"#N/A"},{"$error":"#N/A"},{"$f":"IFERROR(VLOOKUP(B451,Insumos!$A$4:$B$8,2,FALSE),\"\")","v":""}]
[null,{"$error":"#N/A"},{"$error":"#N/A"},{"$f":"IFERROR(VLOOKUP(B452,Insumos!$A$4:$B$8,2,FALSE),\"\")","v":""}]
[null,{"$error":"#N/A"},{"$error":"#N/A"},{"$f":"IFERROR(VLOOKUP(B453,Insumos!$A$4:$B$8,2,FALSE),\"\")","v":""}]
[null,{"$error":"#N/A"},{"$error":"#N/A"},{"$f":"IFERROR(VLOOKUP(B454,Insumos!$A$4:$B$8,2,FALSE),\"\")","v":""}]
[null,{"$error":"#N/A"},{"$error":"#N/A"},{"$f":"IFERROR(VLOOKUP(B455,Insumos!$A$4:$B$8,2,FALSE),\"\")","v":""}]
[null,{"$error":"#N/A"},{"$error":"#N/A"},{"$f":"IFERROR(VLOOKUP(B456,Insumos!$A$4:$B$8,2,FALSE),\"\")","v":""}]
[null,{"$error":"#N/A"},{"$error":"#N/A"},{"$f":"IFERROR(VLOOKUP(B457,Insumos!$A$4:$B$8,2,FALSE),\"\")","v":""}]
[null,{"$error":"#N/A"},{"$error":"#N/A"},{"$f":"IFERROR(VLOOKUP(B458,Insumos!$A$4:$B$8,2,FALSE),\"\")","v":""}]
[null,{"$error":"#N/A"},{"$error":"#N/A"},{"$f":"IFERROR(VLOOKUP(B459,Insumos!$A$4:$B$8,2,FALSE),\"\")","v":""}]
[null,{"$error":"#N/A"},{"$error":"#N/A"},{"$f":"IFERROR(VLOOKUP(B460,Insumos!$A$4:$B$8,2,FALSE),\"\")","v":""}]
[null,{"$error":"#N/A"},{"$error":"#N/A"},{"$f":"IFERROR(VLOOKUP(B461,Insumos!$A$4:$B$8,2,FALSE),\"\")","v":""}]
[null,{"$error":"#N/A"},{"$error":"#N/A"},{"$f":"IFERROR(VLOOKUP(B462,Insumos!$A$4:$B$8,2,FALSE),\"\")","v":""}]
[null,{"$error":"#N/A"},{"$error":"#N/A"},{"$f":"IFERROR(VLOOKUP(B463,Insumos!$A$4:$B$8,2,FALSE),\"\")","v":""}]
[null,{"$error":"#N/A"},{"$error":"#N/A"},{"$f":"IFERROR(VLOOKUP(B464,Insumos!$A$4:$B$8,2,FALSE),\"\")","v":""}]
[null,{"$error":"#N/A"},{"$error":"#N/A"},{"$f":"IFERROR(VLOOKUP(B465,Insumos!$A$4:$B$8,2,FALSE),\"\")","v":""}]
[null,{"$error":"#N/A"},{"$error":"#N/A"},{"$f":"IFERROR(VLOOKUP(B466,Insumos!$A$4:$B$8,2,FALSE),\"\")","v":""}]
[null,{"$error":"#N/A"},{"$error":"#N/A"},{"$f":"IFERROR(VLOOKUP(B467,Insumos!$A$4:$B$8,2,FALSE),\"\")","v":""}]
[null,{"$error":"#N/A"},{"$error":"#N/A"},{"$f":"IFERROR(VLOOKUP(B468,Insumos!$A$4:$B$8,2,FALSE),\"\")","v":""}]
[null,{"$error":"#N/A"},{"$error":"#N/A"},{"$f":"IFERROR(VLOOKUP(B469,Insumos!$A$4:$B$8,2,FALSE),\"\")","v":""}]
[null,{"$error":"#N/A"},{"$error":"#N/A"},{"$f":"IFERROR(VLOOKUP(B470,Insumos!$A$4:$B$8,2,FALSE),\"\")","v":""}]
[null,{"$error":"#N/A"},{"$error":"#N/A"},{"$f":"IFERROR(VLOOKUP(B471,Insumos!$A$4:$B$8,2,FALSE),\"\")","v":""}]
[null,{"$error":"#N/A"},{"$error":"#N/A"},{"$f":"IFERROR(VLOOKUP(B472,Insumos!$A$4:$B$8,2,FALSE),\"\")","v":""}]
[null,{"$error":"#N/A"},{"$error":"#N/A"},{"$f":"IFERROR(VLOOKUP(B473,Insumos!$A$4:$B$8,2,FALSE),\"\")","v":""}]
[null,{"$error":"#N/A"},{"$error":"#N/A"},{"$f":"IFERROR(VLOOKUP(B474,Insumos!$A$4:$B$8,2,FALSE),\"\")","v":""}]
[null,{"$error":"#N/A"},{"$error":"#N/A"},{"$f":"IFERROR(VLOOKUP(B475,Insumos!$A$4:$B$8,2,FALSE),\"\")","v":""}]
[null,{"$error":"#N/A"},{"$error":"#N/A"},{"$f":"IFERROR(VLOOKUP(B476,Insumos!$A$4:$B$8,2,FALSE),\"\")","v":""}]
[null,{"$error":"#N/A"},{"$error":"#N/A"},{"$f":"IFERROR(VLOOKUP(B477,Insumos!$A$4:$B$8,2,FALSE),\"\")","v":""}]
[null,{"$error":"#N/A"},{"$error":"#N/A"},{"$f":"IFERROR(VLOOKUP(B478,Insumos!$A$4:$B$8,2,FALSE),\"\")","v":""}]
[null,{"$error":"#N/A"},{"$error":"#N/A"},{"$f":"IFERROR(VLOOKUP(B479,Insumos!$A$4:$B$8,2,FALSE),\"\")","v":""}]
[null,{"$error":"#N/A"},{"$error":"#N/A"},{"$f":"IFERROR(VLOOKUP(B480,Insumos!$A$4:$B$8,2,FALSE),\"\")","v":""}]
[null,{"$error":"#N/A"},{"$error":"#N/A"},{"$f":"IFERROR(VLOOKUP(B481,Insumos!$A$4:$B$8,2,FALSE),\"\")","v":""}]
[null,{"$error":"#N/A"},{"$error":"#N/A"},{"$f":"IFERROR(VLOOKUP(B482,Insumos!$A$4:$B$8,2,FALSE),\"\")","v":""}]
[null,{"$error":"#N/A"},{"$error":"#N/A"},{"$f":"IFERROR(VLOOKUP(B483,Insumos!$A$4:$B$8,2,FALSE),\"\")","v":""}]
[null,{"$error":"#N/A"},{"$error":"#N/A"},{"$f":"IFERROR(VLOOKUP(B484,Insumos!$A$4:$B$8,2,FALSE),\"\")","v":""}]
[null,{"$error":"#N/A"},{"$error":"#N/A"},{"$f":"IFERROR(VLOOKUP(B485,Insumos!$A$4:$B$8,2,FALSE),\"\")","v":""}]
[null,{"$error":"#N/A"},{"$error":"#N/A"},{"$f":"IFERROR(VLOOKUP(B486,Insumos!$A$4:$B$8,2,FALSE),\"\")","v":""}]
[null,{"$error":"#N/A"},{"$error":"#N/A"},{"$f":"IFERROR(VLOOKUP(B487,Insumos!$A$4:$B$8,2,FALSE),\"\")","v":""}]
[null,{"$error":"#N/A"},{"$error":"#N/A"},{"$f":"IFERROR(VLOOKUP(B488,Insumos!$A$4:$B$8,2,FALSE),\"\")","v":""}]
[null,{"$error":"#N/A"},{"$error":"#N/A"},{"$f":"IFERROR(VLOOKUP(B489,Insumos!$A$4:$B$8,2,FALSE),\"\")","v":""}]
[null,{"$error":"#N/A"},{"$error":"#N/A"},{"$f":"IFERROR(VLOOKUP(B490,Insumos!$A$4:$B$8,2,FALSE),\"\")","v":""}]
[null,{"$error":"#N/A"},{"$error":"#N/A"},{"$f":"IFERROR(VLOOKUP(B491,Insumos!$A$4:$B$8,2,FALSE),\"\")","v":""}]
[null,{"$error":"#N/A"},{"$error":"#N/A"},{"$f":"IFERROR(VLOOKUP(B492,Insumos!$A$4:$B$8,2,FALSE),\"\")","v":""}]
[null,{"$error":"#N/A"},{"$error":"#N/A"},{"$f":"IFERROR(VLOOKUP(B493,Insumos!$A$4:$B$8,2,FALSE),\"\")","v":""}]
[null,{"$error":"#N/A"},{"$error":"#N/A"},{"$f":"IFERROR(VLOOKUP(B494,Insumos!$A$4:$B$8,2,FALSE),\"\")","v":""}]
[null,{"$error":"#N/A"},{"$error":"#N/A"},{"$f":"IFERROR(VLOOKUP(B495,Insumos!$A$4:$B$8,2,FALSE),\"\")","v":""}]
[null,{"$error":"#N/A"},{"$error":"#N/A"},{"$f":"IFERROR(VLOOKUP(B496,Insumos!$A$4:$B$8,2,FALSE),\"\")","v":""}]
[null,{"$error":"#N/A"},{"$error":"#N/A"},{"$f":"IFERROR(VLOOKUP(B497,Insumos!$A$4:$B$8,2,FALSE),\"\")","v":""}]
[null,{"$error":"#N/A"},{"$error":"#N/A"},{"$f":"IFERROR(VLOOKUP(B498,Insumos!$A$4:$B$8,2,FALSE),\"\")","v":""}]
[null,{"$error":"#N/A"},{"$error":"#N/A"},{"$f":"IFERROR(VLOOKUP(B499,Insumos!$A$4:$B$8,2,FALSE),\"\")","v":""}]
[null,{"$error":"#N/A"},{"$error":"#N/A"},{"$f":"IFERROR(VLOOKUP(B500,Insumos!$A$4:$B$8,2,FALSE),\"\")","v":""}]
[null,{"$error":"#N/A"},{"$error":"#N/A"},{"$f":"IFERROR(VLOOKUP(B501,Insumos!$A$4:$B$8,2,FALSE),\"\")","v":""}]
[null,{"$error":"#N/A"},{"$error":"#N/A"},{"$f":"IFERROR(VLOOKUP(B502,Insumos!$A$4:$B$8,2,FALSE),\"\")","v":""}]
[null,{"$error":"#N/A"},{"$error":"#N/A"},{"$f":"IFERROR(VLOOKUP(B503,Insumos!$A$4:$B$8,2,FALSE),\"\")","v":""}]
[null,{"$error":"#N/A"},{"$error":"#N/A"},{"$f":"IFERROR(VLOOKUP(B504,Insumos!$A$4:$B$8,2,FALSE),\"\")","v":""}]
[null,{"$error":"#N/A"},{"$error":"#N/A"},{"$f":"IFERROR(VLOOKUP(B505,Insumos!$A$4:$B$8,2,FALSE),\"\")","v":""}]
[null,{"$error":"#N/A"},{"$error":"#N/A"},{"$f":"IFERROR(VLOOKUP(B506,Insumos!$A$4:$B$8,2,FALSE),\"\")","v":""}]
[null,{"$error":"#N/A"},{"$error":"#N/A"},{"$f":"IFERROR(VLOOKUP(B507,Insumos!$A$4:$B$8,2,FALSE),\"\")","v":""}]
[null,{"$error":"#N/A"},{"$error":"#N/A"},{"$f":"IFERROR(VLOOKUP(B508,Insumos!$A$4:$B$8,2,FALSE),\"\")","v":""}]
[null,{"$error":"#N/A"},{"$error":"#N/A"},{"$f":"IFERROR(VLOOKUP(B509,Insumos!$A$4:$B$8,2,FALSE),\"\")","v":""}]
[null,{"$error":"#N/A"},{"$error":"#N/A"},{"$f":"IFERROR(VLOOKUP(B510,Insumos!$A$4:$B$8,2,FALSE),\"\")","v":""}]
[null,{"$error":"#N/A"},{"$error":"#N/A"},{"$f":"IFERROR(VLOOKUP(B511,Insumos!$A$4:$B$8,2,FALSE),\"\")","v":""}]
[null,{"$error":"#N/A"},{"$error":"#N/A"},{"$f":"IFERROR(VLOOKUP(B512,Insumos!$A$4:$B$8,2,FALSE),\"\")","v":""}]
[null,{"$error":"#N/A"},{"$error":"#N/A"},{"$f":"IFERROR(VLOOKUP(B513,Insumos!$A$4:$B$8,2,FALSE),\"\")","v":""}]
[null,{"$error":"#N/A"},{"$error":"#N/A"},{"$f":"IFERROR(VLOOKUP(B514,Insumos!$A$4:$B$8,2,FALSE),\"\")","v":""}]
[null,{"$error":"#N/A"},{"$error":"#N/A"},{"$f":"IFERROR(VLOOKUP(B515,Insumos!$A$4:$B$8,2,FALSE),\"\")","v":""}]
[null,{"$error":"#N/A"},{"$error":"#N/A"},{"$f":"IFERROR(VLOOKUP(B516,Insumos!$A$4:$B$8,2,FALSE),\"\")","v":""}]
[null,{"$error":"#N/A"},{"$error":"#N/A"},{"$f":"IFERROR(VLOOKUP(B517,Insumos!$A$4:$B$8,2,FALSE),\"\")","v":""}]
[null,{"$error":"#N/A"},{"$error":"#N/A"},{"$f":"IFERROR(VLOOKUP(B518,Insumos!$A$4:$B$8,2,FALSE),\"\")","v":""}]
[null,{"$error":"#N/A"},{"$error":"#N/A"},{"$f":"IFERROR(VLOOKUP(B519,Insumos!$A$4:$B$8,2,FALSE),\"\")","v":""}]
[null,{"$error":"#N/A"},{"$error":"#N/A"},{"$f":"IFERROR(VLOOKUP(B520,Insumos!$A$4:$B$8,2,FALSE),\"\")","v":""}]
[null,{"$error":"#N/A"},{"$error":"#N/A"},{"$f":"IFERROR(VLOOKUP(B521,Insumos!$A$4:$B$8,2,FALSE),\"\")","v":""}]
[null,{"$error":"#N/A"},{"$error":"#N/A"},{"$f":"IFERROR(VLOOKUP(B522,Insumos!$A$4:$B$8,2,FALSE),\"\")","v":""}]
[null,{"$error":"#N/A"},{"$error":"#N/A"},{"$f":"IFERROR(VLOOKUP(B523,Insumos!$A$4:$B$8,2,FALSE),\"\")","v":""}]
[null,{"$error":"#N/A"},{"$error":"#N/A"},{"$f":"IFERROR(VLOOKUP(B524,Insumos!$A$4:$B$8,2,FALSE),\"\")","v":""}]
[null,{"$error":"#N/A"},{"$error":"#N/A"},{"$f":"IFERROR(VLOOKUP(B525,Insumos!$A$4:$B$8,2,FALSE),\"\")","v":""}]
[null,{"$error":"#N/A"},{"$error":"#N/A"},{"$f":"IFERROR(VLOOKUP(B526,Insumos!$A$4:$B$8,2,FALSE),\"\")","v":""}]
[null,{"$error":"#N/A"},{"$error":"#N/A"},{"$f":"IFERROR(VLOOKUP(B527,Insumos!$A$4:$B$8,2,FALSE),\"\")","v":""}]
[null,{"$error":"#N/A"},{"$error":"#N/A"},{"$f":"IFERROR(VLOOKUP(B528,Insumos!$A$4:$B$8,2,FALSE),\"\")","v":""}]
[null,{"$error":"#N/A"},{"$error":"#N/A"},{"$f":"IFERROR(VLOOKUP(B529,Insumos!$A$4:$B$8,2,FALSE),\"\")","v":""}]
[null,{"$error":"#N/A"},{"$error":"#N/A"},{"$f":"IFERROR(VLOOKUP(B530,Insumos!$A$4:$B$8,2,FALSE),\"\")","v":""}]
[null,{"$error":"#N/A"},{"$error":"#N/A"},{"$f":"IFERROR(VLOOKUP(B531,Insumos!$A$4:$B$8,2,FALSE),\"\")","v":""}]
[null,{"$error":"#N/A"},{"$error":"#N/A"},{"$f":"IFERROR(VLOOKUP(B532,Insumos!$A$4:$B$8,2,FALSE),\"\")","v":""}]
[null,{"$error":"#N/A"},{"$error":"#N/A"},{"$f":"IFERROR(VLOOKUP(B533,Insumos!$A$4:$B$8,2,FALSE),\"\")","v":""}]
[null,{"$error":"#N/A"},{"$error":"#N/A"},{"$f":"IFERROR(VLOOKUP(B534,Insumos!$A$4:$B$8,2,FALSE),\"\")","v":""}]
[null,{"$error":"#N/A"},{"$error":"#N/A"},{"$f":"IFERROR(VLOOKUP(B535,Insumos!$A$4:$B$8,2,FALSE),\"\")","v":""}]
[null,{"$error":"#N/A"},{"$error":"#N/A"},{"$f":"IFERROR(VLOOKUP(B536,Insumos!$A$4:$B$8,2,FALSE),\"\")","v":""}]
[null,{"$error":"#N/A"},{"$error":"#N/A"},{"$f":"IFERROR(VLOOKUP(B537,Insumos!$A$4:$B$8,2,FALSE),\"\")","v":""}]
[null,{"$error":"#N/A"},{"$error":"#N/A"},{"$f":"IFERROR(VLOOKUP(B538,Insumos!$A$4:$B$8,2,FALSE),\"\")","v":""}]
[null,{"$error":"#N/A"},{"$error":"#N/A"},{"$f":"IFERROR(VLOOKUP(B539,Insumos!$A$4:$B$8,2,FALSE),\"\")","v":""}]
[null,{"$error":"#N/A"},{"$error":"#N/A"},{"$f":"IFERROR(VLOOKUP(B540,Insumos!$A$4:$B$8,2,FALSE),\"\")","v":""}]
[null,{"$error":"#N/A"},{"$error":"#N/A"},{"$f":"IFERROR(VLOOKUP(B541,Insumos!$A$4:$B$8,2,FALSE),\"\")","v":""}]
[null,{"$error":"#N/A"},{"$error":"#N/A"},{"$f":"IFERROR(VLOOKUP(B542,Insumos!$A$4:$B$8,2,FALSE),\"\")","v":""}]
[null,{"$error":"#N/A"},{"$error":"#N/A"},{"$f":"IFERROR(VLOOKUP(B543,Insumos!$A$4:$B$8,2,FALSE),\"\")","v":""}]
[null,{"$error":"#N/A"},{"$error":"#N/A"},{"$f":"IFERROR(VLOOKUP(B544,Insumos!$A$4:$B$8,2,FALSE),\"\")","v":""}]
[null,{"$error":"#N/A"},{"$error":"#N/A"},{"$f":"IFERROR(VLOOKUP(B545,Insumos!$A$4:$B$8,2,FALSE),\"\")","v":""}]
[null,{"$error":"#N/A"},{"$error":"#N/A"},{"$f":"IFERROR(VLOOKUP(B546,Insumos!$A$4:$B$8,2,FALSE),\"\")","v":""}]
[null,{"$error":"#N/A"},{"$error":"#N/A"},{"$f":"IFERROR(VLOOKUP(B547,Insumos!$A$4:$B$8,2,FALSE),\"\")","v":""}]
[null,{"$error":"#N/A"},{"$error":"#N/A"},{"$f":"IFERROR(VLOOKUP(B548,Insumos!$A$4:$B$8,2,FALSE),\"\")","v":""}]
[null,{"$error":"#N/A"},{"$error":"#N/A"},{"$f":"IFERROR(VLOOKUP(B549,Insumos!$A$4:$B$8,2,FALSE),\"\")","v":""}]
[null,{"$error":"#N/A"},{"$error":"#N/A"},{"$f":"IFERROR(VLOOKUP(B550,Insumos!$A$4:$B$8,2,FALSE),\"\")","v":""}]
[null,{"$error":"#N/A"},{"$error":"#N/A"},{"$f":"IFERROR(VLOOKUP(B551,Insumos!$A$4:$B$8,2,FALSE),\"\")","v":""}]
[null,{"$error":"#N/A"},{"$error":"#N/A"},{"$f":"IFERROR(VLOOKUP(B552,Insumos!$A$4:$B$8,2,FALSE),\"\")","v":""}]
[null,{"$error":"#N/A"},{"$error":"#N/A"},{"$f":"IFERROR(VLOOKUP(B553,Insumos!$A$4:$B$8,2,FALSE),\"\")","v":""}]
[null,{"$error":"#N/A"},{"$error":"#N/A"},{"$f":"IFERROR(VLOOKUP(B554,Insumos!$A$4:$B$8,2,FALSE),\"\")","v":""}]
[null,{"$error":"#N/A"},{"$error":"#N/A"},{"$f":"IFERROR(VLOOKUP(B555,Insumos!$A$4:$B$8,2,FALSE),\"\")","v":""}]
[null,{"$error":"#N/A"},{"$error":"#N/A"},{"$f":"IFERROR(VLOOKUP(B556,Insumos!$A$4:$B$8,2,FALSE),\"\")","v":""}]
[null,{"$error":"#N/A"},{"$error":"#N/A"},{"$f":"IFERROR(VLOOKUP(B557,Insumos!$A$4:$B$8,2,FALSE),\"\")","v":""}]
[null,{"$error":"#N/A"},{"$error":"#N/A"},{"$f":"IFERROR(VLOOKUP(B558,Insumos!$A$4:$B$8,2,FALSE),\"\")","v":""}]
[null,{"$error":"#N/A"},{"$error":"#N/A"},{"$f":"IFERROR(VLOOKUP(B559,Insumos!$A$4:$B$8,2,FALSE),\"\")","v":""}]
[null,{"$error":"#N/A"},{"$error":"#N/A"},{"$f":"IFERROR(VLOOKUP(B560,Insumos!$A$4:$B$8,2,FALSE),\"\")","v":""}]
[null,{"$error":"#N/A"},{"$error":"#N/A"},{"$f":"IFERROR(VLOOKUP(B561,Insumos!$A$4:$B$8,2,FALSE),\"\")","v":""}]
[null,{"$error":"#N/A"},{"$error":"#N/A"},{"$f":"IFERROR(VLOOKUP(B562,Insumos!$A$4:$B$8,2,FALSE),\"\")","v":""}]
[null,{"$error":"#N/A"},{"$error":"#N/A"},{"$f":"IFERROR(VLOOKUP(B563,Insumos!$A$4:$B$8,2,FALSE),\"\")","v":""}]
[null,{"$error":"#N/A"},{"$error":"#N/A"},{"$f":"IFERROR(VLOOKUP(B564,Insumos!$A$4:$B$8,2,FALSE),\"\")","v":""}]
[null,{"$error":"#N/A"},{"$error":"#N/A"},{"$f":"IFERROR(VLOOKUP(B565,Insumos!$A$4:$B$8,2,FALSE),\"\")","v":""}]
[null,{"$error":"#N/A"},{"$error":"#N/A"},{"$f":"IFERROR(VLOOKUP(B566,Insumos!$A$4:$B$8,2,FALSE),\"\")","v":""}]
[null,{"$error":"#N/A"},{"$error":"#N/A"},{"$f":"IFERROR(VLOOKUP(B567,Insumos!$A$4:$B$8,2,FALSE),\"\")","v":""}]
[null,{"$error":"#N/A"},{"$error":"#N/A"},{"$f":"IFERROR(VLOOKUP(B568,Insumos!$A$4:$B$8,2,FALSE),\"\")","v":""}]
[null,{"$error":"#N/A"},{"$error":"#N/A"},{"$f":"IFERROR(VLOOKUP(B569,Insumos!$A$4:$B$8,2,FALSE),\"\")","v":""}]
[null,{"$error":"#N/A"},{"$error":"#N/A"},{"$f":"IFERROR(VLOOKUP(B570,Insumos!$A$4:$B$8,2,FALSE),\"\")","v":""}]
[null,{"$error":"#N/A"},{"$error":"#N/A"},{"$f":"IFERROR(VLOOKUP(B571,Insumos!$A$4:$B$8,2,FALSE),\"\")","v":""}]
[null,{"$error":"#N/A"},{"$error":"#N/A"},{"$f":"IFERROR(VLOOKUP(B572,Insumos!$A$4:$B$8,2,FALSE),\"\")","v":""}]
[null,{"$error":"#N/A"},{"$error":"#N/A"},{"$f":"IFERROR(VLOOKUP(B573,Insumos!$A$4:$B$8,2,FALSE),\"\")","v":""}]
[null,{"$error":"#N/A"},{"$error":"#N/A"},{"$f":"IFERROR(VLOOKUP(B574,Insumos!$A$4:$B$8,2,FALSE),\"\")","v":""}]
[null,{"$error":"#N/A"},{"$error":"#N/A"},{"$f":"IFERROR(VLOOKUP(B575,Insumos!$A$4:$B$8,2,FALSE),\"\")","v":""}]
[null,{"$error":"#N/A"},{"$error":"#N/A"},{"$f":"IFERROR(VLOOKUP(B576,Insumos!$A$4:$B$8,2,FALSE),\"\")","v":""}]
[null,{"$error":"#N/A"},{"$error":"#N/A"},{"$f":"IFERROR(VLOOKUP(B577,Insumos!$A$4:$B$8,2,FALSE),\"\")","v":""}]
[null,{"$error":"#N/A"},{"$error":"#N/A"},{"$f":"IFERROR(VLOOKUP(B578,Insumos!$A$4:$B$8,2,FALSE),\"\")","v":""}]
[null,{"$error":"#N/A"},{"$error":"#N/A"},{"$f":"IFERROR(VLOOKUP(B579,Insumos!$A$4:$B$8,2,FALSE),\"\")","v":""}]
[null,{"$error":"#N/A"},{"$error":"#N/A"},{"$f":"IFERROR(VLOOKUP(B580,Insumos!$A$4:$B$8,2,FALSE),\"\")","v":""}]
[null,{"$error":"#N/A"},{"$error":"#N/A"},{"$f":"IFERROR(VLOOKUP(B581,Insumos!$A$4:$B$8,2,FALSE),\"\")","v":""}]
[null,{"$error":"#N/A"},{"$error":"#N/A"},{"$f":"IFERROR(VLOOKUP(B582,Insumos!$A$4:$B$8,2,FALSE),\"\")","v":""}]
[null,{"$error":"#N/A"},{"$error":"#N/A"},{"$f":"IFERROR(VLOOKUP(B583,Insumos!$A$4:$B$8,2,FALSE),\"\")","v":""}]
[null,{"$error":"#N/A"},{"$error":"#N/A"},{"$f":"IFERROR(VLOOKUP(B584,Insumos!$A$4:$B$8,2,FALSE),\"\")","v":""}]
[null,{"$error":"#N/A"},{"$error":"#N/A"},{"$f":"IFERROR(VLOOKUP(B585,Insumos!$A$4:$B$8,2,FALSE),\"\")","v":""}]
[null,{"$error":"#N/A"},{"$error":"#N/A"},{"$f":"IFERROR(VLOOKUP(B586,Insumos!$A$4:$B$8,2,FALSE),\"\")","v":""}]
[null,{"$error":"#N/A"},{"$error":"#N/A"},{"$f":"IFERROR(VLOOKUP(B587,Insumos!$A$4:$B$8,2,FALSE),\"\")","v":""}]
[null,{"$error":"#N/A"},{"$error":"#N/A"},{"$f":"IFERROR(VLOOKUP(B588,Insumos!$A$4:$B$8,2,FALSE),\"\")","v":""}]
[null,{"$error":"#N/A"},{"$error":"#N/A"},{"$f":"IFERROR(VLOOKUP(B589,Insumos!$A$4:$B$8,2,FALSE),\"\")","v":""}]
[null,{"$error":"#N/A"},{"$error":"#N/A"},{"$f":"IFERROR(VLOOKUP(B590,Insumos!$A$4:$B$8,2,FALSE),\"\")","v":""}]
[null,{"$error":"#N/A"},{"$error":"#N/A"},{"$f":"IFERROR(VLOOKUP(B591,Insumos!$A$4:$B$8,2,FALSE),\"\")","v":""}]
[null,{"$error":"#N/A"},{"$error":"#N/A"},{"$f":"IFERROR(VLOOKUP(B592,Insumos!$A$4:$B$8,2,FALSE),\"\")","v":""}]
[null,{"$error":"#N/A"},{"$error":"#N/A"},{"$f":"IFERROR(VLOOKUP(B593,Insumos!$A$4:$B$8,2,FALSE),\"\")","v":""}]
[null,{"$error":"#N/A"},{"$error":"#N/A"},{"$f":"IFERROR(VLOOKUP(B594,Insumos!$A$4:$B$8,2,FALSE),\"\")","v":""}]
[null,{"$error":"#N/A"},{"$error":"#N/A"},{"$f":"IFERROR(VLOOKUP(B595,Insumos!$A$4:$B$8,2,FALSE),\"\")","v":""}]
[null,{"$error":"#N/A"},{"$error":"#N/A"},{"$f":"IFERROR(VLOOKUP(B596,Insumos!$A$4:$B$8,2,FALSE),\"\")","v":""}]
[null,{"$error":"#N/A"},{"$error":"#N/A"},{"$f":"IFERROR(VLOOKUP(B597,Insumos!$A$4:$B$8,2,FALSE),\"\")","v":""}]
[null,{"$error":"#N/A"},{"$error":"#N/A"},{"$f":"IFERROR(VLOOKUP(B598,Insumos!$A$4:$B$8,2,FALSE),\"\")","v":""}]
[null,{"$error":"#N/A"},{"$error":"#N/A"},{"$f":"IFERROR(VLOOKUP(B599,Insumos!$A$4:$B$8,2,FALSE),\"\")","v":""}]
[null,{"$error":"#N/A"},{"$error":"#N/A"},{"$f":"IFERROR(VLOOKUP(B600,Insumos!$A$4:$B$8,2,FALSE),\"\")","v":""}]
[null,{"$error":"#N/A"},{"$error":"#N/A"},{"$f":"IFERROR(VLOOKUP(B601,Insumos!$A$4:$B$8,2,FALSE),\"\")","v":""}]
[null,{"$error":"#N/A"},{"$error":"#N/A"},{"$f":"IFERROR(VLOOKUP(B602,Insumos!$A$4:$B$8,2,FALSE),\"\")","v":""}]
[null,{"$error":"#N/A"},{"$error":"#N/A"},{"$f":"IFERROR(VLOOKUP(B603,Insumos!$A$4:$B$8,2,FALSE),\"\")","v":""}]
[null,{"$error":"#N/A"},{"$error":"#N/A"},{"$f":"IFERROR(VLOOKUP(B604,Insumos!$A$4:$B$8,2,FALSE),\"\")","v":""}]
[null,{"$error":"#N/A"},{"$error":"#N/A"},{"$f":"IFERROR(VLOOKUP(B605,Insumos!$A$4:$B$8,2,FALSE),\"\")","v":""}]
[null,{"$error":"#N/A"},{"$error":"#N/A"},{"$f":"IFERROR(VLOOKUP(B606,Insumos!$A$4:$B$8,2,FALSE),\"\")","v":""}]
[null,{"$error":"#N/A"},{"$error":"#N/A"},{"$f":"IFERROR(VLOOKUP(B607,Insumos!$A$4:$B$8,2,FALSE),\"\")","v":""}]
[null,{"$error":"#N/A"},{"$error":"#N/A"},{"$f":"IFERROR(VLOOKUP(B608,Insumos!$A$4:$B$8,2,FALSE),\"\")","v":""}]
[null,{"$error":"#N/A"},{"$error":"#N/A"},{"$f":"IFERROR(VLOOKUP(B609,Insumos!$A$4:$B$8,2,FALSE),\"\")","v":""}]
[null,{"$error":"#N/A"},{"$error":"#N/A"},{"$f":"IFERROR(VLOOKUP(B610,Insumos!$A$4:$B$8,2,FALSE),\"\")","v":""}]
[null,{"$error":"#N/A"},{"$error":"#N/A"},{"$f":"IFERROR(VLOOKUP(B611,Insumos!$A$4:$B$8,2,FALSE),\"\")","v":""}]
[null,{"$error":"#N/A"},{"$error":"#N/A"},{"$f":"IFERROR(VLOOKUP(B612,Insumos!$A$4:$B$8,2,FALSE),\"\")","v":""}]
[null,{"$error":"#N/A"},{"$error":"#N/A"},{"$f":"IFERROR(VLOOKUP(B613,Insumos!$A$4:$B$8,2,FALSE),\"\")","v":""}]
[null,{"$error":"#N/A"},{"$error":"#N/A"},{"$f":"IFERROR(VLOOKUP(B614,Insumos!$A$4:$B$8,2,FALSE),\"\")","v":""}]
[null,{"$error":"#N/A"},{"$error":"#N/A"},{"$f":"IFERROR(VLOOKUP(B615,Insumos!$A$4:$B$8,2,FALSE),\"\")","v":""}]
[null,{"$error":"#N/A"},{"$error":"#N/A"},{"$f":"IFERROR(VLOOKUP(B616,Insumos!$A$4:$B$8,2,FALSE),\"\")","v":""}]
[null,{"$error":"#N/A"},{"$error":"#N/A"},{"$f":"IFERROR(VLOOKUP(B617,Insumos!$A$4:$B$8,2,FALSE),\"\")","v":""}]
[null,{"$error":"#N/A"},{"$error":"#N/A"},{"$f":"IFERROR(VLOOKUP(B618,Insumos!$A$4:$B$8,2,FALSE),\"\")","v":""}]
[null,{"$error":"#N/A"},{"$error":"#N/A"},{"$f":"IFERROR(VLOOKUP(B619,Insumos!$A$4:$B$8,2,FALSE),\"\")","v":""}]
[null,{"$error":"#N/A"},{"$error":"#N/A"},{"$f":"IFERROR(VLOOKUP(B620,Insumos!$A$4:$B$8,2,FALSE),\"\")","v":""}]
[null,{"$error":"#N/A"},{"$error":"#N/A"},{"$f":"IFERROR(VLOOKUP(B621,Insumos!$A$4:$B$8,2,FALSE),\"\")","v":""}]
[null,{"$error":"#N/A"},{"$error":"#N/A"},{"$f":"IFERROR(VLOOKUP(B622,Insumos!$A$4:$B$8,2,FALSE),\"\")","v":""}]
[null,{"$error":"#N/A"},{"$error":"#N/A"},{"$f":"IFERROR(VLOOKUP(B623,Insumos!$A$4:$B$8,2,FALSE),\"\")","v":""}]
[null,{"$error":"#N/A"},{"$error":"#N/A"},{"$f":"IFERROR(VLOOKUP(B624,Insumos!$A$4:$B$8,2,FALSE),\"\")","v":""}]
[null,{"$error":"#N/A"},{"$error":"#N/A"},{"$f":"IFERROR(VLOOKUP(B625,Insumos!$A$4:$B$8,2,FALSE),\"\")","v":""}]
[null,{"$error":"#N/A"},{"$error":"#N/A"},{"$f":"IFERROR(VLOOKUP(B626,Insumos!$A$4:$B$8,2,FALSE),\"\")","v":""}]
[null,{"$error":"#N/A"},{"$error":"#N/A"},{"$f":"IFERROR(VLOOKUP(B627,Insumos!$A$4:$B$8,2,FALSE),\"\")","v":""}]
[null,{"$error":"#N/A"},{"$error":"#N/A"},{"$f":"IFERROR(VLOOKUP(B628,Insumos!$A$4:$B$8,2,FALSE),\"\")","v":""}]
[null,{"$error":"#N/A"},{"$error":"#N/A"},{"$f":"IFERROR(VLOOKUP(B629,Insumos!$A$4:$B$8,2,FALSE),\"\")","v":""}]
[null,{"$error":"#N/A"},{"$error":"#N/A"},{"$f":"IFERROR(VLOOKUP(B630,Insumos!$A$4:$B$8,2,FALSE),\"\")","v":""}]
[null,{"$error":"#N/A"},{"$error":"#N/A"},{"$f":"IFERROR(VLOOKUP(B631,Insumos!$A$4:$B$8,2,FALSE),\"\")","v":""}]
[null,{"$error":"#N/A"},{"$error":"#N/A"},{"$f":"IFERROR(VLOOKUP(B632,Insumos!$A$4:$B$8,2,FALSE),\"\")","v":""}]
[null,{"$error":"#N/A"},{"$error":"#N/A"},{"$f":"IFERROR(VLOOKUP(B633,Insumos!$A$4:$B$8,2,FALSE),\"\")","v":""}]
[null,{"$error":"#N/A"},{"$error":"#N/A"},{"$f":"IFERROR(VLOOKUP(B634,Insumos!$A$4:$B$8,2,FALSE),\"\")","v":""}]
[null,{"$error":"#N/A"},{"$error":"#N/A"},{"$f":"IFERROR(VLOOKUP(B635,Insumos!$A$4:$B$8,2,FALSE),\"\")","v":""}]
[null,{"$error":"#N/A"},{"$error":"#N/A"},{"$f":"IFERROR(VLOOKUP(B636,Insumos!$A$4:$B$8,2,FALSE),\"\")","v":""}]
[null,{"$error":"#N/A"},{"$error":"#N/A"},{"$f":"IFERROR(VLOOKUP(B637,Insumos!$A$4:$B$8,2,FALSE),\"\")","v":""}]
[null,{"$error":"#N/A"},{"$error":"#N/A"},{"$f":"IFERROR(VLOOKUP(B638,Insumos!$A$4:$B$8,2,FALSE),\"\")","v":""}]
[null,{"$error":"#N/A"},{"$error":"#N/A"},{"$f":"IFERROR(VLOOKUP(B639,Insumos!$A$4:$B$8,2,FALSE),\"\")","v":""}]
[null,{"$error":"#N/A"},{"$error":"#N/A"},{"$f":"IFERROR(VLOOKUP(B640,Insumos!$A$4:$B$8,2,FALSE),\"\")","v":""}]
[null,{"$error":"#N/A"},{"$error":"#N/A"},{"$f":"IFERROR(VLOOKUP(B641,Insumos!$A$4:$B$8,2,FALSE),\"\")","v":""}]
[null,{"$error":"#N/A"},{"$error":"#N/A"},{"$f":"IFERROR(VLOOKUP(B642,Insumos!$A$4:$B$8,2,FALSE),\"\")","v":""}]
[null,{"$error":"#N/A"},{"$error":"#N/A"},{"$f":"IFERROR(VLOOKUP(B643,Insumos!$A$4:$B$8,2,FALSE),\"\")","v":""}]
[null,{"$error":"#N/A"},{"$error":"#N/A"},{"$f":"IFERROR(VLOOKUP(B644,Insumos!$A$4:$B$8,2,FALSE),\"\")","v":""}]
[null,{"$error":"#N/A"},{"$error":"#N/A"},{"$f":"IFERROR(VLOOKUP(B645,Insumos!$A$4:$B$8,2,FALSE),\"\")","v":""}]
[null,{"$error":"#N/A"},{"$error":"#N/A"},{"$f":"IFERROR(VLOOKUP(B646,Insumos!$A$4:$B$8,2,FALSE),\"\")","v":""}]
[null,{"$error":"#N/A"},{"$error":"#N/A"},{"$f":"IFERROR(VLOOKUP(B647,Insumos!$A$4:$B$8,2,FALSE),\"\")","v":""}]
[null,{"$error":"#N/A"},{"$error":"#N/A"},{"$f":"IFERROR(VLOOKUP(B648,Insumos!$A$4:$B$8,2,FALSE),\"\")","v":""}]
[null,{"$error":"#N/A"},{"$error":"#N/A"},{"$f":"IFERROR(VLOOKUP(B649,Insumos!$A$4:$B$8,2,FALSE),\"\")","v":""}]
[null,{"$error":"#N/A"},{"$error":"#N/A"},{"$f":"IFERROR(VLOOKUP(B650,Insumos!$A$4:$B$8,2,FALSE),\"\")","v":""}]
[null,{"$error":"#N/A"},{"$error":"#N/A"},{"$f":"IFERROR(VLOOKUP(B651,Insumos!$A$4:$B$8,2,FALSE),\"\")","v":""}]
[null,{"$error":"#N/A"},{"$error":"#N/A"},{"$f":"IFERROR(VLOOKUP(B652,Insumos!$A$4:$B$8,2,FALSE),\"\")","v":""}]
[null,{"$error":"#N/A"},{"$error":"#N/A"},{"$f":"IFERROR(VLOOKUP(B653,Insumos!$A$4:$B$8,2,FALSE),\"\")","v":""}]
[null,{"$error":"#N/A"},{"$error":"#N/A"},{"$f":"IFERROR(VLOOKUP(B654,Insumos!$A$4:$B$8,2,FALSE),\"\")","v":""}]
[null,{"$error":"#N/A"},{"$error":"#N/A"},{"$f":"IFERROR(VLOOKUP(B655,Insumos!$A$4:$B$8,2,FALSE),\"\")","v":""}]
[null,{"$error":"#N/A"},{"$error":"#N/A"},{"$f":"IFERROR(VLOOKUP(B656,Insumos!$A$4:$B$8,2,FALSE),\"\")","v":""}]
[null,{"$error":"#N/A"},{"$error":"#N/A"},{"$f":"IFERROR(VLOOKUP(B657,Insumos!$A$4:$B$8,2,FALSE),\"\")","v":""}]
[null,{"$error":"#N/A"},{"$error":"#N/A"},{"$f":"IFERROR(VLOOKUP(B658,Insumos!$A$4:$B$8,2,FALSE),\"\")","v":""}]
[null,{"$error":"#N/A"},{"$error":"#N/A"},{"$f":"IFERROR(VLOOKUP(B659,Insumos!$A$4:$B$8,2,FALSE),\"\")","v":""}]
[null,{"$error":"#N/A"},{"$error":"#N/A"},{"$f":"IFERROR(VLOOKUP(B660,Insumos!$A$4:$B$8,2,FALSE),\"\")","v":""}]
[null,{"$error":"#N/A"},{"$error":"#N/A"},{"$f":"IFERROR(VLOOKUP(B661,Insumos!$A$4:$B$8,2,FALSE),\"\")","v":""}]
[null,{"$error":"#N/A"},{"$error":"#N/A"},{"$f":"IFERROR(VLOOKUP(B662,Insumos!$A$4:$B$8,2,FALSE),\"\")","v":""}]
[null,{"$error":"#N/A"},{"$error":"#N/A"},{"$f":"IFERROR(VLOOKUP(B663,Insumos!$A$4:$B$8,2,FALSE),\"\")","v":""}]
[null,{"$error":"#N/A"},{"$error":"#N/A"},{"$f":"IFERROR(VLOOKUP(B664,Insumos!$A$4:$B$8,2,FALSE),\"\")","v":""}]
[null,{"$error":"#N/A"},{"$error":"#N/A"},{"$f":"IFERROR(VLOOKUP(B665,Insumos!$A$4:$B$8,2,FALSE),\"\")","v":""}]
[null,{"$error":"#N/A"},{"$error":"#N/A"},{"$f":"IFERROR(VLOOKUP(B666,Insumos!$A$4:$B$8,2,FALSE),\"\")","v":""}]
[null,{"$error":"#N/A"},{"$error":"#N/A"},{"$f":"IFERROR(VLOOKUP(B667,Insumos!$A$4:$B$8,2,FALSE),\"\")","v":""}]
[null,{"$error":"#N/A"},{"$error":"#N/A"},{"$f":"IFERROR(VLOOKUP(B668,Insumos!$A$4:$B$8,2,FALSE),\"\")","v":""}]
[null,{"$error":"#N/A"},{"$error":"#N/A"},{"$f":"IFERROR(VLOOKUP(B669,Insumos!$A$4:$B$8,2,FALSE),\"\")","v":""}]
[null,{"$error":"#N/A"},{"$error":"#N/A"},{"$f":"IFERROR(VLOOKUP(B670,Insumos!$A$4:$B$8,2,FALSE),\"\")","v":""}]
[null,{"$error":"#N/A"},{"$error":"#N/A"},{"$f":"IFERROR(VLOOKUP(B671,Insumos!$A$4:$B$8,2,FALSE),\"\")","v":""}]
[null,{"$error":"#N/A"},{"$error":"#N/A"},{"$f":"IFERROR(VLOOKUP(B672,Insumos!$A$4:$B$8,2,FALSE),\"\")","v":""}]
[null,{"$error":"#N/A"},{"$error":"#N/A"},{"$f":"IFERROR(VLOOKUP(B673,Insumos!$A$4:$B$8,2,FALSE),\"\")","v":""}]
[null,{"$error":"#N/A"},{"$error":"#N/A"},{"$f":"IFERROR(VLOOKUP(B674,Insumos!$A$4:$B$8,2,FALSE),\"\")","v":""}]
[null,{"$error":"#N/A"},{"$error":"#N/A"},{"$f":"IFERROR(VLOOKUP(B675,Insumos!$A$4:$B$8,2,FALSE),\"\")","v":""}]
[null,{"$error":"#N/A"},{"$error":"#N/A"},{"$f":"IFERROR(VLOOKUP(B676,Insumos!$A$4:$B$8,2,FALSE),\"\")","v":""}]
[null,{"$error":"#N/A"},{"$error":"#N/A"},{"$f":"IFERROR(VLOOKUP(B677,Insumos!$A$4:$B$8,2,FALSE),\"\")","v":""}]
[null,{"$error":"#N/A"},{"$error":"#N/A"},{"$f":"IFERROR(VLOOKUP(B678,Insumos!$A$4:$B$8,2,FALSE),\"\")","v":""}]
[null,{"$error":"#N/A"},{"$error":"#N/A"},{"$f":"IFERROR(VLOOKUP(B679,Insumos!$A$4:$B$8,2,FALSE),\"\")","v":""}]
[null,{"$error":"#N/A"},{"$error":"#N/A"},{"$f":"IFERROR(VLOOKUP(B680,Insumos!$A$4:$B$8,2,FALSE),\"\")","v":""}]
[null,{"$error":"#N/A"},{"$error":"#N/A"},{"$f":"IFERROR(VLOOKUP(B681,Insumos!$A$4:$B$8,2,FALSE),\"\")","v":""}]
[null,{"$error":"#N/A"},{"$error":"#N/A"},{"$f":"IFERROR(VLOOKUP(B682,Insumos!$A$4:$B$8,2,FALSE),\"\")","v":""}]
[null,{"$error":"#N/A"},{"$error":"#N/A"},{"$f":"IFERROR(VLOOKUP(B683,Insumos!$A$4:$B$8,2,FALSE),\"\")","v":""}]
[null,{"$error":"#N/A"},{"$error":"#N/A"},{"$f":"IFERROR(VLOOKUP(B684,Insumos!$A$4:$B$8,2,FALSE),\"\")","v":""}]
[null,{"$error":"#N/A"},{"$error":"#N/A"},{"$f":"IFERROR(VLOOKUP(B685,Insumos!$A$4:$B$8,2,FALSE),\"\")","v":""}]
[null,{"$error":"#N/A"},{"$error":"#N/A"},{"$f":"IFERROR(VLOOKUP(B686,Insumos!$A$4:$B$8,2,FALSE),\"\")","v":""}]
[null,{"$error":"#N/A"},{"$error":"#N/A"},{"$f":"IFERROR(VLOOKUP(B687,Insumos!$A$4:$B$8,2,FALSE),\"\")","v":""}]
[null,{"$error":"#N/A"},{"$error":"#N/A"},{"$f":"IFERROR(VLOOKUP(B688,Insumos!$A$4:$B$8,2,FALSE),\"\")","v":""}]
[null,{"$error":"#N/A"},{"$error":"#N/A"},{"$f":"IFERROR(VLOOKUP(B689,Insumos!$A$4:$B$8,2,FALSE),\"\")","v":""}]
[null,{"$error":"#N/A"},{"$error":"#N/A"},{"$f":"IFERROR(VLOOKUP(B690,Insumos!$A$4:$B$8,2,FALSE),\"\")","v":""}]
[null,{"$error":"#N/A"},{"$error":"#N/A"},{"$f":"IFERROR(VLOOKUP(B691,Insumos!$A$4:$B$8,2,FALSE),\"\")","v":""}]
[null,{"$error":"#N/A"},{"$error":"#N/A"},{"$f":"IFERROR(VLOOKUP(B692,Insumos!$A$4:$B$8,2,FALSE),\"\")","v":""}]
[null,{"$error":"#N/A"},{"$error":"#N/A"},{"$f":"IFERROR(VLOOKUP(B693,Insumos!$A$4:$B$8,2,FALSE),\"\")","v":""}]
[null,{"$error":"#N/A"},{"$error":"#N/A"},{"$f":"IFERROR(VLOOKUP(B694,Insumos!$A$4:$B$8,2,FALSE),\"\")","v":""}]
[null,{"$error":"#N/A"},{"$error":"#N/A"},{"$f":"IFERROR(VLOOKUP(B695,Insumos!$A$4:$B$8,2,FALSE),\"\")","v":""}]
[null,{"$error":"#N/A"},{"$error":"#N/A"},{"$f":"IFERROR(VLOOKUP(B696,Insumos!$A$4:$B$8,2,FALSE),\"\")","v":""}]
[null,{"$error":"#N/A"},{"$error":"#N/A"},{"$f":"IFERROR(VLOOKUP(B697,Insumos!$A$4:$B$8,2,FALSE),\"\")","v":""}]
[null,{"$error":"#N/A"},{"$error":"#N/A"},{"$f":"IFERROR(VLOOKUP(B698,Insumos!$A$4:$B$8,2,FALSE),\"\")","v":""}]
[null,{"$error":"#N/A"},{"$error":"#N/A"},{"$f":"IFERROR(VLOOKUP(B699,Insumos!$A$4:$B$8,2,FALSE),\"\")","v":""}]
[null,{"$error":"#N/A"},{"$error":"#N/A"},{"$f":"IFERROR(VLOOKUP(B700,Insumos!$A$4:$B$8,2,FALSE),\"\")","v":""}]
[null,{"$error":"#N/A"},{"$error":"#N/A"},{"$f":"IFERROR(VLOOKUP(B701,Insumos!$A$4:$B$8,2,FALSE),\"\")","v":""}]
[null,{"$error":"#N/A"},{"$error":"#N/A"},{"$f":"IFERROR(VLOOKUP(B702,Insumos!$A$4:$B$8,2,FALSE),\"\")","v":""}]
[null,{"$error":"#N/A"},{"$error":"#N/A"},{"$f":"IFERROR(VLOOKUP(B703,Insumos!$A$4:$B$8,2,FALSE),\"\")","v":""}]
[null,{"$error":"#N/A"},{"$error":"#N/A"},{"$f":"IFERROR(VLOOKUP(B704,Insumos!$A$4:$B$8,2,FALSE),\"\")","v":""}]
[null,{"$error":"#N/A"},{"$error":"#N/A"},{"$f":"IFERROR(VLOOKUP(B705,Insumos!$A$4:$B$8,2,FALSE),\"\")","v":""}]
[null,{"$error":"#N/A"},{"$error":"#N/A"},{"$f":"IFERROR(VLOOKUP(B706,Insumos!$A$4:$B$8,2,FALSE),\"\")","v":""}]
[null,{"$error":"#N/A"},{"$error":"#N/A"},{"$f":"IFERROR(VLOOKUP(B707,Insumos!$A$4:$B$8,2,FALSE),\"\")","v":""}]
[null,{"$error":"#N/A"},{"$error":"#N/A"},{"$f":"IFERROR(VLOOKUP(B708,Insumos!$A$4:$B$8,2,FALSE),\"\")","v":""}]
[null,{"$error":"#N/A"},{"$error":"#N/A"},{"$f":"IFERROR(VLOOKUP(B709,Insumos!$A$4:$B$8,2,FALSE),\"\")","v":""}]
[null,{"$error":"#N/A"},{"$error":"#N/A"},{"$f":"IFERROR(VLOOKUP(B710,Insumos!$A$4:$B$8,2,FALSE),\"\")","v":""}]
[null,{"$error":"#N/A"},{"$error":"#N/A"},{"$f":"IFERROR(VLOOKUP(B711,Insumos!$A$4:$B$8,2,FALSE),\"\")","v":""}]
[null,{"$error":"#N/A"},{"$error":"#N/A"},{"$f":"IFERROR(VLOOKUP(B712,Insumos!$A$4:$B$8,2,FALSE),\"\")","v":""}]
[null,{"$error":"#N/A"},{"$error":"#N/A"},{"$f":"IFERROR(VLOOKUP(B713,Insumos!$A$4:$B$8,2,FALSE),\"\")","v":""}]
[null,{"$error":"#N/A"},{"$error":"#N/A"},{"$f":"IFERROR(VLOOKUP(B714,Insumos!$A$4:$B$8,2,FALSE),\"\")","v":""}]
[null,{"$error":"#N/A"},{"$error":"#N/A"},{"$f":"IFERROR(VLOOKUP(B715,Insumos!$A$4:$B$8,2,FALSE),\"\")","v":""}]
[null,{"$error":"#N/A"},{"$error":"#N/A"},{"$f":"IFERROR(VLOOKUP(B716,Insumos!$A$4:$B$8,2,FALSE),\"\")","v":""}]
[null,{"$error":"#N/A"},{"$error":"#N/A"},{"$f":"IFERROR(VLOOKUP(B717,Insumos!$A$4:$B$8,2,FALSE),\"\")","v":""}]
[null,{"$error":"#N/A"},{"$error":"#N/A"},{"$f":"IFERROR(VLOOKUP(B718,Insumos!$A$4:$B$8,2,FALSE),\"\")","v":""}]
[null,{"$error":"#N/A"},{"$error":"#N/A"},{"$f":"IFERROR(VLOOKUP(B719,Insumos!$A$4:$B$8,2,FALSE),\"\")","v":""}]
[null,{"$error":"#N/A"},{"$error":"#N/A"},{"$f":"IFERROR(VLOOKUP(B720,Insumos!$A$4:$B$8,2,FALSE),\"\")","v":""}]
[null,{"$error":"#N/A"},{"$error":"#N/A"},{"$f":"IFERROR(VLOOKUP(B721,Insumos!$A$4:$B$8,2,FALSE),\"\")","v":""}]
[null,{"$error":"#N/A"},{"$error":"#N/A"},{"$f":"IFERROR(VLOOKUP(B722,Insumos!$A$4:$B$8,2,FALSE),\"\")","v":""}]
[null,{"$error":"#N/A"},{"$error":"#N/A"},{"$f":"IFERROR(VLOOKUP(B723,Insumos!$A$4:$B$8,2,FALSE),\"\")","v":""}]
[null,{"$error":"#N/A"},{"$error":"#N/A"},{"$f":"IFERROR(VLOOKUP(B724,Insumos!$A$4:$B$8,2,FALSE),\"\")","v":""}]
[null,{"$error":"#N/A"},{"$error":"#N/A"},{"$f":"IFERROR(VLOOKUP(B725,Insumos!$A$4:$B$8,2,FALSE),\"\")","v":""}]
[null,{"$error":"#N/A"},{"$error":"#N/A"},{"$f":"IFERROR(VLOOKUP(B726,Insumos!$A$4:$B$8,2,FALSE),\"\")","v":""}]
[null,{"$error":"#N/A"},{"$error":"#N/A"},{"$f":"IFERROR(VLOOKUP(B727,Insumos!$A$4:$B$8,2,FALSE),\"\")","v":""}]
[null,{"$error":"#N/A"},{"$error":"#N/A"},{"$f":"IFERROR(VLOOKUP(B728,Insumos!$A$4:$B$8,2,FALSE),\"\")","v":""}]
[null,{"$error":"#N/A"},{"$error":"#N/A"},{"$f":"IFERROR(VLOOKUP(B729,Insumos!$A$4:$B$8,2,FALSE),\"\")","v":""}]
[null,{"$error":"#N/A"},{"$error":"#N/A"},{"$f":"IFERROR(VLOOKUP(B730,Insumos!$A$4:$B$8,2,FALSE),\"\")","v":""}]
[null,{"$error":"#N/A"},{"$error":"#N/A"},{"$f":"IFERROR(VLOOKUP(B731,Insumos!$A$4:$B$8,2,FALSE),\"\")","v":""}]
[null,{"$error":"#N/A"},{"$error":"#N/A"},{"$f":"IFERROR(VLOOKUP(B732,Insumos!$A$4:$B$8,2,FALSE),\"\")","v":""}]
[null,{"$error":"#N/A"},{"$error":"#N/A"},{"$f":"IFERROR(VLOOKUP(B733,Insumos!$A$4:$B$8,2,FALSE),\"\")","v":""}]
[null,{"$error":"#N/A"},{"$error":"#N/A"},{"$f":"IFERROR(VLOOKUP(B734,Insumos!$A$4:$B$8,2,FALSE),\"\")","v":""}]
[null,{"$error":"#N/A"},{"$error":"#N/A"},{"$f":"IFERROR(VLOOKUP(B735,Insumos!$A$4:$B$8,2,FALSE),\"\")","v":""}]
[null,{"$error":"#N/A"},{"$error":"#N/A"},{"$f":"IFERROR(VLOOKUP(B736,Insumos!$A$4:$B$8,2,FALSE),\"\")","v":""}]
[null,{"$error":"#N/A"},{"$error":"#N/A"},{"$f":"IFERROR(VLOOKUP(B737,Insumos!$A$4:$B$8,2,FALSE),\"\")","v":""}]
[null,{"$error":"#N/A"},{"$error":"#N/A"},{"$f":"IFERROR(VLOOKUP(B738,Insumos!$A$4:$B$8,2,FALSE),\"\")","v":""}]
[null,{"$error":"#N/A"},{"$error":"#N/A"},{"$f":"IFERROR(VLOOKUP(B739,Insumos!$A$4:$B$8,2,FALSE),\"\")","v":""}]
[null,{"$error":"#N/A"},{"$error":"#N/A"},{"$f":"IFERROR(VLOOKUP(B740,Insumos!$A$4:$B$8,2,FALSE),\"\")","v":""}]
[null,{"$error":"#N/A"},{"$error":"#N/A"},{"$f":"IFERROR(VLOOKUP(B741,Insumos!$A$4:$B$8,2,FALSE),\"\")","v":""}]
[null,{"$error":"#N/A"},{"$error":"#N/A"},{"$f":"IFERROR(VLOOKUP(B742,Insumos!$A$4:$B$8,2,FALSE),\"\")","v":""}]
[null,{"$error":"#N/A"},{"$error":"#N/A"},{"$f":"IFERROR(VLOOKUP(B743,Insumos!$A$4:$B$8,2,FALSE),\"\")","v":""}]
[null,{"$error":"#N/A"},{"$error":"#N/A"},{"$f":"IFERROR(VLOOKUP(B744,Insumos!$A$4:$B$8,2,FALSE),\"\")","v":""}]
[null,{"$error":"#N/A"},{"$error":"#N/A"},{"$f":"IFERROR(VLOOKUP(B745,Insumos!$A$4:$B$8,2,FALSE),\"\")","v":""}]
[null,{"$error":"#N/A"},{"$error":"#N/A"},{"$f":"IFERROR(VLOOKUP(B746,Insumos!$A$4:$B$8,2,FALSE),\"\")","v":""}]
[null,{"$error":"#N/A"},{"$error":"#N/A"},{"$f":"IFERROR(VLOOKUP(B747,Insumos!$A$4:$B$8,2,FALSE),\"\")","v":""}]
[null,{"$error":"#N/A"},{"$error":"#N/A"},{"$f":"IFERROR(VLOOKUP(B748,Insumos!$A$4:$B$8,2,FALSE),\"\")","v":""}]
[null,{"$error":"#N/A"},{"$error":"#N/A"},{"$f":"IFERROR(VLOOKUP(B749,Insumos!$A$4:$B$8,2,FALSE),\"\")","v":""}]
[null,{"$error":"#N/A"},{"$error":"#N/A"},{"$f":"IFERROR(VLOOKUP(B750,Insumos!$A$4:$B$8,2,FALSE),\"\")","v":""}]
[null,{"$error":"#N/A"},{"$error":"#N/A"},{"$f":"IFERROR(VLOOKUP(B751,Insumos!$A$4:$B$8,2,FALSE),\"\")","v":""}]
[null,{"$error":"#N/A"},{"$error":"#N/A"},{"$f":"IFERROR(VLOOKUP(B752,Insumos!$A$4:$B$8,2,FALSE),\"\")","v":""}]
[null,{"$error":"#N/A"},{"$error":"#N/A"},{"$f":"IFERROR(VLOOKUP(B753,Insumos!$A$4:$B$8,2,FALSE),\"\")","v":""}]
[null,{"$error":"#N/A"},{"$error":"#N/A"},{"$f":"IFERROR(VLOOKUP(B754,Insumos!$A$4:$B$8,2,FALSE),\"\")","v":""}]
[null,{"$error":"#N/A"},{"$error":"#N/A"},{"$f":"IFERROR(VLOOKUP(B755,Insumos!$A$4:$B$8,2,FALSE),\"\")","v":""}]
[null,{"$error":"#N/A"},{"$error":"#N/A"},{"$f":"IFERROR(VLOOKUP(B756,Insumos!$A$4:$B$8,2,FALSE),\"\")","v":""}]
[null,{"$error":"#N/A"},{"$error":"#N/A"},{"$f":"IFERROR(VLOOKUP(B757,Insumos!$A$4:$B$8,2,FALSE),\"\")","v":""}]
[null,{"$error":"#N/A"},{"$error":"#N/A"},{"$f":"IFERROR(VLOOKUP(B758,Insumos!$A$4:$B$8,2,FALSE),\"\")","v":""}]
[null,{"$error":"#N/A"},{"$error":"#N/A"},{"$f":"IFERROR(VLOOKUP(B759,Insumos!$A$4:$B$8,2,FALSE),\"\")","v":""}]
[null,{"$error":"#N/A"},{"$error":"#N/A"},{"$f":"IFERROR(VLOOKUP(B760,Insumos!$A$4:$B$8,2,FALSE),\"\")","v":""}]
[null,{"$error":"#N/A"},{"$error":"#N/A"},{"$f":"IFERROR(VLOOKUP(B761,Insumos!$A$4:$B$8,2,FALSE),\"\")","v":""}]
[null,{"$error":"#N/A"},{"$error":"#N/A"},{"$f":"IFERROR(VLOOKUP(B762,Insumos!$A$4:$B$8,2,FALSE),\"\")","v":""}]
[null,{"$error":"#N/A"},{"$error":"#N/A"},{"$f":"IFERROR(VLOOKUP(B763,Insumos!$A$4:$B$8,2,FALSE),\"\")","v":""}]
[null,{"$error":"#N/A"},{"$error":"#N/A"},{"$f":"IFERROR(VLOOKUP(B764,Insumos!$A$4:$B$8,2,FALSE),\"\")","v":""}]
[null,{"$error":"#N/A"},{"$error":"#N/A"},{"$f":"IFERROR(VLOOKUP(B765,Insumos!$A$4:$B$8,2,FALSE),\"\")","v":""}]
[null,{"$error":"#N/A"},{"$error":"#N/A"},{"$f":"IFERROR(VLOOKUP(B766,Insumos!$A$4:$B$8,2,FALSE),\"\")","v":""}]
[null,{"$error":"#N/A"},{"$error":"#N/A"},{"$f":"IFERROR(VLOOKUP(B767,Insumos!$A$4:$B$8,2,FALSE),\"\")","v":""}]
[null,{"$error":"#N/A"},{"$error":"#N/A"},{"$f":"IFERROR(VLOOKUP(B768,Insumos!$A$4:$B$8,2,FALSE),\"\")","v":""}]
[null,{"$error":"#N/A"},{"$error":"#N/A"},{"$f":"IFERROR(VLOOKUP(B769,Insumos!$A$4:$B$8,2,FALSE),\"\")","v":""}]
[null,{"$error":"#N/A"},{"$error":"#N/A"},{"$f":"IFERROR(VLOOKUP(B770,Insumos!$A$4:$B$8,2,FALSE),\"\")","v":""}]
[null,{"$error":"#N/A"},{"$error":"#N/A"},{"$f":"IFERROR(VLOOKUP(B771,Insumos!$A$4:$B$8,2,FALSE),\"\")","v":""}]
[null,{"$error":"#N/A"},{"$error":"#N/A"},{"$f":"IFERROR(VLOOKUP(B772,Insumos!$A$4:$B$8,2,FALSE),\"\")","v":""}]
[null,{"$error":"#N/A"},{"$error":"#N/A"},{"$f":"IFERROR(VLOOKUP(B773,Insumos!$A$4:$B$8,2,FALSE),\"\")","v":""}]
[null,{"$error":"#N/A"},{"$error":"#N/A"},{"$f":"IFERROR(VLOOKUP(B774,Insumos!$A$4:$B$8,2,FALSE),\"\")","v":""}]
[null,{"$error":"#N/A"},{"$error":"#N/A"},{"$f":"IFERROR(VLOOKUP(B775,Insumos!$A$4:$B$8,2,FALSE),\"\")","v":""}]
[null,{"$error":"#N/A"},{"$error":"#N/A"},{"$f":"IFERROR(VLOOKUP(B776,Insumos!$A$4:$B$8,2,FALSE),\"\")","v":""}]
[null,{"$error":"#N/A"},{"$error":"#N/A"},{"$f":"IFERROR(VLOOKUP(B777,Insumos!$A$4:$B$8,2,FALSE),\"\")","v":""}]
[null,{"$error":"#N/A"},{"$error":"#N/A"},{"$f":"IFERROR(VLOOKUP(B778,Insumos!$A$4:$B$8,2,FALSE),\"\")","v":""}]
[null,{"$error":"#N/A"},{"$error":"#N/A"},{"$f":"IFERROR(VLOOKUP(B779,Insumos!$A$4:$B$8,2,FALSE),\"\")","v":""}]
[null,{"$error":"#N/A"},{"$error":"#N/A"},{"$f":"IFERROR(VLOOKUP(B780,Insumos!$A$4:$B$8,2,FALSE),\"\")","v":""}]
[null,{"$error":"#N/A"},{"$error":"#N/A"},{"$f":"IFERROR(VLOOKUP(B781,Insumos!$A$4:$B$8,2,FALSE),\"\")","v":""}]
[null,{"$error":"#N/A"},{"$error":"#N/A"},{"$f":"IFERROR(VLOOKUP(B782,Insumos!$A$4:$B$8,2,FALSE),\"\")","v":""}]
[null,{"$error":"#N/A"},{"$error":"#N/A"},{"$f":"IFERROR(VLOOKUP(B783,Insumos!$A$4:$B$8,2,FALSE),\"\")","v":""}]
[null,{"$error":"#N/A"},{"$error":"#N/A"},{"$f":"IFERROR(VLOOKUP(B784,Insumos!$A$4:$B$8,2,FALSE),\"\")","v":""}]
[null,{"$error":"#N/A"},{"$error":"#N/A"},{"$f":"IFERROR(VLOOKUP(B785,Insumos!$A$4:$B$8,2,FALSE),\"\")","v":""}]
[null,{"$error":"#N/A"},{"$error":"#N/A"},{"$f":"IFERROR(VLOOKUP(B786,Insumos!$A$4:$B$8,2,FALSE),\"\")","v":""}]
[null,{"$error":"#N/A"},{"$error":"#N/A"},{"$f":"IFERROR(VLOOKUP(B787,Insumos!$A$4:$B$8,2,FALSE),\"\")","v":""}]
[null,{"$error":"#N/A"},{"$error":"#N/A"},{"$f":"IFERROR(VLOOKUP(B788,Insumos!$A$4:$B$8,2,FALSE),\"\")","v":""}]
[null,{"$error":"#N/A"},{"$error":"#N/A"},{"$f":"IFERROR(VLOOKUP(B789,Insumos!$A$4:$B$8,2,FALSE),\"\")","v":""}]
[null,{"$error":"#N/A"},{"$error":"#N/A"},{"$f":"IFERROR(VLOOKUP(B790,Insumos!$A$4:$B$8,2,FALSE),\"\")","v":""}]
[null,{"$error":"#N/A"},{"$error":"#N/A"},{"$f":"IFERROR(VLOOKUP(B791,Insumos!$A$4:$B$8,2,FALSE),\"\")","v":""}]
[null,{"$error":"#N/A"},{"$error":"#N/A"},{"$f":"IFERROR(VLOOKUP(B792,Insumos!$A$4:$B$8,2,FALSE),\"\")","v":""}]
[null,{"$error":"#N/A"},{"$error":"#N/A"},{"$f":"IFERROR(VLOOKUP(B793,Insumos!$A$4:$B$8,2,FALSE),\"\")","v":""}]
[null,{"$error":"#N/A"},{"$error":"#N/A"},{"$f":"IFERROR(VLOOKUP(B794,Insumos!$A$4:$B$8,2,FALSE),\"\")","v":""}]
[null,{"$error":"#N/A"},{"$error":"#N/A"},{"$f":"IFERROR(VLOOKUP(B795,Insumos!$A$4:$B$8,2,FALSE),\"\")","v":""}]
[null,{"$error":"#N/A"},{"$error":"#N/A"},{"$f":"IFERROR(VLOOKUP(B796,Insumos!$A$4:$B$8,2,FALSE),\"\")","v":""}]
[null,{"$error":"#N/A"},{"$error":"#N/A"},{"$f":"IFERROR(VLOOKUP(B797,Insumos!$A$4:$B$8,2,FALSE),\"\")","v":""}]
[null,{"$error":"#N/A"},{"$error":"#N/A"},{"$f":"IFERROR(VLOOKUP(B798,Insumos!$A$4:$B$8,2,FALSE),\"\")","v":""}]
[null,{"$error":"#N/A"},{"$error":"#N/A"},{"$f":"IFERROR(VLOOKUP(B799,Insumos!$A$4:$B$8,2,FALSE),\"\")","v":""}]
[null,{"$error":"#N/A"},{"$error":"#N/A"},{"$f":"IFERROR(VLOOKUP(B800,Insumos!$A$4:$B$8,2,FALSE),\"\")","v":""}]
[null,{"$error":"#N/A"},{"$error":"#N/A"},{"$f":"IFERROR(VLOOKUP(B801,Insumos!$A$4:$B$8,2,FALSE),\"\")","v":""}]
[null,{"$error":"#N/A"},{"$error":"#N/A"},{"$f":"IFERROR(VLOOKUP(B802,Insumos!$A$4:$B$8,2,FALSE),\"\")","v":""}]
[null,{"$error":"#N/A"},{"$error":"#N/A"},{"$f":"IFERROR(VLOOKUP(B803,Insumos!$A$4:$B$8,2,FALSE),\"\")","v":""}]
[null,{"$error":"#N/A"},{"$error":"#N/A"},{"$f":"IFERROR(VLOOKUP(B804,Insumos!$A$4:$B$8,2,FALSE),\"\")","v":""}]
[null,{"$error":"#N/A"},{"$error":"#N/A"},{"$f":"IFERROR(VLOOKUP(B805,Insumos!$A$4:$B$8,2,FALSE),\"\")","v":""}]
[null,{"$error":"#N/A"},{"$error":"#N/A"},{"$f":"IFERROR(VLOOKUP(B806,Insumos!$A$4:$B$8,2,FALSE),\"\")","v":""}]
[null,{"$error":"#N/A"},{"$error":"#N/A"},{"$f":"IFERROR(VLOOKUP(B807,Insumos!$A$4:$B$8,2,FALSE),\"\")","v":""}]
[null,{"$error":"#N/A"},{"$error":"#N/A"},{"$f":"IFERROR(VLOOKUP(B808,Insumos!$A$4:$B$8,2,FALSE),\"\")","v":""}]
[null,{"$error":"#N/A"},{"$error":"#N/A"},{"$f":"IFERROR(VLOOKUP(B809,Insumos!$A$4:$B$8,2,FALSE),\"\")","v":""}]
[null,{"$error":"#N/A"},{"$error":"#N/A"},{"$f":"IFERROR(VLOOKUP(B810,Insumos!$A$4:$B$8,2,FALSE),\"\")","v":""}]
[null,{"$error":"#N/A"},{"$error":"#N/A"},{"$f":"IFERROR(VLOOKUP(B811,Insumos!$A$4:$B$8,2,FALSE),\"\")","v":""}]
[null,{"$error":"#N/A"},{"$error":"#N/A"},{"$f":"IFERROR(VLOOKUP(B812,Insumos!$A$4:$B$8,2,FALSE),\"\")","v":""}]
[null,{"$error":"#N/A"},{"$error":"#N/A"},{"$f":"IFERROR(VLOOKUP(B813,Insumos!$A$4:$B$8,2,FALSE),\"\")","v":""}]
[null,{"$error":"#N/A"},{"$error":"#N/A"},{"$f":"IFERROR(VLOOKUP(B814,Insumos!$A$4:$B$8,2,FALSE),\"\")","v":""}]
[null,{"$error":"#N/A"},{"$error":"#N/A"},{"$f":"IFERROR(VLOOKUP(B815,Insumos!$A$4:$B$8,2,FALSE),\"\")","v":""}]
[null,{"$error":"#N/A"},{"$error":"#N/A"},{"$f":"IFERROR(VLOOKUP(B816,Insumos!$A$4:$B$8,2,FALSE),\"\")","v":""}]
[null,{"$error":"#N/A"},{"$error":"#N/A"},{"$f":"IFERROR(VLOOKUP(B817,Insumos!$A$4:$B$8,2,FALSE),\"\")","v":""}]
[null,{"$error":"#N/A"},{"$error":"#N/A"},{"$f":"IFERROR(VLOOKUP(B818,Insumos!$A$4:$B$8,2,FALSE),\"\")","v":""}]
[null,{"$error":"#N/A"},{"$error":"#N/A"},{"$f":"IFERROR(VLOOKUP(B819,Insumos!$A$4:$B$8,2,FALSE),\"\")","v":""}]
[null,{"$error":"#N/A"},{"$error":"#N/A"},{"$f":"IFERROR(VLOOKUP(B820,Insumos!$A$4:$B$8,2,FALSE),\"\")","v":""}]
[null,{"$error":"#N/A"},{"$error":"#N/A"},{"$f":"IFERROR(VLOOKUP(B821,Insumos!$A$4:$B$8,2,FALSE),\"\")","v":""}]
[null,{"$error":"#N/A"},{"$error":"#N/A"},{"$f":"IFERROR(VLOOKUP(B822,Insumos!$A$4:$B$8,2,FALSE),\"\")","v":""}]
[null,{"$error":"#N/A"},{"$error":"#N/A"},{"$f":"IFERROR(VLOOKUP(B823,Insumos!$A$4:$B$8,2,FALSE),\"\")","v":""}]
[null,{"$error":"#N/A"},{"$error":"#N/A"},{"$f":"IFERROR(VLOOKUP(B824,Insumos!$A$4:$B$8,2,FALSE),\"\")","v":""}]
[null,{"$error":"#N/A"},{"$error":"#N/A"},{"$f":"IFERROR(VLOOKUP(B825,Insumos!$A$4:$B$8,2,FALSE),\"\")","v":""}]
[null,{"$error":"#N/A"},{"$error":"#N/A"},{"$f":"IFERROR(VLOOKUP(B826,Insumos!$A$4:$B$8,2,FALSE),\"\")","v":""}]
[null,{"$error":"#N/A"},{"$error":"#N/A"},{"$f":"IFERROR(VLOOKUP(B827,Insumos!$A$4:$B$8,2,FALSE),\"\")","v":""}]
[null,{"$error":"#N/A"},{"$error":"#N/A"},{"$f":"IFERROR(VLOOKUP(B828,Insumos!$A$4:$B$8,2,FALSE),\"\")","v":""}]
[null,{"$error":"#N/A"},{"$error":"#N/A"},{"$f":"IFERROR(VLOOKUP(B829,Insumos!$A$4:$B$8,2,FALSE),\"\")","v":""}]
[null,{"$error":"#N/A"},{"$error":"#N/A"},{"$f":"IFERROR(VLOOKUP(B830,Insumos!$A$4:$B$8,2,FALSE),\"\")","v":""}]
[null,{"$error":"#N/A"},{"$error":"#N/A"},{"$f":"IFERROR(VLOOKUP(B831,Insumos!$A$4:$B$8,2,FALSE),\"\")","v":""}]
[null,{"$error":"#N/A"},{"$error":"#N/A"},{"$f":"IFERROR(VLOOKUP(B832,Insumos!$A$4:$B$8,2,FALSE),\"\")","v":""}]
[null,{"$error":"#N/A"},{"$error":"#N/A"},{"$f":"IFERROR(VLOOKUP(B833,Insumos!$A$4:$B$8,2,FALSE),\"\")","v":""}]
[null,{"$error":"#N/A"},{"$error":"#N/A"},{"$f":"IFERROR(VLOOKUP(B834,Insumos!$A$4:$B$8,2,FALSE),\"\")","v":""}]
[null,{"$error":"#N/A"},{"$error":"#N/A"},{"$f":"IFERROR(VLOOKUP(B835,Insumos!$A$4:$B$8,2,FALSE),\"\")","v":""}]
[null,{"$error":"#N/A"},{"$error":"#N/A"},{"$f":"IFERROR(VLOOKUP(B836,Insumos!$A$4:$B$8,2,FALSE),\"\")","v":""}]
[null,{"$error":"#N/A"},{"$error":"#N/A"},{"$f":"IFERROR(VLOOKUP(B837,Insumos!$A$4:$B$8,2,FALSE),\"\")","v":""}]
[null,{"$error":"#N/A"},{"$error":"#N/A"},{"$f":"IFERROR(VLOOKUP(B838,Insumos!$A$4:$B$8,2,FALSE),\"\")","v":""}]
[null,{"$error":"#N/A"},{"$error":"#N/A"},{"$f":"IFERROR(VLOOKUP(B839,Insumos!$A$4:$B$8,2,FALSE),\"\")","v":""}]
[null,{"$error":"#N/A"},{"$error":"#N/A"},{"$f":"IFERROR(VLOOKUP(B840,Insumos!$A$4:$B$8,2,FALSE),\"\")","v":""}]
[null,{"$error":"#N/A"},{"$error":"#N/A"},{"$f":"IFERROR(VLOOKUP(B841,Insumos!$A$4:$B$8,2,FALSE),\"\")","v":""}]
[null,{"$error":"#N/A"},{"$error":"#N/A"},{"$f":"IFERROR(VLOOKUP(B842,Insumos!$A$4:$B$8,2,FALSE),\"\")","v":""}]
[null,{"$error":"#N/A"},{"$error":"#N/A"},{"$f":"IFERROR(VLOOKUP(B843,Insumos!$A$4:$B$8,2,FALSE),\"\")","v":""}]
[null,{"$error":"#N/A"},{"$error":"#N/A"},{"$f":"IFERROR(VLOOKUP(B844,Insumos!$A$4:$B$8,2,FALSE),\"\")","v":""}]
[null,{"$error":"#N/A"},{"$error":"#N/A"},{"$f":"IFERROR(VLOOKUP(B845,Insumos!$A$4:$B$8,2,FALSE),\"\")","v":""}]
[null,{"$error":"#N/A"},{"$error":"#N/A"},{"$f":"IFERROR(VLOOKUP(B846,Insumos!$A$4:$B$8,2,FALSE),\"\")","v":""}]
[null,{"$error":"#N/A"},{"$error":"#N/A"},{"$f":"IFERROR(VLOOKUP(B847,Insumos!$A$4:$B$8,2,FALSE),\"\")","v":""}]
[null,{"$error":"#N/A"},{"$error":"#N/A"},{"$f":"IFERROR(VLOOKUP(B848,Insumos!$A$4:$B$8,2,FALSE),\"\")","v":""}]
[null,{"$error":"#N/A"},{"$error":"#N/A"},{"$f":"IFERROR(VLOOKUP(B849,Insumos!$A$4:$B$8,2,FALSE),\"\")","v":""}]
[null,{"$error":"#N/A"},{"$error":"#N/A"},{"$f":"IFERROR(VLOOKUP(B850,Insumos!$A$4:$B$8,2,FALSE),\"\")","v":""}]
[null,{"$error":"#N/A"},{"$error":"#N/A"},{"$f":"IFERROR(VLOOKUP(B851,Insumos!$A$4:$B$8,2,FALSE),\"\")","v":""}]
[null,{"$error":"#N/A"},{"$error":"#N/A"},{"$f":"IFERROR(VLOOKUP(B852,Insumos!$A$4:$B$8,2,FALSE),\"\")","v":""}]
[null,{"$error":"#N/A"},{"$error":"#N/A"},{"$f":"IFERROR(VLOOKUP(B853,Insumos!$A$4:$B$8,2,FALSE),\"\")","v":""}]
[null,{"$error":"#N/A"},{"$error":"#N/A"},{"$f":"IFERROR(VLOOKUP(B854,Insumos!$A$4:$B$8,2,FALSE),\"\")","v":""}]
[null,{"$error":"#N/A"},{"$error":"#N/A"},{"$f":"IFERROR(VLOOKUP(B855,Insumos!$A$4:$B$8,2,FALSE),\"\")","v":""}]
[null,{"$error":"#N/A"},{"$error":"#N/A"},{"$f":"IFERROR(VLOOKUP(B856,Insumos!$A$4:$B$8,2,FALSE),\"\")","v":""}]
[null,{"$error":"#N/A"},{"$error":"#N/A"},{"$f":"IFERROR(VLOOKUP(B857,Insumos!$A$4:$B$8,2,FALSE),\"\")","v":""}]
[null,{"$error":"#N/A"},{"$error":"#N/A"},{"$f":"IFERROR(VLOOKUP(B858,Insumos!$A$4:$B$8,2,FALSE),\"\")","v":""}]
[null,{"$error":"#N/A"},{"$error":"#N/A"},{"$f":"IFERROR(VLOOKUP(B859,Insumos!$A$4:$B$8,2,FALSE),\"\")","v":""}]
[null,{"$error":"#N/A"},{"$error":"#N/A"},{"$f":"IFERROR(VLOOKUP(B860,Insumos!$A$4:$B$8,2,FALSE),\"\")","v":""}]
[null,{"$error":"#N/A"},{"$error":"#N/A"},{"$f":"IFERROR(VLOOKUP(B861,Insumos!$A$4:$B$8,2,FALSE),\"\")","v":""}]
[null,{"$error":"#N/A"},{"$error":"#N/A"},{"$f":"IFERROR(VLOOKUP(B862,Insumos!$A$4:$B$8,2,FALSE),\"\")","v":""}]
[null,{"$error":"#N/A"},{"$error":"#N/A"},{"$f":"IFERROR(VLOOKUP(B863,Insumos!$A$4:$B$8,2,FALSE),\"\")","v":""}]
[null,{"$error":"#N/A"},{"$error":"#N/A"},{"$f":"IFERROR(VLOOKUP(B864,Insumos!$A$4:$B$8,2,FALSE),\"\")","v":""}]
[null,{"$error":"#N/A"},{"$error":"#N/A"},{"$f":"IFERROR(VLOOKUP(B865,Insumos!$A$4:$B$8,2,FALSE),\"\")","v":""}]
[null,{"$error":"#N/A"},{"$error":"#N/A"},{"$f":"IFERROR(VLOOKUP(B866,Insumos!$A$4:$B$8,2,FALSE),\"\")","v":""}]
[null,{"$error":"#N/A"},{"$error":"#N/A"},{"$f":"IFERROR(VLOOKUP(B867,Insumos!$A$4:$B$8,2,FALSE),\"\")","v":""}]
[null,{"$error":"#N/A"},{"$error":"#N/A"},{"$f":"IFERROR(VLOOKUP(B868,Insumos!$A$4:$B$8,2,FALSE),\"\")","v":""}]
[null,{"$error":"#N/A"},{"$error":"#N/A"},{"$f":"IFERROR(VLOOKUP(B869,Insumos!$A$4:$B$8,2,FALSE),\"\")","v":""}]
[null,{"$error":"#N/A"},{"$error":"#N/A"},{"$f":"IFERROR(VLOOKUP(B870,Insumos!$A$4:$B$8,2,FALSE),\"\")","v":""}]
[null,{"$error":"#N/A"},{"$error":"#N/A"},{"$f":"IFERROR(VLOOKUP(B871,Insumos!$A$4:$B$8,2,FALSE),\"\")","v":""}]
[null,{"$error":"#N/A"},{"$error":"#N/A"},{"$f":"IFERROR(VLOOKUP(B872,Insumos!$A$4:$B$8,2,FALSE),\"\")","v":""}]
[null,{"$error":"#N/A"},{"$error":"#N/A"},{"$f":"IFERROR(VLOOKUP(B873,Insumos!$A$4:$B$8,2,FALSE),\"\")","v":""}]
[null,{"$error":"#N/A"},{"$error":"#N/A"},{"$f":"IFERROR(VLOOKUP(B874,Insumos!$A$4:$B$8,2,FALSE),\"\")","v":""}]
[null,{"$error":"#N/A"},{"$error":"#N/A"},{"$f":"IFERROR(VLOOKUP(B875,Insumos!$A$4:$B$8,2,FALSE),\"\")","v":""}]
[null,{"$error":"#N/A"},{"$error":"#N/A"},{"$f":"IFERROR(VLOOKUP(B876,Insumos!$A$4:$B$8,2,FALSE),\"\")","v":""}]
[null,{"$error":"#N/A"},{"$error":"#N/A"},{"$f":"IFERROR(VLOOKUP(B877,Insumos!$A$4:$B$8,2,FALSE),\"\")","v":""}]
[null,{"$error":"#N/A"},{"$error":"#N/A"},{"$f":"IFERROR(VLOOKUP(B878,Insumos!$A$4:$B$8,2,FALSE),\"\")","v":""}]
[null,{"$error":"#N/A"},{"$error":"#N/A"},{"$f":"IFERROR(VLOOKUP(B879,Insumos!$A$4:$B$8,2,FALSE),\"\")","v":""}]
[null,{"$error":"#N/A"},{"$error":"#N/A"},{"$f":"IFERROR(VLOOKUP(B880,Insumos!$A$4:$B$8,2,FALSE),\"\")","v":""}]
[null,{"$error":"#N/A"},{"$error":"#N/A"},{"$f":"IFERROR(VLOOKUP(B881,Insumos!$A$4:$B$8,2,FALSE),\"\")","v":""}]
[null,{"$error":"#N/A"},{"$error":"#N/A"},{"$f":"IFERROR(VLOOKUP(B882,Insumos!$A$4:$B$8,2,FALSE),\"\")","v":""}]
[null,{"$error":"#N/A"},{"$error":"#N/A"},{"$f":"IFERROR(VLOOKUP(B883,Insumos!$A$4:$B$8,2,FALSE),\"\")","v":""}]
[null,{"$error":"#N/A"},{"$error":"#N/A"},{"$f":"IFERROR(VLOOKUP(B884,Insumos!$A$4:$B$8,2,FALSE),\"\")","v":""}]
[null,{"$error":"#N/A"},{"$error":"#N/A"},{"$f":"IFERROR(VLOOKUP(B885,Insumos!$A$4:$B$8,2,FALSE),\"\")","v":""}]
[null,{"$error":"#N/A"},{"$error":"#N/A"},{"$f":"IFERROR(VLOOKUP(B886,Insumos!$A$4:$B$8,2,FALSE),\"\")","v":""}]
[null,{"$error":"#N/A"},{"$error":"#N/A"},{"$f":"IFERROR(VLOOKUP(B887,Insumos!$A$4:$B$8,2,FALSE),\"\")","v":""}]
[null,{"$error":"#N/A"},{"$error":"#N/A"},{"$f":"IFERROR(VLOOKUP(B888,Insumos!$A$4:$B$8,2,FALSE),\"\")","v":""}]
[null,{"$error":"#N/A"},{"$error":"#N/A"},{"$f":"IFERROR(VLOOKUP(B889,Insumos!$A$4:$B$8,2,FALSE),\"\")","v":""}]
[null,{"$error":"#N/A"},{"$error":"#N/A"},{"$f":"IFERROR(VLOOKUP(B890,Insumos!$A$4:$B$8,2,FALSE),\"\")","v":""}]
[null,{"$error":"#N/A"},{"$error":"#N/A"},{"$f":"IFERROR(VLOOKUP(B891,Insumos!$A$4:$B$8,2,FALSE),\"\")","v":""}]
[null,{"$error":"#N/A"},{"$error":"#N/A"},{"$f":"IFERROR(VLOOKUP(B892,Insumos!$A$4:$B$8,2,FALSE),\"\")","v":""}]
[null,{"$error":"#N/A"},{"$error":"#N/A"},{"$f":"IFERROR(VLOOKUP(B893,Insumos!$A$4:$B$8,2,FALSE),\"\")","v":""}]
[null,{"$error":"#N/A"},{"$error":"#N/A"},{"$f":"IFERROR(VLOOKUP(B894,Insumos!$A$4:$B$8,2,FALSE),\"\")","v":""}]
[null,{"$error":"#N/A"},{"$error":"#N/A"},{"$f":"IFERROR(VLOOKUP(B895,Insumos!$A$4:$B$8,2,FALSE),\"\")","v":""}]
[null,{"$error":"#N/A"},{"$error":"#N/A"},{"$f":"IFERROR(VLOOKUP(B896,Insumos!$A$4:$B$8,2,FALSE),\"\")","v":""}]
[null,{"$error":"#N/A"},{"$error":"#N/A"},{"$f":"IFERROR(VLOOKUP(B897,Insumos!$A$4:$B$8,2,FALSE),\"\")","v":""}]
[null,{"$error":"#N/A"},{"$error":"#N/A"},{"$f":"IFERROR(VLOOKUP(B898,Insumos!$A$4:$B$8,2,FALSE),\"\")","v":""}]
[null,{"$error":"#N/A"},{"$error":"#N/A"},{"$f":"IFERROR(VLOOKUP(B899,Insumos!$A$4:$B$8,2,FALSE),\"\")","v":""}]
[null,{"$error":"#N/A"},{"$error":"#N/A"},{"$f":"IFERROR(VLOOKUP(B900,Insumos!$A$4:$B$8,2,FALSE),\"\")","v":""}]
[null,{"$error":"#N/A"},{"$error":"#N/A"},{"$f":"IFERROR(VLOOKUP(B901,Insumos!$A$4:$B$8,2,FALSE),\"\")","v":""}]
[null,{"$error":"#N/A"},{"$error":"#N/A"},{"$f":"IFERROR(VLOOKUP(B902,Insumos!$A$4:$B$8,2,FALSE),\"\")","v":""}]
[null,{"$error":"#N/A"},{"$error":"#N/A"},{"$f":"IFERROR(VLOOKUP(B903,Insumos!$A$4:$B$8,2,FALSE),\"\")","v":""}]
[null,{"$error":"#N/A"},{"$error":"#N/A"},{"$f":"IFERROR(VLOOKUP(B904,Insumos!$A$4:$B$8,2,FALSE),\"\")","v":""}]
[null,{"$error":"#N/A"},{"$error":"#N/A"},{"$f":"IFERROR(VLOOKUP(B905,Insumos!$A$4:$B$8,2,FALSE),\"\")","v":""}]
[null,{"$error":"#N/A"},{"$error":"#N/A"},{"$f":"IFERROR(VLOOKUP(B906,Insumos!$A$4:$B$8,2,FALSE),\"\")","v":""}]
[null,{"$error":"#N/A"},{"$error":"#N/A"},{"$f":"IFERROR(VLOOKUP(B907,Insumos!$A$4:$B$8,2,FALSE),\"\")","v":""}]
[null,{"$error":"#N/A"},{"$error":"#N/A"},{"$f":"IFERROR(VLOOKUP(B908,Insumos!$A$4:$B$8,2,FALSE),\"\")","v":""}]
[null,{"$error":"#N/A"},{"$error":"#N/A"},{"$f":"IFERROR(VLOOKUP(B909,Insumos!$A$4:$B$8,2,FALSE),\"\")","v":""}]
[null,{"$error":"#N/A"},{"$error":"#N/A"},{"$f":"IFERROR(VLOOKUP(B910,Insumos!$A$4:$B$8,2,FALSE),\"\")","v":""}]
[null,{"$error":"#N/A"},{"$error":"#N/A"},{"$f":"IFERROR(VLOOKUP(B911,Insumos!$A$4:$B$8,2,FALSE),\"\")","v":""}]
[null,{"$error":"#N/A"},{"$error":"#N/A"},{"$f":"IFERROR(VLOOKUP(B912,Insumos!$A$4:$B$8,2,FALSE),\"\")","v":""}]
[null,{"$error":"#N/A"},{"$error":"#N/A"},{"$f":"IFERROR(VLOOKUP(B913,Insumos!$A$4:$B$8,2,FALSE),\"\")","v":""}]
[null,{"$error":"#N/A"},{"$error":"#N/A"},{"$f":"IFERROR(VLOOKUP(B914,Insumos!$A$4:$B$8,2,FALSE),\"\")","v":""}]
[null,{"$error":"#N/A"},{"$error":"#N/A"},{"$f":"IFERROR(VLOOKUP(B915,Insumos!$A$4:$B$8,2,FALSE),\"\")","v":""}]
[null,{"$error":"#N/A"},{"$error":"#N/A"},{"$f":"IFERROR(VLOOKUP(B916,Insumos!$A$4:$B$8,2,FALSE),\"\")","v":""}]
[null,{"$error":"#N/A"},{"$error":"#N/A"},{"$f":"IFERROR(VLOOKUP(B917,Insumos!$A$4:$B$8,2,FALSE),\"\")","v":""}]
[null,{"$error":"#N/A"},{"$error":"#N/A"},{"$f":"IFERROR(VLOOKUP(B918,Insumos!$A$4:$B$8,2,FALSE),\"\")","v":""}]
[null,{"$error":"#N/A"},{"$error":"#N/A"},{"$f":"IFERROR(VLOOKUP(B919,Insumos!$A$4:$B$8,2,FALSE),\"\")","v":""}]
[null,{"$error":"#N/A"},{"$error":"#N/A"},{"$f":"IFERROR(VLOOKUP(B920,Insumos!$A$4:$B$8,2,FALSE),\"\")","v":""}]
[null,{"$error":"#N/A"},{"$error":"#N/A"},{"$f":"IFERROR(VLOOKUP(B921,Insumos!$A$4:$B$8,2,FALSE),\"\")","v":""}]
[null,{"$error":"#N/A"},{"$error":"#N/A"},{"$f":"IFERROR(VLOOKUP(B922,Insumos!$A$4:$B$8,2,FALSE),\"\")","v":""}]
[null,{"$error":"#N/A"},{"$error":"#N/A"},{"$f":"IFERROR(VLOOKUP(B923,Insumos!$A$4:$B$8,2,FALSE),\"\")","v":""}]
[null,{"$error":"#N/A"},{"$error":"#N/A"},{"$f":"IFERROR(VLOOKUP(B924,Insumos!$A$4:$B$8,2,FALSE),\"\")","v":""}]
[null,{"$error":"#N/A"},{"$error":"#N/A"},{"$f":"IFERROR(VLOOKUP(B925,Insumos!$A$4:$B$8,2,FALSE),\"\")","v":""}]
[null,{"$error":"#N/A"},{"$error":"#N/A"},{"$f":"IFERROR(VLOOKUP(B926,Insumos!$A$4:$B$8,2,FALSE),\"\")","v":""}]
[null,{"$error":"#N/A"},{"$error":"#N/A"},{"$f":"IFERROR(VLOOKUP(B927,Insumos!$A$4:$B$8,2,FALSE),\"\")","v":""}]
[null,{"$error":"#N/A"},{"$error":"#N/A"},{"$f":"IFERROR(VLOOKUP(B928,Insumos!$A$4:$B$8,2,FALSE),\"\")","v":""}]
[null,{"$error":"#N/A"},{"$error":"#N/A"},{"$f":"IFERROR(VLOOKUP(B929,Insumos!$A$4:$B$8,2,FALSE),\"\")","v":""}]
[null,{"$error":"#N/A"},{"$error":"#N/A"},{"$f":"IFERROR(VLOOKUP(B930,Insumos!$A$4:$B$8,2,FALSE),\"\")","v":""}]
[null,{"$error":"#N/A"},{"$error":"#N/A"},{"$f":"IFERROR(VLOOKUP(B931,Insumos!$A$4:$B$8,2,FALSE),\"\")","v":""}]
[null,{"$error":"#N/A"},{"$error":"#N/A"},{"$f":"IFERROR(VLOOKUP(B932,Insumos!$A$4:$B$8,2,FALSE),\"\")","v":""}]
[null,{"$error":"#N/A"},{"$error":"#N/A"},{"$f":"IFERROR(VLOOKUP(B933,Insumos!$A$4:$B$8,2,FALSE),\"\")","v":""}]
[null,{"$error":"#N/A"},{"$error":"#N/A"},{"$f":"IFERROR(VLOOKUP(B934,Insumos!$A$4:$B$8,2,FALSE),\"\")","v":""}]
[null,{"$error":"#N/A"},{"$error":"#N/A"},{"$f":"IFERROR(VLOOKUP(B935,Insumos!$A$4:$B$8,2,FALSE),\"\")","v":""}]
[null,{"$error":"#N/A"},{"$error":"#N/A"},{"$f":"IFERROR(VLOOKUP(B936,Insumos!$A$4:$B$8,2,FALSE),\"\")","v":""}]
[null,{"$error":"#N/A"},{"$error":"#N/A"},{"$f":"IFERROR(VLOOKUP(B937,Insumos!$A$4:$B$8,2,FALSE),\"\")","v":""}]
[null,{"$error":"#N/A"},{"$error":"#N/A"},{"$f":"IFERROR(VLOOKUP(B938,Insumos!$A$4:$B$8,2,FALSE),\"\")","v":""}]
[null,{"$error":"#N/A"},{"$error":"#N/A"},{"$f":"IFERROR(VLOOKUP(B939,Insumos!$A$4:$B$8,2,FALSE),\"\")","v":""}]
[null,{"$error":"#N/A"},{"$error":"#N/A"},{"$f":"IFERROR(VLOOKUP(B940,Insumos!$A$4:$B$8,2,FALSE),\"\")","v":""}]
[null,{"$error":"#N/A"},{"$error":"#N/A"},{"$f":"IFERROR(VLOOKUP(B941,Insumos!$A$4:$B$8,2,FALSE),\"\")","v":""}]
[null,{"$error":"#N/A"},{"$error":"#N/A"},{"$f":"IFERROR(VLOOKUP(B942,Insumos!$A$4:$B$8,2,FALSE),\"\")","v":""}]
[null,{"$error":"#N/A"},{"$error":"#N/A"},{"$f":"IFERROR(VLOOKUP(B943,Insumos!$A$4:$B$8,2,FALSE),\"\")","v":""}]
[null,{"$error":"#N/A"},{"$error":"#N/A"},{"$f":"IFERROR(VLOOKUP(B944,Insumos!$A$4:$B$8,2,FALSE),\"\")","v":""}]
[null,{"$error":"#N/A"},{"$error":"#N/A"},{"$f":"IFERROR(VLOOKUP(B945,Insumos!$A$4:$B$8,2,FALSE),\"\")","v":""}]
[null,{"$error":"#N/A"},{"$error":"#N/A"},{"$f":"IFERROR(VLOOKUP(B946,Insumos!$A$4:$B$8,2,FALSE),\"\")","v":""}]
[null,{"$error":"#N/A"},{"$error":"#N/A"},{"$f":"IFERROR(VLOOKUP(B947,Insumos!$A$4:$B$8,2,FALSE),\"\")","v":""}]
[null,{"$error":"#N/A"},{"$error":"#N/A"},{"$f":"IFERROR(VLOOKUP(B948,Insumos!$A$4:$B$8,2,FALSE),\"\")","v":""}]
[null,{"$error":"#N/A"},{"$error":"#N/A"},{"$f":"IFERROR(VLOOKUP(B949,Insumos!$A$4:$B$8,2,FALSE),\"\")","v":""}]
[null,{"$error":"#N/A"},{"$error":"#N/A"},{"$f":"IFERROR(VLOOKUP(B950,Insumos!$A$4:$B$8,2,FALSE),\"\")","v":""}]
[null,{"$error":"#N/A"},{"$error":"#N/A"},{"$f":"IFERROR(VLOOKUP(B951,Insumos!$A$4:$B$8,2,FALSE),\"\")","v":""}]
[null,{"$error":"#N/A"},{"$error":"#N/A"},{"$f":"IFERROR(VLOOKUP(B952,Insumos!$A$4:$B$8,2,FALSE),\"\")","v":""}]
[null,{"$error":"#N/A"},{"$error":"#N/A"},{"$f":"IFERROR(VLOOKUP(B953,Insumos!$A$4:$B$8,2,FALSE),\"\")","v":""}]
[null,{"$error":"#N/A"},{"$error":"#N/A"},{"$f":"IFERROR(VLOOKUP(B954,Insumos!$A$4:$B$8,2,FALSE),\"\")","v":""}]
[null,{"$error":"#N/A"},{"$error":"#N/A"},{"$f":"IFERROR(VLOOKUP(B955,Insumos!$A$4:$B$8,2,FALSE),\"\")","v":""}]
[null,{"$error":"#N/A"},{"$error":"#N/A"},{"$f":"IFERROR(VLOOKUP(B956,Insumos!$A$4:$B$8,2,FALSE),\"\")","v":""}]
[null,{"$error":"#N/A"},{"$error":"#N/A"},{"$f":"IFERROR(VLOOKUP(B957,Insumos!$A$4:$B$8,2,FALSE),\"\")","v":""}]
[null,{"$error":"#N/A"},{"$error":"#N/A"},{"$f":"IFERROR(VLOOKUP(B958,Insumos!$A$4:$B$8,2,FALSE),\"\")","v":""}]
[null,{"$error":"#N/A"},{"$error":"#N/A"},{"$f":"IFERROR(VLOOKUP(B959,Insumos!$A$4:$B$8,2,FALSE),\"\")","v":""}]
[null,{"$error":"#N/A"},{"$error":"#N/A"},{"$f":"IFERROR(VLOOKUP(B960,Insumos!$A$4:$B$8,2,FALSE),\"\")","v":""}]
[null,{"$error":"#N/A"},{"$error":"#N/A"},{"$f":"IFERROR(VLOOKUP(B961,Insumos!$A$4:$B$8,2,FALSE),\"\")","v":""}]
[null,{"$error":"#N/A"},{"$error":"#N/A"},{"$f":"IFERROR(VLOOKUP(B962,Insumos!$A$4:$B$8,2,FALSE),\"\")","v":""}]
[null,{"$error":"#N/A"},{"$error":"#N/A"},{"$f":"IFERROR(VLOOKUP(B963,Insumos!$A$4:$B$8,2,FALSE),\"\")","v":""}]
[null,{"$error":"#N/A"},{"$error":"#N/A"},{"$f":"IFERROR(VLOOKUP(B964,Insumos!$A$4:$B$8,2,FALSE),\"\")","v":""}]
[null,{"$error":"#N/A"},{"$error":"#N/A"},{"$f":"IFERROR(VLOOKUP(B965,Insumos!$A$4:$B$8,2,FALSE),\"\")","v":""}]
[null,{"$error":"#N/A"},{"$error":"#N/A"},{"$f":"IFERROR(VLOOKUP(B966,Insumos!$A$4:$B$8,2,FALSE),\"\")","v":""}]
[null,{"$error":"#N/A"},{"$error":"#N/A"},{"$f":"IFERROR(VLOOKUP(B967,Insumos!$A$4:$B$8,2,FALSE),\"\")","v":""}]
[null,{"$error":"#N/A"},{"$error":"#N/A"},{"$f":"IFERROR(VLOOKUP(B968,Insumos!$A$4:$B$8,2,FALSE),\"\")","v":""}]
[null,{"$error":"#N/A"},{"$error":"#N/A"},{"$f":"IFERROR(VLOOKUP(B969,Insumos!$A$4:$B$8,2,FALSE),\"\")","v":""}]
[null,{"$error":"#N/A"},{"$error":"#N/A"},{"$f":"IFERROR(VLOOKUP(B970,Insumos!$A$4:$B$8,2,FALSE),\"\")","v":""}]
[null,{"$error":"#N/A"},{"$error":"#N/A"},{"$f":"IFERROR(VLOOKUP(B971,Insumos!$A$4:$B$8,2,FALSE),\"\")","v":""}]
[null,{"$error":"#N/A"},{"$error":"#N/A"},{"$f":"IFERROR(VLOOKUP(B972,Insumos!$A$4:$B$8,2,FALSE),\"\")","v":""}]
[null,{"$error":"#N/A"},{"$error":"#N/A"},{"$f":"IFERROR(VLOOKUP(B973,Insumos!$A$4:$B$8,2,FALSE),\"\")","v":""}]
[null,{"$error":"#N/A"},{"$error":"#N/A"},{"$f":"IFERROR(VLOOKUP(B974,Insumos!$A$4:$B$8,2,FALSE),\"\")","v":""}]
[null,{"$error":"#N/A"},{"$error":"#N/A"},{"$f":"IFERROR(VLOOKUP(B975,Insumos!$A$4:$B$8,2,FALSE),\"\")","v":""}]
[null,{"$error":"#N/A"},{"$error":"#N/A"},{"$f":"IFERROR(VLOOKUP(B976,Insumos!$A$4:$B$8,2,FALSE),\"\")","v":""}]
[null,{"$error":"#N/A"},{"$error":"#N/A"},{"$f":"IFERROR(VLOOKUP(B977,Insumos!$A$4:$B$8,2,FALSE),\"\")","v":""}]
[null,{"$error":"#N/A"},{"$error":"#N/A"},{"$f":"IFERROR(VLOOKUP(B978,Insumos!$A$4:$B$8,2,FALSE),\"\")","v":""}]
[null,{"$error":"#N/A"},{"$error":"#N/A"},{"$f":"IFERROR(VLOOKUP(B979,Insumos!$A$4:$B$8,2,FALSE),\"\")","v":""}]
[null,{"$error":"#N/A"},{"$error":"#N/A"},{"$f":"IFERROR(VLOOKUP(B980,Insumos!$A$4:$B$8,2,FALSE),\"\")","v":""}]
[null,{"$error":"#N/A"},{"$error":"#N/A"},{"$f":"IFERROR(VLOOKUP(B981,Insumos!$A$4:$B$8,2,FALSE),\"\")","v":""}]
[null,{"$error":"#N/A"},{"$error":"#N/A"},{"$f":"IFERROR(VLOOKUP(B982,Insumos!$A$4:$B$8,2,FALSE),\"\")","v":""}]
[null,{"$error":"#N/A"},{"$error":"#N/A"},{"$f":"IFERROR(VLOOKUP(B983,Insumos!$A$4:$B$8,2,FALSE),\"\")","v":""}]
[null,{"$error":"#N/A"},{"$error":"#N/A"},{"$f":"IFERROR(VLOOKUP(B984,Insumos!$A$4:$B$8,2,FALSE),\"\")","v":""}]
[null,{"$error":"#N/A"},{"$error":"#N/A"},{"$f":"IFERROR(VLOOKUP(B985,Insumos!$A$4:$B$8,2,FALSE),\"\")","v":""}]
[null,{"$error":"#N/A"},{"$error":"#N/A"},{"$f":"IFERROR(VLOOKUP(B986,Insumos!$A$4:$B$8,2,FALSE),\"\")","v":""}]
[null,{"$error":"#N/A"},{"$error":"#N/A"},{"$f":"IFERROR(VLOOKUP(B987,Insumos!$A$4:$B$8,2,FALSE),\"\")","v":""}]
[null,{"$error":"#N/A"},{"$error":"#N/A"},{"$f":"IFERROR(VLOOKUP(B988,Insumos!$A$4:$B$8,2,FALSE),\"\")","v":""}]
[null,{"$error":"#N/A"},{"$error":"#N/A"},{"$f":"IFERROR(VLOOKUP(B989,Insumos!$A$4:$B$8,2,FALSE),\"\")","v":""}]
[null,{"$error":"#N/A"},{"$error":"#N/A"},{"$f":"IFERROR(VLOOKUP(B990,Insumos!$A$4:$B$8,2,FALSE),\"\")","v":""}]
[null,{"$error":"#N/A"},{"$error":"#N/A"},{"$f":"IFERROR(VLOOKUP(B991,Insumos!$A$4:$B$8,2,FALSE),\"\")","v":""}]
[null,{"$error":"#N/A"},{"$error":"#N/A"},{"$f":"IFERROR(VLOOKUP(B992,Insumos!$A$4:$B$8,2,FALSE),\"\")","v":""}]
[null,{"$error":"#N/A"},{"$error":"#N/A"},{"$f":"IFERROR(VLOOKUP(B993,Insumos!$A$4:$B$8,2,FALSE),\"\")","v":""}]
[null,{"$error":"#N/A"},{"$error":"#N/A"},{"$f":"IFERROR(VLOOKUP(B994,Insumos!$A$4:$B$8,2,FALSE),\"\")","v":""}]
[null,{"$error":"#N/A"},{"$error":"#N/A"},{"$f":"IFERROR(VLOOKUP(B995,Insumos!$A$4:$B$8,2,FALSE),\"\")","v":""}]
[null,{"$error":"#N/A"},{"$error":"#N/A"},{"$f":"IFERROR(VLOOKUP(B996,Insumos!$A$4:$B$8,2,FALSE),\"\")","v":""}]
[null,{"$error":"#N/A"},{"$error":"#N/A"},{"$f":"IFERROR(VLOOKUP(B997,Insumos!$A$4:$B$8,2,FALSE),\"\")","v":""}]
[null,{"$error":"#N/A"},{"$error":"#N/A"},{"$f":"IFERROR(VLOOKUP(B998,Insumos!$A$4:$B$8,2,FALSE),\"\")","v":""}]
[null,{"$error":"#N/A"},{"$error":"#N/A"},{"$f":"IFERROR(VLOOKUP(B999,Insumos!$A$4:$B$8,2,FALSE),\"\")","v":""}]
[null,null,null,{"$f":"IFERROR(VLOOKUP(B1000,Insumos!$A$4:$B$8,2,FALSE),\"\")","v":""}]