{"text_format":"1","workbook":"xlsx","n_sheets":10,"sheets":["Fornecedores","Nota_Fiscal","Relatório","Saída","Atividade","Unidade","Insumos","Produtos","Consulta_Estoque","Relatorio_Atividades"],"not_rendered":{"charts":0,"images":0,"macros":1,"external_links":0,"defined_names":10,"comments":0,"pivot_tables":0},"unopened":[],"bounds":{"document_bytes":16777216,"sheet_cells":100000,"rows_first":2000,"rows_last":500,"rows_between":2000,"halvings":0,"cell_chars":16384,"cell_head_chars":4096},"cells_cut":0,"cells_raw":0,"read":"row_number_cap","date_system":"1900"}

{"sheet":"Fornecedores","index":0,"n_rows":5,"n_cols":6,"rows_kept":5,"cut":false,"hidden":false,"merged":[[0,0,0,5]]}
["Cadastro de Fornecedores"]
["Nome","Endereço","Nº","Cidade","Estado","CNPJ"]
["COPASUL COOPERATIVA AGRÍCOLA","Av. Deodato leonardo da Silva",1076,"Deodapolis","MS","03.902.129/0004-26"]
["PARCERIA AGRICOLA E PECUARIA LTDA","Rua Hayel Bon Faker",950,"Dourados","MS",8013743000108]
["BIO ATUMUS DOURADOS COMERCIO","R JOAO ROSA GOES",73,"DOURADOS","MS",47896647000107]

{"sheet":"Nota_Fiscal","index":1,"n_rows":2504,"n_cols":12,"rows_kept":2504,"cut":false,"hidden":false,"merged":[[0,1,1,9]]}
[null,"CADASTRO DE NOTA FISCAL"]
[]
[null,"NOTA FISCAL","DATA DA COMPRA","FORNECEDOR","INSUMO","UN","PRODUTO","VALOR UNITÁRIO","QTD","VALOR TOTAL",null,"TIPO"]
[null,6126,"2023-08-03","COPASUL COOPERATIVA AGRÍCOLA","Defensivo Galão",{"$f":"IFERROR(VLOOKUP(E4,Insumos!A:C,2,FALSE),\"\")","v":"Lt"},"OFF ROAD",28.639199999999999,300,{"$f":"IFERROR(H4*I4,\"\")","v":8591.76},null,"herbicida"]
[null,6126,"2023-08-03","COPASUL COOPERATIVA AGRÍCOLA","Defensivo Galão",{"$f":"IFERROR(VLOOKUP(E5,Insumos!A:C,2,FALSE),\"\")","v":"Lt"},"POQUER ",34.546399999999998,240,{"$f":"IFERROR(H5*I5,\"\")","v":8291.1360000000004},null,"herbicida"]
[null,6126,"2023-08-03","COPASUL COOPERATIVA AGRÍCOLA","Defensivo Galão",{"$f":"IFERROR(VLOOKUP(E6,Insumos!A:C,2,FALSE),\"\")","v":"Lt"},"IHARA GOLD",24.773199999999999,180,4459.1759999999995,null,"óleo"]
[null,6126,"2023-08-04","COPASUL COOPERATIVA AGRÍCOLA","Defensivo Galão",{"$f":"IFERROR(VLOOKUP(E7,Insumos!A:C,2,FALSE),\"\")","v":"Lt"},"TRICLON",64.113399999999999,240,15387.216,null,"herbicida"]
[null,6123,"2023-08-03","COPASUL COOPERATIVA AGRÍCOLA","Defensivo Galão",{"$f":"IFERROR(VLOOKUP(E8,Insumos!A:C,2,FALSE),\"\")","v":"Lt"},"OFF ROAD",28.639199999999999,300,8591.76,null,"herbicida"]
[null,6123,"2023-08-03","COPASUL COOPERATIVA AGRÍCOLA","Defensivo Galão",{"$f":"IFERROR(VLOOKUP(E9,Insumos!A:C,2,FALSE),\"\")","v":"Lt"},"POQUER ",34.546399999999998,240,8291.1360000000004,null,"herbicida"]
[null,6123,"2023-08-03","COPASUL COOPERATIVA AGRÍCOLA","Defensivo Galão",{"$f":"IFERROR(VLOOKUP(E10,Insumos!A:C,2,FALSE),\"\")","v":"Lt"},"IHARA GOLD",24.773199999999999,180,4459.1759999999995,null,"óleo"]
[null,6123,"2023-08-03","COPASUL COOPERATIVA AGRÍCOLA","Defensivo Galão",{"$f":"IFERROR(VLOOKUP(E11,Insumos!A:C,2,FALSE),\"\")","v":"Lt"},"TRICLON",64.113399999999999,220,14104.948,null,"herbicida"]
[null,1856,"2023-06-07","COPASUL COOPERATIVA AGRÍCOLA","Defensivo Granulado",{"$f":"IFERROR(VLOOKUP(E12,Insumos!A:C,2,FALSE),\"\")","v":"Kg"},"STRINGER WG",29.17,180,5250.6,null,"herbicida"]
[null,1854,"2023-06-07","COPASUL COOPERATIVA AGRÍCOLA","Defensivo Granulado",{"$f":"IFERROR(VLOOKUP(E13,Insumos!A:C,2,FALSE),\"\")","v":"Kg"},"STRINGER WG",29.17,640,18668.800000000003,null,"herbicida"]
[null,1853,"2023-06-07","COPASUL COOPERATIVA AGRÍCOLA","Defensivo Granulado",{"$f":"IFERROR(VLOOKUP(E14,Insumos!A:C,2,FALSE),\"\")","v":"Kg"},"STRINGER WG",29.17,1180,34420.6,null,"herbicida"]
[null,33607,"2023-08-28","PARCERIA AGRICOLA E PECUARIA LTDA","Defensivo Galão",{"$f":"IFERROR(VLOOKUP(E15,Insumos!A:C,2,FALSE),\"\")","v":"Lt"},"CADDET BB",15,120,1800,null,"óleo"]
{"$rows_left_out":2490}
{"sheet":"Relatório","index":2,"n_rows":29,"n_cols":7,"rows_kept":29,"cut":false,"hidden":false,"merged":[[7,1,7,2],[2,0,2,5],[7,3,7,6],[1,1,1,6],[3,5,3,6],[4,5,4,6],[3,2,3,3],[4,2,4,3],[5,2,5,3],[6,2,6,3]]}
[]
[null,"RELATÓRIO DE ENTRADAS E SAÍDAS POR INSUMOS"]
[]
["INSUMO","SAFRA 2023","TOTAL DE ENTRADAS (NOTA FISCAL)",null,"QUANTIDADE DE SAÍDAS","SALDO ATUAL NO ESTOQUE"]
["herbicida",null,{"$f":"IFERROR(SUMIF(Nota_Fiscal!L4:L1174,A5,Nota_Fiscal!I4:I1174),\"\")","v":4075},null,{"$f":"IFERROR(SUMIF(Saída!H:H,Relatório!$A$5,Saída!F:F),\"\")","v":1361},{"$f":"C5-E5","v":2714}]
[null,"Lt",{"$f":"SUMIFS(Nota_Fiscal!$I$4:$I$1600,Nota_Fiscal!$F$4:$F$1600,Relatório!B6,Nota_Fiscal!$L$4:$L$1600,Relatório!$A$5)","v":2075},null,{"$f":"SUMIFS(Saída!$F$4:$F$38,Saída!$C$4:$C$38,Relatório!B6,Saída!$H$4:$H$38,Relatório!$A$5)","v":786},{"$f":"C6-E6","v":1289}]
[null,"Kg",{"$f":"SUMIFS(Nota_Fiscal!$I$4:$I$1600,Nota_Fiscal!$F$4:$F$1600,Relatório!B7,Nota_Fiscal!$L$4:$L$1600,Relatório!$A$5)","v":2000},null,{"$f":"SUMIFS(Saída!$F$4:$F$38,Saída!$C$4:$C$38,Relatório!B7,Saída!$H$4:$H$38,Relatório!$A$5)","v":575},{"$f":"C7-E7","v":1425}]
[null,"Entradas",null,"Saídas de Insumos"]
["Data","Produto","Entrada","Data2","Produto2","Saída","Talhão"]
[{"$f":"IFERROR(INDEX(Nota_Fiscal!$C$4:$C$1600,SMALL(IF(Nota_Fiscal!L$4:L$1600=A$5,ROW(Nota_Fiscal!L$4:L$1600)-ROWS($A$1:$A$3)),ROW($A1))),\"\")","v":"2023-08-03"},{"$f":"IFERROR(INDEX(Nota_Fiscal!G$4:G$1600,SMALL(IF(Nota_Fiscal!L$4:L$1600=A$5,ROW(Nota_Fiscal!L$4:L$1600)-ROWS($A$1:$A$3)),ROW($A1))),\"\")","v":"OFF ROAD"},{"$f":"IFERROR(INDEX(Nota_Fiscal!I$4:I$1600,SMALL(IF(Nota_Fiscal!L$4:L$1600=A$5,ROW(Nota_Fiscal!L$4:L$1600)-ROWS($A$1:$A$3)),ROW($A1))),\"\")","v":300},{"$f":"IFERROR(INDEX(Saída!$D$4:$D$38,SMALL(IF(Saída!$H$4:$H$38=A$5,ROW(Saída!$H$4:$H$38)-ROWS($A$1:$A$3)),ROW($A1))),\"\")","v":"2023-08-04"},{"$f":"IFERROR(INDEX(Saída!$E$4:$E$38,SMALL(IF(Saída!$H$4:$H$38=A$5,ROW(Saída!$H$4:$H$38)-ROWS($A$1:$A$3)),ROW($A1))),\"\")","v":"STRINGER WG"},{"$f":"IFERROR(INDEX(Saída!$F$4:$F$38,SMALL(IF(Saída!$H$4:$H$38=A$5,ROW(Saída!$H$4:$H$38)-ROWS($A$1:$A$3)),ROW($A1))),\"\")","v":220},{"$f":"IFERROR(INDEX(Saída!$B$4:$B$38,SMALL(IF(Saída!$H$4:$H$38=A$5,ROW(Saída!$H$4:$H$38)-ROWS($A$1:$A$3)),ROW($A1))),\"\")","v":6}]
[{"$f":"IFERROR(INDEX(Nota_Fiscal!$C$4:$C$1600,SMALL(IF(Nota_Fiscal!L$4:L$1600=A$5,ROW(Nota_Fiscal!L$4:L$1600)-ROWS($A$1:$A$3)),ROW($A2))),\"\")","v":"2023-08-03"},{"$f":"IFERROR(INDEX(Nota_Fiscal!G$4:G$1600,SMALL(IF(Nota_Fiscal!L$4:L$1600=A$5,ROW(Nota_Fiscal!L$4:L$1600)-ROWS($A$1:$A$3)),ROW($A2))),\"\")","v":"POQUER "},{"$f":"IFERROR(INDEX(Nota_Fiscal!I$4:I$1600,SMALL(IF(Nota_Fiscal!L$4:L$1600=A$5,ROW(Nota_Fiscal!L$4:L$1600)-ROWS($A$1:$A$3)),ROW($A2))),\"\")","v":240},{"$f":"IFERROR(INDEX(Saída!$D$4:$D$38,SMALL(IF(Saída!$H$4:$H$38=A$5,ROW(Saída!$H$4:$H$38)-ROWS($A$1:$A$3)),ROW($A2))),\"\")","v":"2023-08-04"},{"$f":"IFERROR(INDEX(Saída!$E$4:$E$38,SMALL(IF(Saída!$H$4:$H$38=A$5,ROW(Saída!$H$4:$H$38)-ROWS($A$1:$A$3)),ROW($A2))),\"\")","v":"TRICLON"},{"$f":"IFERROR(INDEX(Saída!$F$4:$F$38,SMALL(IF(Saída!$H$4:$H$38=A$5,ROW(Saída!$H$4:$H$38)-ROWS($A$1:$A$3)),ROW($A2))),\"\")","v":165},{"$f":"IFERROR(INDEX(Saída!$B$4:$B$38,SMALL(IF(Saída!$H$4:$H$38=A$5,ROW(Saída!$H$4:$H$38)-ROWS($A$1:$A$3)),ROW($A2))),\"\")","v":6}]
[{"$f":"IFERROR(INDEX(Nota_Fiscal!$C$4:$C$1600,SMALL(IF(Nota_Fiscal!L$4:L$1600=A$5,ROW(Nota_Fiscal!L$4:L$1600)-ROWS($A$1:$A$3)),ROW($A3))),\"\")","v":"2023-08-04"},{"$f":"IFERROR(INDEX(Nota_Fiscal!G$4:G$1600,SMALL(IF(Nota_Fiscal!L$4:L$1600=A$5,ROW(Nota_Fiscal!L$4:L$1600)-ROWS($A$1:$A$3)),ROW($A3))),\"\")","v":"TRICLON"},{"$f":"IFERROR(INDEX(Nota_Fiscal!I$4:I$1600,SMALL(IF(Nota_Fiscal!L$4:L$1600=A$5,ROW(Nota_Fiscal!L$4:L$1600)-ROWS($A$1:$A$3)),ROW($A3))),\"\")","v":240},{"$f":"IFERROR(INDEX(Saída!$D$4:$D$38,SMALL(IF(Saída!$H$4:$H$38=A$5,ROW(Saída!$H$4:$H$38)-ROWS($A$1:$A$3)),ROW($A3))),\"\")","v":"2023-08-15"},{"$f":"IFERROR(INDEX(Saída!$E$4:$E$38,SMALL(IF(Saída!$H$4:$H$38=A$5,ROW(Saída!$H$4:$H$38)-ROWS($A$1:$A$3)),ROW($A3))),\"\")","v":"OFF ROAD"},{"$f":"IFERROR(INDEX(Saída!$F$4:$F$38,SMALL(IF(Saída!$H$4:$H$38=A$5,ROW(Saída!$H$4:$H$38)-ROWS($A$1:$A$3)),ROW($A3))),\"\")","v":220},{"$f":"IFERROR(INDEX(Saída!$B$4:$B$38,SMALL(IF(Saída!$H$4:$H$38=A$5,ROW(Saída!$H$4:$H$38)-ROWS($A$1:$A$3)),ROW($A3))),\"\")","v":6}]
[{"$f":"IFERROR(INDEX(Nota_Fiscal!$C$4:$C$1600,SMALL(IF(Nota_Fiscal!L$4:L$1600=A$5,ROW(Nota_Fiscal!L$4:L$1600)-ROWS($A$1:$A$3)),ROW($A4))),\"\")","v":"2023-08-03"},{"$f":"IFERROR(INDEX(Nota_Fiscal!G$4:G$1600,SMALL(IF(Nota_Fiscal!L$4:L$1600=A$5,ROW(Nota_Fiscal!L$4:L$1600)-ROWS($A$1:$A$3)),ROW($A4))),\"\")","v":"OFF ROAD"},{"$f":"IFERROR(INDEX(Nota_Fiscal!I$4:I$1600,SMALL(IF(Nota_Fiscal!L$4:L$1600=A$5,ROW(Nota_Fiscal!L$4:L$1600)-ROWS($A$1:$A$3)),ROW($A4))),\"\")","v":300},{"$f":"IFERROR(INDEX(Saída!$D$4:$D$38,SMALL(IF(Saída!$H$4:$H$38=A$5,ROW(Saída!$H$4:$H$38)-ROWS($A$1:$A$3)),ROW($A4))),\"\")","v":"2023-08-23"},{"$f":"IFERROR(INDEX(Saída!$E$4:$E$38,SMALL(IF(Saída!$H$4:$H$38=A$5,ROW(Saída!$H$4:$H$38)-ROWS($A$1:$A$3)),ROW($A4))),\"\")","v":"STRINGER WG"},{"$f":"IFERROR(INDEX(Saída!$F$4:$F$38,SMALL(IF(Saída!$H$4:$H$38=A$5,ROW(Saída!$H$4:$H$38)-ROWS($A$1:$A$3)),ROW($A4))),\"\")","v":120},{"$f":"IFERROR(INDEX(Saída!$B$4:$B$38,SMALL(IF(Saída!$H$4:$H$38=A$5,ROW(Saída!$H$4:$H$38)-ROWS($A$1:$A$3)),ROW($A4))),\"\")","v":6}]
[{"$f":"IFERROR(INDEX(Nota_Fiscal!$C$4:$C$1600,SMALL(IF(Nota_Fiscal!L$4:L$1600=A$5,ROW(Nota_Fiscal!L$4:L$1600)-ROWS($A$1:$A$3)),ROW($A5))),\"\")","v":"2023-08-03"},{"$f":"IFERROR(INDEX(Nota_Fiscal!G$4:G$1600,SMALL(IF(Nota_Fiscal!L$4:L$1600=A$5,ROW(Nota_Fiscal!L$4:L$1600)-ROWS($A$1:$A$3)),ROW($A5))),\"\")","v":"POQUER "},{"$f":"IFERROR(INDEX(Nota_Fiscal!I$4:I$1600,SMALL(IF(Nota_Fiscal!L$4:L$1600=A$5,ROW(Nota_Fiscal!L$4:L$1600)-ROWS($A$1:$A$3)),ROW($A5))),\"\")","v":240},{"$f":"IFERROR(INDEX(Saída!$D$4:$D$38,SMALL(IF(Saída!$H$4:$H$38=A$5,ROW(Saída!$H$4:$H$38)-ROWS($A$1:$A$3)),ROW($A5))),\"\")","v":"2023-08-23"},{"$f":"IFERROR(INDEX(Saída!$E$4:$E$38,SMALL(IF(Saída!$H$4:$H$38=A$5,ROW(Saída!$H$4:$H$38)-ROWS($A$1:$A$3)),ROW($A5))),\"\")","v":"TRICLON"},{"$f":"IFERROR(INDEX(Saída!$F$4:$F$38,SMALL(IF(Saída!$H$4:$H$38=A$5,ROW(Saída!$H$4:$H$38)-ROWS($A$1:$A$3)),ROW($A5))),\"\")","v":90},{"$f":"IFERROR(INDEX(Saída!$B$4:$B$38,SMALL(IF(Saída!$H$4:$H$38=A$5,ROW(Saída!$H$4:$H$38)-ROWS($A$1:$A$3)),ROW($A5))),\"\")","v":6}]
[{"$f":"IFERROR(INDEX(Nota_Fiscal!$C$4:$C$1600,SMALL(IF(Nota_Fiscal!L$4:L$1600=A$5,ROW(Nota_Fiscal!L$4:L$1600)-ROWS($A$1:$A$3)),ROW($A6))),\"\")","v":"2023-08-03"},{"$f":"IFERROR(INDEX(Nota_Fiscal!G$4:G$1600,SMALL(IF(Nota_Fiscal!L$4:L$1600=A$5,ROW(Nota_Fiscal!L$4:L$1600)-ROWS($A$1:$A$3)),ROW($A6))),\"\")","v":"TRICLON"},{"$f":"IFERROR(INDEX(Nota_Fiscal!I$4:I$1600,SMALL(IF(Nota_Fiscal!L$4:L$1600=A$5,ROW(Nota_Fiscal!L$4:L$1600)-ROWS($A$1:$A$3)),ROW($A6))),\"\")","v":220},{"$f":"IFERROR(INDEX(Saída!$D$4:$D$38,SMALL(IF(Saída!$H$4:$H$38=A$5,ROW(Saída!$H$4:$H$38)-ROWS($A$1:$A$3)),ROW($A6))),\"\")","v":"2023-08-24"},{"$f":"IFERROR(INDEX(Saída!$E$4:$E$38,SMALL(IF(Saída!$H$4:$H$38=A$5,ROW(Saída!$H$4:$H$38)-ROWS($A$1:$A$3)),ROW($A6))),\"\")","v":"STRINGER WG"},{"$f":"IFERROR(INDEX(Saída!$F$4:$F$38,SMALL(IF(Saída!$H$4:$H$38=A$5,ROW(Saída!$H$4:$H$38)-ROWS($A$1:$A$3)),ROW($A6))),\"\")","v":155},{"$f":"IFERROR(INDEX(Saída!$B$4:$B$38,SMALL(IF(Saída!$H$4:$H$38=A$5,ROW(Saída!$H$4:$H$38)-ROWS($A$1:$A$3)),ROW($A6))),\"\")","v":1}]
{"$rows_left_out":15}
{"sheet":"Saída","index":3,"n_rows":38,"n_cols":8,"rows_kept":38,"cut":false,"hidden":false,"merged":[[1,0,1,6],[0,0,0,6]]}
["CADASTRO DAS SAÍDAS DE INSUMOS"]
[]
["INSUMO","TALHÃO","UN","DATA","PRODUTO","QTD","ATIVIDADE","Coluna1"]
["Defensivo Granulado",6,{"$f":"IFERROR(VLOOKUP(A4,Insumos!A:B,2,FALSE),\"\")","v":"Kg"},"2023-08-04","STRINGER WG",220,"dessecação",{"$f":"IFERROR(VLOOKUP(E4,Nota_Fiscal!$G$4:$L$1000,6,0),\"\")","v":"herbicida"}]
["Defensivo Galão",6,{"$f":"IFERROR(VLOOKUP(A5,Insumos!A:B,2,FALSE),\"\")","v":"Lt"},"2023-08-04","TRICLON",165,"dessecação",{"$f":"IFERROR(VLOOKUP(E5,Nota_Fiscal!$G$4:$L$1000,6,0),\"\")","v":"herbicida"}]
["Defensivo Galão",6,{"$f":"IFERROR(VLOOKUP(A6,Insumos!A:B,2,FALSE),\"\")","v":"Lt"},"2023-08-04","IHARA GOLD",30,"dessecação",{"$f":"IFERROR(VLOOKUP(E6,Nota_Fiscal!$G$4:$L$1000,6,0),\"\")","v":"óleo"}]
["Defensivo Galão",6,{"$f":"IFERROR(VLOOKUP(A7,Insumos!A:B,2,FALSE),\"\")","v":"Lt"},"2023-08-04","AURORA",8,"dessecação",{"$f":"IFERROR(VLOOKUP(E7,Nota_Fiscal!$G$4:$L$1000,6,0),\"\")","v":""}]
["Defensivo Galão",6,{"$f":"IFERROR(VLOOKUP(A8,Insumos!A:B,2,FALSE),\"\")","v":"Lt"},"2023-08-15","OFF ROAD",220,"Sequencial",{"$f":"IFERROR(VLOOKUP(E8,Nota_Fiscal!$G$4:$L$1000,6,0),\"\")","v":"herbicida"}]
["Defensivo Galão",6,{"$f":"IFERROR(VLOOKUP(A9,Insumos!A:B,2,FALSE),\"\")","v":"Lt"},"2023-08-15","IHARA GOLD",30,"Sequencial",{"$f":"IFERROR(VLOOKUP(E9,Nota_Fiscal!$G$4:$L$1000,6,0),\"\")","v":"óleo"}]
["Defensivo Granulado",6,{"$f":"IFERROR(VLOOKUP(A10,Insumos!A:B,2,FALSE),\"\")","v":"Kg"},"2023-08-23","STRINGER WG",120,"dessecação",{"$f":"IFERROR(VLOOKUP(E10,Nota_Fiscal!$G$4:$L$1000,6,0),\"\")","v":"herbicida"}]
["Defensivo Galão",6,{"$f":"IFERROR(VLOOKUP(A11,Insumos!A:B,2,FALSE),\"\")","v":"Lt"},"2023-08-23","TRICLON",90,"dessecação",{"$f":"IFERROR(VLOOKUP(E11,Nota_Fiscal!$G$4:$L$1000,6,0),\"\")","v":"herbicida"}]
["Defensivo Galão",6,{"$f":"IFERROR(VLOOKUP(A12,Insumos!A:B,2,FALSE),\"\")","v":"Lt"},"2023-08-23","AURORA",4,"dessecação",{"$f":"IFERROR(VLOOKUP(E12,Nota_Fiscal!$G$4:$L$1000,6,0),\"\")","v":""}]
["Defensivo Galão",6,{"$f":"IFERROR(VLOOKUP(A13,Insumos!A:B,2,FALSE),\"\")","v":"Lt"},"2023-08-23","IHARA GOLD",20,"dessecação",{"$f":"IFERROR(VLOOKUP(E13,Nota_Fiscal!$G$4:$L$1000,6,0),\"\")","v":"óleo"}]
["Defensivo Granulado",1,{"$f":"IFERROR(VLOOKUP(A14,Insumos!A:B,2,FALSE),\"\")","v":"Kg"},"2023-08-24","STRINGER WG",155,"dessecação",{"$f":"IFERROR(VLOOKUP(E14,Nota_Fiscal!$G$4:$L$1000,6,0),\"\")","v":"herbicida"}]
["Defensivo Granulado","Cilo",{"$f":"IFERROR(VLOOKUP(A15,Insumos!A:B,2,FALSE),\"\")","v":"Kg"},"2023-08-30","STRINGER WG",40,"dessecação",{"$f":"IFERROR(VLOOKUP(E15,Nota_Fiscal!$G$4:$L$1000,6,0),\"\")","v":"herbicida"}]
{"$rows_left_out":24}
{"sheet":"Atividade","index":4,"n_rows":15,"n_cols":1,"rows_kept":15,"cut":false,"hidden":true,"merged":[],"read":"row_number_cap"}
["CADASTRO DE ATIVIDADES"]
[]
["NOME DA ATIVIDADE"]
["soja"]
["milho"]
["sorgo"]
["milheto"]
["herbicida"]
["fungicida"]
["inseticida"]
["Adjuvante"]
["óleo"]
["Sequencial"]
["Adjuvante"]
["dessecação"]
{"$rows_left_out":1}
{"sheet":"Unidade","index":5,"n_rows":8,"n_cols":1,"rows_kept":8,"cut":false,"hidden":true,"merged":[]}
["CADASTRO DE UNIDADE"]
[]
["Unidade"]
["Kg"]
["Lt"]
["Un"]
["Bag"]
["Saco"]

{"sheet":"Insumos","index":6,"n_rows":9,"n_cols":3,"rows_kept":9,"cut":false,"hidden":true,"merged":[[0,0,0,2]]}
["INSUMOS POR CLASSE"]
[]
["INSUMO","UNIDADE","ESTOQUE INICIAL"]
["Adubo","Kg"]
["Defensivo Galão","Lt"]
["Defensivo Granulado","Kg"]
["Cloreto","Kg"]
["Semente de Soja","Kg"]
["Semente de milho","Kg"]

{"sheet":"Produtos","index":7,"n_rows":134,"n_cols":3,"rows_kept":134,"cut":false,"hidden":false,"merged":[[0,0,1,2]]}
["Produtos"]
[]
["Nome","Entrada","Saida"]
[{"$f":"IFERROR(INDEX(Nota_Fiscal!$G$4:$G$2504,MATCH(0,COUNTIF($A$3:A3,Nota_Fiscal!$G$4:$G$2504),0)),\"\")","v":"OFF ROAD"},{"$f":"SUMIFS(Nota_Fiscal!I4:I2504,Nota_Fiscal!G4:G2504,Tabela1[[#This Row],[Nome]])","v":600},{"$f":"SUMIFS(Saída!$F$4:$F$38,Saída!E$4:E$38,Tabela1[[#This Row],[Nome]])","v":220}]
[{"$f":"IFERROR(INDEX(Nota_Fiscal!$G$4:$G$2504,MATCH(0,COUNTIF($A$3:A4,Nota_Fiscal!$G$4:$G$2504),0)),\"\")","v":"POQUER "},{"$f":"SUMIFS(Nota_Fiscal!I5:I2505,Nota_Fiscal!G5:G2505,Tabela1[[#This Row],[Nome]])","v":480},{"$f":"SUMIFS(Saída!$F$4:$F$38,Saída!E$4:E$38,Tabela1[[#This Row],[Nome]])","v":0}]
[{"$f":"IFERROR(INDEX(Nota_Fiscal!$G$4:$G$2504,MATCH(0,COUNTIF($A$3:A5,Nota_Fiscal!$G$4:$G$2504),0)),\"\")","v":"IHARA GOLD"},{"$f":"SUMIFS(Nota_Fiscal!I6:I2506,Nota_Fiscal!G6:G2506,Tabela1[[#This Row],[Nome]])","v":360},{"$f":"SUMIFS(Saída!$F$4:$F$38,Saída!E$4:E$38,Tabela1[[#This Row],[Nome]])","v":80}]
[{"$f":"IFERROR(INDEX(Nota_Fiscal!$G$4:$G$2504,MATCH(0,COUNTIF($A$3:A6,Nota_Fiscal!$G$4:$G$2504),0)),\"\")","v":"TRICLON"},{"$f":"SUMIFS(Nota_Fiscal!I7:I2507,Nota_Fiscal!G7:G2507,Tabela1[[#This Row],[Nome]])","v":460},{"$f":"SUMIFS(Saída!$F$4:$F$38,Saída!E$4:E$38,Tabela1[[#This Row],[Nome]])","v":255}]
[{"$f":"IFERROR(INDEX(Nota_Fiscal!$G$4:$G$2504,MATCH(0,COUNTIF($A$3:A7,Nota_Fiscal!$G$4:$G$2504),0)),\"\")","v":"STRINGER WG"},{"$f":"SUMIFS(Nota_Fiscal!I8:I2508,Nota_Fiscal!G8:G2508,Tabela1[[#This Row],[Nome]])","v":2000},{"$f":"SUMIFS(Saída!$F$4:$F$38,Saída!E$4:E$38,Tabela1[[#This Row],[Nome]])","v":775}]
[{"$f":"IFERROR(INDEX(Nota_Fiscal!$G$4:$G$2504,MATCH(0,COUNTIF($A$3:A8,Nota_Fiscal!$G$4:$G$2504),0)),\"\")","v":"CADDET BB"},{"$f":"SUMIFS(Nota_Fiscal!I9:I2509,Nota_Fiscal!G9:G2509,Tabela1[[#This Row],[Nome]])","v":120},{"$f":"SUMIFS(Saída!$F$4:$F$38,Saída!E$4:E$38,Tabela1[[#This Row],[Nome]])","v":55.5}]
[{"$f":"IFERROR(INDEX(Nota_Fiscal!$G$4:$G$2504,MATCH(0,COUNTIF($A$3:A9,Nota_Fiscal!$G$4:$G$2504),0)),\"\")","v":"SAPEK MAX 880"},{"$f":"SUMIFS(Nota_Fiscal!I10:I2510,Nota_Fiscal!G10:G2510,Tabela1[[#This Row],[Nome]])","v":175},{"$f":"SUMIFS(Saída!$F$4:$F$38,Saída!E$4:E$38,Tabela1[[#This Row],[Nome]])","v":0}]
[{"$f":"IFERROR(INDEX(Nota_Fiscal!$G$4:$G$2504,MATCH(0,COUNTIF($A$3:A10,Nota_Fiscal!$G$4:$G$2504),0)),\"\")","v":"CLETODIM CCAB EC"},{"$f":"SUMIFS(Nota_Fiscal!I11:I2511,Nota_Fiscal!G11:G2511,Tabela1[[#This Row],[Nome]])","v":360},{"$f":"SUMIFS(Saída!$F$4:$F$38,Saída!E$4:E$38,Tabela1[[#This Row],[Nome]])","v":111}]
[{"$f":"IFERROR(INDEX(Nota_Fiscal!$G$4:$G$2504,MATCH(0,COUNTIF($A$3:A11,Nota_Fiscal!$G$4:$G$2504),0)),\"\")","v":"ATUMUS TANDER"},{"$f":"SUMIFS(Nota_Fiscal!I12:I2512,Nota_Fiscal!G12:G2512,Tabela1[[#This Row],[Nome]])","v":100},{"$f":"SUMIFS(Saída!$F$4:$F$38,Saída!E$4:E$38,Tabela1[[#This Row],[Nome]])","v":6.5}]
[{"$f":"IFERROR(INDEX(Nota_Fiscal!$G$4:$G$2504,MATCH(0,COUNTIF($A$3:A12,Nota_Fiscal!$G$4:$G$2504),0)),\"\")","v":0},{"$f":"SUMIFS(Nota_Fiscal!I13:I2513,Nota_Fiscal!G13:G2513,Tabela1[[#This Row],[Nome]])","v":0},{"$f":"SUMIFS(Saída!$F$4:$F$38,Saída!E$4:E$38,Tabela1[[#This Row],[Nome]])","v":0}]
[{"$f":"IFERROR(INDEX(Nota_Fiscal!$G$4:$G$2504,MATCH(0,COUNTIF($A$3:A13,Nota_Fiscal!$G$4:$G$2504),0)),\"\")","v":""},{"$f":"SUMIFS(Nota_Fiscal!I14:I2514,Nota_Fiscal!G14:G2514,Tabela1[[#This Row],[Nome]])","v":0},{"$f":"SUMIFS(Saída!$F$4:$F$38,Saída!E$4:E$38,Tabela1[[#This Row],[Nome]])","v":0}]
[{"$f":"IFERROR(INDEX(Nota_Fiscal!$G$4:$G$2504,MATCH(0,COUNTIF($A$3:A14,Nota_Fiscal!$G$4:$G$2504),0)),\"\")","v":""},{"$f":"SUMIFS(Nota_Fiscal!I15:I2515,Nota_Fiscal!G15:G2515,Tabela1[[#This Row],[Nome]])","v":0},{"$f":"SUMIFS(Saída!$F$4:$F$38,Saída!E$4:E$38,Tabela1[[#This Row],[Nome]])","v":0}]
{"$rows_left_out":120}
{"sheet":"Consulta_Estoque","index":8,"n_rows":726,"n_cols":6,"rows_kept":726,"cut":false,"hidden":true,"merged":[[1,2,1,5]]}
[]
[null,null,"CONSULTA DO ESTOQUE"]
[]
[null,null,"INSUMO","QUANTIDADE EM ESTOQUE","QUANTIDADE RETIRADA","SALDO NO ESTOQUE"]
[null,null,"Defensivo Granulado",{"$f":"(SUMIF(Nota_Fiscal!E4:E994,Consulta_Estoque!C5,Nota_Fiscal!I4:I994))+(SUMIF(Insumos!A4:A8,Consulta_Estoque!C5,Insumos!C4:C997))","v":2000},{"$f":"SUMIF(Saída!A:A,Consulta_Estoque!C5,Saída!F:F)","v":575},{"$f":"IF(D5-E5>=0,D5-E5,D5-E5&\"   Produto em Falta\")","v":1425}]
[]
[]
[]
[]
[]
[]
[]
[]
[]
[]
{"$rows_left_out":712}
{"sheet":"Relatorio_Atividades","index":9,"n_rows":1000,"n_cols":4,"rows_kept":1000,"cut":false,"hidden":false,"merged":[[1,1,1,3]]}
[]
[null,"RELATÓRIO DE ATIVIDADES E UTILIZAÇÃO DE INSUMOS"]
[]
[null,null,"Escolha a Atividade"]
[null,null,"dessecação"]
[]
[]
[null,"INSUMOS","QUANTIDADE UTILIZADAS","UNIDADE"]
[null,{"$f":"IFERROR(INDEX(Saída!$A$4:$A$38,SMALL((Saída!$G$4:$G$38=$C$5)*ROW(Saída!$G$4:$G$38),SUMPRODUCT(N(((Saída!$G$4:$G$38=$C$5)*ROW(Saída!$G$4:$G$38))=0))+ROW(Saída!$G$4:$G$38)-3)-3),\"\")","v":"Defensivo Granulado"},{"$f":"IFERROR(INDEX(Saída!$F$4:$F$38,SMALL((Saída!$G$4:$G$38=$C$5)*ROW(Saída!$G$4:$G$38),SUMPRODUCT(N(((Saída!$G$4:$G$38=$C$5)*ROW(Saída!$G$4:$G$38))=0))+ROW(Saída!$G$4:$G$38)-3)-3),\"\")","v":220},{"$f":"IFERROR(VLOOKUP(B9,Insumos!$A$4:$B$8,2,FALSE),\"\")","v":"Kg"}]
[null,"Defensivo Galão",165,{"$f":"IFERROR(VLOOKUP(B10,Insumos!$A$4:$B$8,2,FALSE),\"\")","v":"Lt"}]
[null,"Defensivo Galão",30,{"$f":"IFERROR(VLOOKUP(B11,Insumos!$A$4:$B$8,2,FALSE),\"\")","v":"Lt"}]
[null,"Defensivo Galão",8,{"$f":"IFERROR(VLOOKUP(B12,Insumos!$A$4:$B$8,2,FALSE),\"\")","v":"Lt"}]
[null,"Defensivo Granulado",120,{"$f":"IFERROR(VLOOKUP(B13,Insumos!$A$4:$B$8,2,FALSE),\"\")","v":"Kg"}]
[null,"Defensivo Galão",90,{"$f":"IFERROR(VLOOKUP(B14,Insumos!$A$4:$B$8,2,FALSE),\"\")","v":"Lt"}]
[null,"Defensivo Galão",4,{"$f":"IFERROR(VLOOKUP(B15,Insumos!$A$4:$B$8,2,FALSE),\"\")","v":"Lt"}]
{"$rows_left_out":985}