{"text_format":"1","workbook":"xlsx","n_sheets":3,"sheets":["ALFABETICA","JUSTIFICATIVA 8 HORAS","JUSTIFICATIVA 6 HORAS old"],"not_rendered":{"charts":0,"images":1,"macros":0,"external_links":1,"defined_names":2,"comments":0,"pivot_tables":0},"unopened":[],"bounds":{"document_bytes":16777216,"sheet_cells":100000,"rows_first":2000,"rows_last":500,"rows_between":2000,"halvings":0,"cell_chars":16384,"cell_head_chars":4096},"cells_cut":0,"cells_raw":0,"read":"whole","date_system":"1904"}

{"sheet":"ALFABETICA","index":0,"n_rows":224,"n_cols":6,"rows_kept":224,"cut":false,"hidden":true,"merged":[]}
["Matricula","Nome","Cargo","Secretaria","LocalTrab","Cpf"]
[42146,"1ª VARA DO TRABALHO DE BAURU TRT 15ª R.","INDENIZACAO","SECRETARIA MUNICIPAL DO MEIO AMBIENTE","SECRETARIA MUNICIPAL DO MEIO AMBIENTE","999.999.999-99"]
[42142,"3ª VARA CIVEL DA COMARCA DE BAURU","INDENIZACAO","SECRETARIA MUNICIPAL DO MEIO AMBIENTE","SECRETARIA MUNICIPAL DO MEIO AMBIENTE","740.568.438-64"]
[14888,"ACACIO MENEZES DE OLIVEIRA","COLETOR DE LIXO","SECRETARIA MUNICIPAL DO MEIO AMBIENTE","SECAO DE MANEJO ANIMAL","120.121.458-09"]
[32615,"ADRIANO BRUNO DA CRUZ REQUENA","FUNCAO DE CONFIANCA DE DIRETOR DIVISAO","SECRETARIA MUNICIPAL DO MEIO AMBIENTE","DIVISAO DE PRACAS E AREAS VERDES","290.742.718-04"]
[22745,"AGUINALDO JOAQUIM DOS SANTOS","AJUDANTE GERAL","SECRETARIA MUNICIPAL DO MEIO AMBIENTE","SECAO DE VETERINARIA","039.957.658-40"]
[29567,"AILTON DA SILVA ROSA","AJUDANTE GERAL","SECRETARIA MUNICIPAL DO MEIO AMBIENTE","SECAO DE JARDINAGEM","170.409.978-19"]
[34088,"ALEF ALBERT DA SILVA BOTELHO","AJUDANTE GERAL","SECRETARIA MUNICIPAL DO MEIO AMBIENTE","SECAO DE PRODUTOS RECICLAVEIS","424.020.548-40"]
[32279,"ALEX MARCIANO BUENO","CHEFE DE SECAO","SECRETARIA MUNICIPAL DO MEIO AMBIENTE","SECAO DE MANUTENCAO E CONSERVACAO DE PRA","337.681.098-28"]
[33503,"ALEXANDRE PEIXOTO DE OLIVEIRA","AJUDANTE GERAL","SECRETARIA MUNICIPAL DO MEIO AMBIENTE","SECAO DE PRODUTOS RECICLAVEIS","158.172.838-75"]
[34104,"ALEXANDRE VIEIRA","AJUDANTE GERAL","SECRETARIA MUNICIPAL DO MEIO AMBIENTE","SECAO DE PRODUTOS RECICLAVEIS","263.368.758-06"]
[34750,"ALICIA GIOLO HIPPOLITO","MEDICO VETERINARIO","SECRETARIA MUNICIPAL DO MEIO AMBIENTE","SECAO DE VETERINARIA","344.258.518-03"]
[32658,"ALISON MARTINS PEREIRA","AGENTE DE PROTECAO AMBIENTAL","SECRETARIA MUNICIPAL DO MEIO AMBIENTE","SECAO DE FISCALIZACAO AMBIENTAL","291.504.708-17"]
[15362,"ALONSO RAMOS DOS SANTOS","ENCARREGADO DE SECAO","SECRETARIA MUNICIPAL DO MEIO AMBIENTE","SECAO DE PRODUTOS RECICLAVEIS","120.029.908-67"]
[70608,"AMANDA MARTINS GASPARINI","CIÊNCIAS BIOLÓGICAS","SECRETARIA MUNICIPAL DO MEIO AMBIENTE","SECAO DE EDUCACAO AMBIENTAL","448.600.238-54"]
[33018,"AMANDA NEVES DE ASSIS MANSO","ATENDENTE","SECRETARIA MUNICIPAL DO MEIO AMBIENTE","DEPARTAMENTO DE ACOES E RECURSOS AMBIENT","222.679.888-95"]
[21022,"AMILTON JOSE DONDA","MOTORISTA","SECRETARIA MUNICIPAL DO MEIO AMBIENTE","DIVISAO DE JARDIM BOTANICO","002.728.007-16"]
[800507,"ANA PAULA SOUZA SEMENTILLE","AGENTE DE SANEAMENTO","SECRETARIA MUNICIPAL DO MEIO AMBIENTE","SECAO DE ESTUDOS E CONSCIENTIZACAO AMBIE","318.879.468-10"]
[32301,"ANDERSON RIBEIRO DOS SANTOS","GUARDA-PARQUE","SECRETARIA MUNICIPAL DO MEIO AMBIENTE","SECAO DE RESERVA ECOLOGICA","267.377.028-30"]
[29969,"ANDRE LUIZ DOS SANTOS","SERVENTE DE PEDREIRO","SECRETARIA MUNICIPAL DO MEIO AMBIENTE","DIVISAO DE PRACAS E AREAS VERDES","228.053.308-11"]
[20669,"ANDRE LUIZ GARCIA","AJUDANTE GERAL","SECRETARIA MUNICIPAL DO MEIO AMBIENTE","SECAO DE MANUTENCAO E CONSERVACAO DE PRA","110.622.048-08"]
[33743,"ANDRESSA RODRIGUES AGUIAR","CHEFE DE SECAO","SECRETARIA MUNICIPAL DO MEIO AMBIENTE","SECAO DE PLANEJAMENTO E EXECUCAO PAISAGI","405.060.938-08"]
[29386,"ANGELA MARIA DE CARVALHO LOPES","AJUDANTE GERAL","SECRETARIA MUNICIPAL DO MEIO AMBIENTE","SECAO DE MANEJO ANIMAL","274.956.768-84"]
[16192,"ANTENOR MARTINS","PEDREIRO","SECRETARIA MUNICIPAL DO MEIO AMBIENTE","DIVISAO DE PRACAS E AREAS VERDES","015.394.628-89"]
[29391,"ANTONIA TELMA DE ABREU MOURA","AJUDANTE GERAL","SECRETARIA MUNICIPAL DO MEIO AMBIENTE","SECAO DE ADM E MANUT PCAS E AREAS VERDES","251.573.228-36"]
[29736,"ANTONIO CARLOS DA CRUZ REQUENA","MOTORISTA","SECRETARIA MUNICIPAL DO MEIO AMBIENTE","SECAO DE MANUTENCAO E CONSERVACAO DE PRA","267.169.528-45"]
[31088,"ANTONIO CARLOS PEREZIM BASILIO","AJUDANTE GERAL","SECRETARIA MUNICIPAL DO MEIO AMBIENTE","SECAO DE COLECOES VEGETAIS","143.149.268-05"]
[20942,"ANTONIO FERREIRA ARMENDROZ","AJUDANTE GERAL","SECRETARIA MUNICIPAL DO MEIO AMBIENTE","SECAO DE MANUTENCAO E CONSERVACAO DE PRA","141.229.648-06"]
[14074,"ANTONIO MARQUES PEREIRA","JARDINEIRO","SECRETARIA MUNICIPAL DO MEIO AMBIENTE","SECAO DE MANUTENCAO E CONSERVACAO DE PRA","024.268.298-77"]
[30605,"ANTONIO NAVARRO","SERVENTE DE LIMPEZA","SECRETARIA MUNICIPAL DO MEIO AMBIENTE","SECAO DE MANUTENCAO E CONSERVACAO DE PRA","058.385.948-88"]
[32612,"ANTONIO ZANOTTO FILHO","FISCAL DE POSTURAS MUNICIPAIS","SECRETARIA MUNICIPAL DO MEIO AMBIENTE","DIVISAO DE CONTROLE E PROJETOS AMBIENTAI","100.005.328-86"]
[21007,"APARECIDO PEREIRA DE OLIVERA","AJUDANTE GERAL","SECRETARIA MUNICIPAL DO MEIO AMBIENTE","SECAO DE ADMINISTRACAO E MANUTENCAO - ZO","079.023.298-78"]
[34198,"BARBARA SILVA PEREIRA","AGENTE DE ADMINISTRACAO","SECRETARIA MUNICIPAL DO MEIO AMBIENTE","DIVISAO DE JARDIM BOTANICO","375.692.628-16"]
[28342,"BENEDITO DA CRUZ MIRANDA","AJUDANTE GERAL","SECRETARIA MUNICIPAL DO MEIO AMBIENTE","SECAO DE MANUTENCAO E CONSERVACAO DE PRA","137.237.358-60"]
[35737,"CARLOS GABRIEL LOPES DO NASCIMENTO","ENGENHEIRO AMBIENTAL","SECRETARIA MUNICIPAL DO MEIO AMBIENTE","DEPARTAMENTO ZOO-BOTANICO","101.501.169-18"]
[16191,"CARLOS ROBERTO REZENDE","CHEFE DE SECAO","SECRETARIA MUNICIPAL DO MEIO AMBIENTE","SECAO DE ADMINISTRACAO E MANUTENCAO - ZO","161.752.288-04"]
[13757,"CARLOS ROBERTO SIMOES","AJUDANTE GERAL","SECRETARIA MUNICIPAL DO MEIO AMBIENTE","SECAO DE PRODUTOS RECICLAVEIS","067.935.088-81"]
[21050,"CARMELINO DE OLIVEIRA","AJUDANTE GERAL","SECRETARIA MUNICIPAL DO MEIO AMBIENTE","SECAO DE JARDINAGEM","058.508.158-13"]
[29344,"CARMENLUCI APARECIDA DA SILVA CAMARGO","AGENTE DE ADMINISTRACAO","SECRETARIA MUNICIPAL DO MEIO AMBIENTE","DIVISAO DE CONTROLE E PROJETOS AMBIENTAI","378.615.038-95"]
[25754,"CICERO MARCELINO PATROCINIO","AJUDANTE GERAL","SECRETARIA MUNICIPAL DO MEIO AMBIENTE","SECAO DE PRODUTOS RECICLAVEIS","067.795.208-29"]
{"$rows_left_out":185}
{"sheet":"JUSTIFICATIVA 8 HORAS","index":1,"n_rows":59,"n_cols":31,"rows_kept":59,"cut":false,"hidden":false,"merged":[[52,18,52,20],[45,4,45,14],[45,16,45,21],[46,4,46,14],[46,16,46,21],[47,4,47,14],[47,16,47,21],[49,18,49,21],[40,0,40,21],[41,4,41,14],[41,16,41,21],[6,7,8,7],[6,8,8,8],[6,9,8,9],[6,10,8,10],[6,11,8,11],[42,4,42,14],[42,16,42,21],[43,4,43,14],[43,16,43,21],[44,4,44,14],[44,16,44,21],[40,22,47,22],[58,0,59,9],[6,0,8,1],[51,0,52,9],[6,12,7,14],[6,15,7,16],[54,0,54,21],[57,17,57,21],[6,2,8,2],[6,3,8,3],[6,4,8,4],[6,5,8,5],[6,6,8,6],[50,0,50,1],[50,18,50,20],[51,18,51,20],[3,0,4,21],[6,22,8,22],[9,22,39,22],[6,17,6,21],[7,17,7,18],[7,19,7,21],[8,27,10,27],[8,23,10,23],[8,24,10,24],[8,25,10,25],[8,26,10,26]]}
[]
[]
[null,null,null,null,null,null,null,null,null,null,null,null,null,null,null,null,null,null,null,null,"Matrícula: "]
[]
[]
[null,null,null,null,null,null,null,null,null,null,null,{"$f":"IFERROR(IF(ISBLANK(A10),\"00:00\",IF(#REF!>L10,#REF!-L10,\"00:00\")),\"---\")","v":"00:00"},null,null,null,{"$f":"(IF(ISBLANK(R10),(IF(ISBLANK(A10),\"00:00\",IF(#REF!>L10,#REF!-L10,\"00:00\"))),\"---\"))","v":"00:00"},{"$f":"(IF(ISBLANK(S10),\"'\",\"2\"))","v":"'"}]
["DATA",null,"Feriado","Dia Semana","Registro 1","Conver. 1","Registro 2","Conver. 2","Registro 3","Conver. 3","Registro 4","Conver. 4","PARA USO DO SERVIÇO DE ADMINISTRAÇÃO E EXPEDIENTE",null,null,"HORAS",null,"ASSINALE COM \"X\""]
[null,null,null,null,null,null,null,null,null,null,null,null,null,null,null,null,null,"MARCAÇÃO",null,"JUSTIFICATIVA"]
[null,null,null,null,null,null,null,null,null,null,null,null,"Intervalo de almoço realizado","Calculo Almoço","Horário de inicio banco ou extras","NEGATIVA","POSITIVA","INSERIR","EXCLUIR","ADICIONAR AO BANCO DE HORAS","DESCONTAR DO BANCO DE HORAS","HORAS POSITIVAS PARA PAGAMENTO",null,"Verifica se Almoço ta preenchido","Se trabalhou mais de seis horas","Desconta 01 de almoço","Almoço de 01:00","Quantidade correta de exta"]
[null,{"$f":"IF(ISBLANK(A10),\"\",A10)","v":""},{"$f":"IF(ISERROR(MATCH(A10,[1]FERIADOS!A$2:A$50,0)),\"\",\"F\")","v":""},{"$f":"WEEKDAY(A10,1)","v":6},null,{"$f":"IF(ISBLANK(E10),\"\",TIME(INT(E10/100),RIGHT(E10,2),0))","v":""},null,{"$f":"IF(ISBLANK(G10),\"\",TIME(INT(G10/100),RIGHT(G10,2),0))","v":""},null,{"$f":"IF(ISBLANK(I10),\"\",TIME(INT(I10/100),RIGHT(I10,2),0))","v":""},null,{"$f":"IF(ISBLANK(K10),\"\",TIME(INT(K10/100),RIGHT(K10,2),0))","v":""},{"$f":"IF(OR(ISBLANK(G10),ISBLANK(I10)),\"--:--\",J10-H10)","v":"--:--"},null,{"$f":"IF(OR(C10=\"F\",D10=1,D10=7,ISBLANK(A10),ISBLANK(E10),ISBLANK(G10),ISBLANK(I10),ISBLANK(K10)),\"--:--\",IF(M10>TIME(1,0,0),(F10+TIME(9,0,0)+(J10-H10)-TIME(1,0,0)),(F10+TIME(9,0,0))))","v":"--:--"},{"$f":"IFERROR(IF(OR(C10=\"F\",D10=1,D10=7,ISBLANK(A10)),\"--:-- \",(IF(IF(M10=0,((L10-F10)-TIME(8,0,0)),L10-O10)>0,\"0:00\",IF(M10=0,((L10-F10)-TIME(8,0,0)),L10-O10)))),\"--:--\")","v":"--:-- "},{"$f":"IFERROR(IF(OR(T10=\"X\",V10=\"X\"),IF(OR(C10=\"F\",D10=1,D10=7,ISBLANK(A10)),IF(M10>TIME(1,0,0),((H10-F10)+(L10-J10)-((TIME(1,0,0)-M10))),(H10-F10)+(L10-J10)),IF(L10>(O10+TIME(0,14,0)),L10-O10,\"--:--\")),\"--:--\"),\"--:--\")","v":"--:--"},null,null,null,null,null,"ETAPA 1"]
["2024-02-09",{"$f":"IF(ISBLANK(A11),\"\",A11)","v":"2024-02-09"},{"$f":"IF(ISERROR(MATCH(A11,[1]FERIADOS!A$2:A$50,0)),\"\",\"F\")","v":""},{"$f":"WEEKDAY(A11,1)","v":6},800,"08:00:00",1200,"12:00:00",1250,"12:50:00",1715,"17:15:00","00:50:00",{"$f":"IF(ISBLANK(A11),\"--:--\",(IF((J11-H11)<0,IF(OR(H11=\"0\",J11=0),\"00:00\",H11+TIME(1,0,0)),IF(OR(H11=\"0\",J11=0),\"00:00\",J11-H11))))","v":"00:50:00"},{"$f":"IF(OR(C11=\"F\",D11=1,D11=7,ISBLANK(A11),ISBLANK(E11),ISBLANK(G11),ISBLANK(I11),ISBLANK(K11)),F11,IF(M11>TIME(1,0,0),(F11+TIME(9,0,0)+(J11-H11)-TIME(1,0,0)),(F11+TIME(9,0,0))))","v":"17:00:00"},{"$f":"IFERROR(IF(OR(C11=\"F\",D11=1,D11=7,ISBLANK(A11)),\"--:-- \",(IF(IF(M11=0,((L11-F11)-TIME(8,0,0)),L11-O11)>0,\"0:00\",IF(M11=0,((L11-F11)-TIME(8,0,0)),L11-O11)))),\"--:--\")","v":"0:00"},{"$f":"IFERROR(IF(OR(T11=\"X\",V11=\"X\"),IF(OR(C11=\"F\",D11=1,D11=7,ISBLANK(A11)),IF(M11>TIME(1,0,0),((H11-F11)+(L11-J11)-((TIME(1,0,0)-M11))),(H11-F11)+(L11-J11)),IF(L11>(O11+TIME(0,14,10)),L11-O11,\"--:--\")),\"--:--\"),\"--:--\")","v":"00:15:00"},null,null,null,null,"X"]
["2024-02-13","2024-02-13","F",3,800,"08:00:00",1200,"12:00:00",1317,"13:17:00",1700,"17:00:00","01:17:00",{"$f":"IF(ISBLANK(A12),\"--:--\",(IF((J12-H12)<0,IF(OR(H12=\"0\",J12=0),\"00:00\",H12+TIME(1,0,0)),IF(OR(H12=\"0\",J12=0),\"00:00\",J12-H12))))","v":"01:17:00"},{"$f":"IF(OR(C12=\"F\",D12=1,D12=7,ISBLANK(A12),ISBLANK(E12),ISBLANK(G12),ISBLANK(I12),ISBLANK(K12)),\"--:--\",IF(M12>TIME(1,0,0),(F12+TIME(9,0,0)+(J12-H12)-TIME(1,0,0)),(F12+TIME(9,0,0))))","v":"--:--"},"--:-- ","08:00:00",null,null,"X",null,null,null,{"$f":"IF(OR(H12=0,OR(J12=0)),\"Não Realizou Intervalo de Almoço\",\"AlmoçoPreenchido\")","v":"AlmoçoPreenchido"},{"$f":"IF(L12-F12>TIME(6,0,0),\"Sim\",\"Não\")","v":"Sim"},{"$f":"IF(L12-F12>TIME(6,0,0),(L12-F12)-TIME(1,0,0),L12-F12)","v":"08:00:00"},{"$f":"IF(J12-H12>TIME(1,0,0),,H12+TIME(1,0,0))","v":"00:00:00"},{"$f":"((L12-F12)-N12)","v":"07:43:00"},{"$f":"IF(OR(C12=\"F\",D12=1,D12=7,ISBLANK(A12)),IF(OR(H12=0,I12=0),(L12-F12),))","v":"00:00:00"},{"$f":"IF(OR(H12=0,I12=0,(OR(L12-F12)>TIME(6,0,0))),((L12-F12)-TIME(1,0,0)),\"\")","v":"08:00:00"},{"$f":"IF((L12-F12)>TIME(6,0,0),\"1\",\"12\")","v":"1"}]
[null,"",{"$f":"IF(ISERROR(MATCH(A13,[1]FERIADOS!A$2:A$50,0)),\"\",\"F\")","v":""},6,null,"",null,"",null,"",null,"",{"$f":"IF(OR(ISBLANK(G13),ISBLANK(I13)),\"--:--\",J13-H13)","v":"--:--"},"--:--","--:--",{"$f":"IFERROR(IF(OR(C13=\"F\",D13=1,D13=7,ISBLANK(A13)),\"--:-- \",(IF(IF(M13=0,((L13-F13)-TIME(8,0,0)),L13-O13)>0,\"0:00\",IF(M13=0,((L13-F13)-TIME(8,0,0)),L13-O13)))),\"--:--\")","v":"--:-- "},"--:--"]
[null,"",{"$f":"IF(ISERROR(MATCH(A14,[1]FERIADOS!A$2:A$50,0)),\"\",\"F\")","v":""},6,null,"",null,"",null,"",null,"","--:--","--:--","--:--","--:-- ","--:--"]
[null,"",{"$f":"IF(ISERROR(MATCH(A15,[1]FERIADOS!A$2:A$50,0)),\"\",\"F\")","v":""},6,null,"",null,"",null,"",null,"","--:--","--:--","--:--","--:-- ","--:--"]
[null,"",{"$f":"IF(ISERROR(MATCH(A16,[1]FERIADOS!A$2:A$50,0)),\"\",\"F\")","v":""},6,null,"",null,"",null,"",null,"","--:--","--:--","--:--","--:-- ","--:--"]
[null,"",{"$f":"IF(ISERROR(MATCH(A17,[1]FERIADOS!A$2:A$50,0)),\"\",\"F\")","v":""},6,null,"",null,"",null,"",null,"","--:--","--:--","--:--","--:-- ","--:--",null,null,null,null,null,null,{"$f":"((L12-F12)-N12)","v":"07:43:00"}]
[null,"",{"$f":"IF(ISERROR(MATCH(A18,[1]FERIADOS!A$2:A$50,0)),\"\",\"F\")","v":""},6,null,"",null,"",null,"",null,"","--:--","--:--","--:--","--:-- ","--:--"]
[null,"",{"$f":"IF(ISERROR(MATCH(A19,[1]FERIADOS!A$2:A$50,0)),\"\",\"F\")","v":""},6,null,"",null,"",null,"",null,"","--:--","--:--","--:--","--:-- ","--:--"]
[null,"",{"$f":"IF(ISERROR(MATCH(A20,[1]FERIADOS!A$2:A$50,0)),\"\",\"F\")","v":""},6,null,"",null,"",null,"",null,"","--:--","--:--","--:--","--:-- ","--:--"]
[null,"",{"$f":"IF(ISERROR(MATCH(A21,[1]FERIADOS!A$2:A$50,0)),\"\",\"F\")","v":""},6,null,"",null,"",null,"",null,"",{"$f":"IF(OR(ISBLANK(G21),ISBLANK(I21)),\"--:--\",J21-H21)","v":"--:--"},null,{"$f":"IF(OR(C21=\"F\",D21=1,D21=7,ISBLANK(A21),ISBLANK(E21),ISBLANK(G21),ISBLANK(I21),ISBLANK(K21)),\"--:--\",IF(M21>TIME(1,0,0),(F21+TIME(9,0,0)+(J21-H21)-TIME(1,0,0)),(F21+TIME(9,0,0))))","v":"--:--"},"--:-- ","--:--"]
[null,"",{"$f":"IF(ISERROR(MATCH(A22,[1]FERIADOS!A$2:A$50,0)),\"\",\"F\")","v":""},6,null,"",null,"",null,"",null,"","--:--",null,"--:--","--:-- ","--:--"]
[null,"",{"$f":"IF(ISERROR(MATCH(A23,[1]FERIADOS!A$2:A$50,0)),\"\",\"F\")","v":""},6,null,"",null,"",null,"",null,"","--:--",null,"--:--","--:-- ","--:--"]
[null,"",{"$f":"IF(ISERROR(MATCH(A24,[1]FERIADOS!A$2:A$50,0)),\"\",\"F\")","v":""},6,null,"",null,"",null,"",null,"","--:--",null,"--:--","--:-- ","--:--"]
[null,"",{"$f":"IF(ISERROR(MATCH(A25,[1]FERIADOS!A$2:A$50,0)),\"\",\"F\")","v":""},6,null,"",null,"",null,"",null,"","--:--",null,"--:--","--:-- ","--:--"]
[null,"",{"$f":"IF(ISERROR(MATCH(A26,[1]FERIADOS!A$2:A$50,0)),\"\",\"F\")","v":""},6,null,"",null,"",null,"",null,"","--:--",null,"--:--","--:-- ","--:--"]
[null,"",{"$f":"IF(ISERROR(MATCH(A27,[1]FERIADOS!A$2:A$50,0)),\"\",\"F\")","v":""},6,null,"",null,"",null,"",null,"","--:--",null,"--:--","--:-- ","--:--"]
[null,"",{"$f":"IF(ISERROR(MATCH(A28,[1]FERIADOS!A$2:A$50,0)),\"\",\"F\")","v":""},6,null,"",null,"",null,"",null,"","--:--",null,"--:--","--:-- ","--:--"]
[null,"",{"$f":"IF(ISERROR(MATCH(A29,[1]FERIADOS!A$2:A$50,0)),\"\",\"F\")","v":""},6,null,"",null,"",null,"",null,"","--:--",null,"--:--","--:-- ","--:--"]
[null,"",{"$f":"IF(ISERROR(MATCH(A30,[1]FERIADOS!A$2:A$50,0)),\"\",\"F\")","v":""},6,null,"",null,"",null,"",null,"","--:--",null,"--:--","--:-- ","--:--"]
[null,"",{"$f":"IF(ISERROR(MATCH(A31,[1]FERIADOS!A$2:A$50,0)),\"\",\"F\")","v":""},6,null,"",null,"",null,"",null,"","--:--",null,"--:--","--:-- ","--:--"]
[null,"",{"$f":"IF(ISERROR(MATCH(A32,[1]FERIADOS!A$2:A$50,0)),\"\",\"F\")","v":""},6,null,"",null,"",null,"",null,"","--:--",null,"--:--","--:-- ","--:--"]
[null,"",{"$f":"IF(ISERROR(MATCH(A33,[1]FERIADOS!A$2:A$50,0)),\"\",\"F\")","v":""},6,null,"",null,"",null,"",null,"","--:--",null,"--:--","--:-- ","--:--"]
[null,"",{"$f":"IF(ISERROR(MATCH(A34,[1]FERIADOS!A$2:A$50,0)),\"\",\"F\")","v":""},6,null,"",null,"",null,"",null,"","--:--",null,"--:--","--:-- ","--:--"]
[null,"",{"$f":"IF(ISERROR(MATCH(A35,[1]FERIADOS!A$2:A$50,0)),\"\",\"F\")","v":""},6,null,"",null,"",null,"",null,"","--:--",null,"--:--","--:-- ","--:--"]
[null,"",{"$f":"IF(ISERROR(MATCH(A36,[1]FERIADOS!A$2:A$50,0)),\"\",\"F\")","v":""},6,null,"",null,"",null,"",null,"","--:--",null,"--:--","--:-- ","--:--"]
[null,"",{"$f":"IF(ISERROR(MATCH(A37,[1]FERIADOS!A$2:A$50,0)),\"\",\"F\")","v":""},6,null,"",null,"",null,"",null,"","--:--",null,"--:--","--:-- ","--:--"]
[null,"",{"$f":"IF(ISERROR(MATCH(A38,[1]FERIADOS!A$2:A$50,0)),\"\",\"F\")","v":""},6,null,"",null,"",null,"",null,"","--:--",null,"--:--","--:-- ","--:--"]
[null,"",{"$f":"IF(ISERROR(MATCH(A39,[1]FERIADOS!A$2:A$50,0)),\"\",\"F\")","v":""},6,null,"",null,"",null,"",null,"","--:--",null,"--:--","--:-- ","--:--"]
[null,"",{"$f":"IF(ISERROR(MATCH(A40,[1]FERIADOS!A$2:A$50,0)),\"\",\"F\")","v":""},6,null,"",null,"",null,"",null,"","--:--",null,"--:--","--:-- ","--:--"]
{"$rows_left_out":20}
{"sheet":"JUSTIFICATIVA 6 HORAS old","index":2,"n_rows":52,"n_cols":23,"rows_kept":52,"cut":false,"hidden":true,"merged":[[43,0,43,1],[43,17,43,19],[7,11,9,11],[7,16,7,20],[8,16,8,17],[8,18,8,20],[42,17,42,20],[7,6,9,6],[7,7,9,7],[7,8,9,8],[7,9,9,9],[7,10,9,10],[51,0,52,8],[44,0,45,8],[11,22,31,26],[7,22,9,26],[4,0,5,20],[7,0,9,1],[7,12,8,13],[7,14,8,15],[44,17,44,19],[45,17,45,19],[47,0,47,20],[50,16,50,20],[7,2,9,2],[7,3,9,3],[7,4,9,4],[7,5,9,5]]}
[]
[]
[]
[null,null,null,null,null,null,null,null,null,null,null,null,null,null,null,null,null,null,null,"Matrícula: ",30286]
[{"$f":"\"Senhor Diretor, eu, \"&IFERROR(INDEX(ALFABETICA!$B$2:$B$4997,MATCH(U4,ALFABETICA!$A$2:$A$4997,0))&\" inscrito(a) no CPF número \"&(INDEX(ALFABETICA!$F$2:$F$4997,MATCH(U4,ALFABETICA!$A$2:$A$4997,0)))&\",  cargo efetivo de \"&(INDEX(ALFABETICA!$C$2:$C$4997,MATCH(U4,ALFABETICA!$A$2:$A$4997,0)))&\", solicito autorização para que o Serviço de Administração e Expediente-SEMMA, faça os seguintes apontamentos em minha frequencia conforme relacionado abaixo. \",\"\")","v":"Senhor Diretor, eu, ELIANA PEREIRA DAMASCENO inscrito(a) no CPF número 190.969.948-92,  cargo efetivo de AGENTE DE ADMINISTRACAO, solicito autorização para que o Serviço de Administração e Expediente-SEMMA, faça os seguintes apontamentos em minha frequencia conforme relacionado abaixo. "}]
[]
[null,null,null,null,null,null,null,null,null,null,{"$f":"IFERROR(IF(ISBLANK(A11),\"00:00\",IF(#REF!>K11,#REF!-K11,\"00:00\")),\"---\")","v":"---"},null,null,null,{"$f":"(IF(ISBLANK(Q11),(IF(ISBLANK(A11),\"00:00\",IF(#REF!>K11,#REF!-K11,\"00:00\"))),\"---\"))","v":{"$error":"#REF!"}},{"$f":"(IF(ISBLANK(R11),\"'\",\"2\"))","v":"'"}]
["DATA",null,"Feriado","Dia Semana","Registro 1","Conver. 1","Registro 2","Conver. 2","Registro 3","Conver. 3","Registro 4","Conver. 4","PARA USO DO SERVIÇO DE ADMINISTRAÇÃO E EXPEDIENTE",null,"HORAS",null,"ASSINALE COM \"X\"",null,null,null,null,null,"ATENÇÃO"]
[null,null,null,null,null,null,null,null,null,null,null,null,null,null,null,null,"MARCAÇÃO",null,"JUSTIFICATIVA"]
[null,null,null,null,null,null,null,null,null,null,null,null,"Intervalo de almoço realizado","Horário de inicio banco ou extras","NEGATIVA","POSITIVA","INSERIR","EXCLUIR","ADICIONAR AO BANCO DE HORAS","DESCONTAR DO BANCO DE HORAS","HORAS POSITIVAS PARA PAGAMENTO"]
["2023-02-24",{"$f":"IF(ISBLANK(A11),\"\",A11)","v":"2023-02-24"},{"$f":"IF(ISERROR(MATCH(A11,[1]FERIADOS!A$2:A$50,0)),\"\",\"F\")","v":""},{"$f":"WEEKDAY(A11,1)","v":6},800,{"$f":"IF(ISBLANK(E11),\"\",TIME(INT(E11/100),RIGHT(E11,2),0))","v":"08:00:00"},1300,null,1400,null,1400,{"$f":"IF(ISBLANK(K11),\"\",TIME(INT(K11/100),RIGHT(K11,2),0))","v":"14:00:00"},{"$f":"IF(OR(ISBLANK(G11),ISBLANK(I11)),\"--:--\",J11-H11)","v":"00:00:00"},{"$f":"IF(OR(C11=\"F\",D11=1,D11=7,ISBLANK(A11),ISBLANK(E11),ISBLANK(G11),ISBLANK(I11),ISBLANK(K11)),\"--:--\",IF(M11>TIME(0,0,0),(F11+TIME(6,0,0)+(J11-H11)-TIME(0,0,0)),(F11+TIME(6,0,0))))","v":"14:00:00"},{"$f":"IF(OR(C11=\"F\",D11=1,D11=7,ISBLANK(A11),ISBLANK(E11),ISBLANK(G11),ISBLANK(I11),ISBLANK(K11)),\"--:--\",IF(K11<=N11,((K11-I11)+(G11-E11))-TIME(6,0,0),\"--:--\"))","v":"--:--"},{"$f":"IF(OR(S11=\"X\",U11=\"X\"),IF(OR(C11=\"F\",D11=1,D11=7,ISBLANK(A11)),(G11-E11+K11-I11),IF(K11>=(N11+TIME(0,15,0)),K11-N11,\"--:--\")),\"--:--\")","v":"--:--"}]
[null,{"$f":"IF(ISBLANK(A12),\"\",A12)","v":""},{"$f":"IF(ISERROR(MATCH(A12,[1]FERIADOS!A$2:A$50,0)),\"\",\"F\")","v":""},null,null,{"$f":"IF(ISBLANK(E12),\"\",TIME(INT(E12/100),RIGHT(E12,2),0))","v":""},0,null,0,null,null,{"$f":"IF(ISBLANK(K12),\"\",TIME(INT(K12/100),RIGHT(K12,2),0))","v":""},{"$f":"IF(OR(ISBLANK(G12),ISBLANK(I12)),\"--:--\",I12-G12)","v":"00:00:00"},{"$f":"IF(OR(C12=\"F\",D12=1,D12=7,ISBLANK(A12),,ISBLANK(E12),ISBLANK(G12),ISBLANK(I12),ISBLANK(K12)),\"--:--\",(E12+TIME(6,0,0)))","v":"--:--"},"--:--","--:--",null,null,null,null,null,null,"As células pintadas em amarelo estão bloqueadas por conterem fórmulas.\n\nPreencher na seguinte ordem, matrícula, data, registro 1 e registro 4.\n\nApós assinalar com “X” o tipo de marcação nos casos de inserção ou exclusão.\n\nNos casos de justificativa, em dias normais, se a jornada de trabalho for inferior a carga horária de 6(seis) horas, a planilha automaticamente irá calcular o saldo negativo exceto os pontos facultativos, feriados, sábados e domingos.\n\nNos demais dias onde a jornada de trabalho seja igual ou superior à 00h15min, o servidor, desde que autorizado pela chefia imediata antecipadamente, poderá assinalar com “X” para o lançamento em banco de horas ou pagamento nos casos excepcionais. \n"]
[null,"",{"$f":"IF(ISERROR(MATCH(A13,[1]FERIADOS!A$2:A$50,0)),\"\",\"F\")","v":""},{"$f":"WEEKDAY(A13,1)","v":6},null,"",0,null,0,null,null,"","00:00:00","--:--","--:--","--:--"]
[null,"",{"$f":"IF(ISERROR(MATCH(A14,[1]FERIADOS!A$2:A$50,0)),\"\",\"F\")","v":""},6,null,"",0,null,0,null,null,"","00:00:00","--:--","--:--","--:--"]
[null,"",{"$f":"IF(ISERROR(MATCH(A15,[1]FERIADOS!A$2:A$50,0)),\"\",\"F\")","v":""},6,null,"",0,null,0,null,null,"","00:00:00","--:--","--:--","--:--"]
[null,"",{"$f":"IF(ISERROR(MATCH(A16,[1]FERIADOS!A$2:A$50,0)),\"\",\"F\")","v":""},6,null,"",0,null,0,null,null,"","00:00:00","--:--","--:--","--:--"]
[null,"",{"$f":"IF(ISERROR(MATCH(A17,[1]FERIADOS!A$2:A$50,0)),\"\",\"F\")","v":""},6,null,"",0,null,0,null,null,"","00:00:00","--:--","--:--","--:--"]
[null,"",{"$f":"IF(ISERROR(MATCH(A18,[1]FERIADOS!A$2:A$50,0)),\"\",\"F\")","v":""},6,null,"",0,null,0,null,null,"","00:00:00","--:--","--:--","--:--"]
[null,"",{"$f":"IF(ISERROR(MATCH(A19,[1]FERIADOS!A$2:A$50,0)),\"\",\"F\")","v":""},6,null,"",0,null,0,null,null,"","00:00:00","--:--","--:--","--:--"]
[null,"",{"$f":"IF(ISERROR(MATCH(A20,[1]FERIADOS!A$2:A$50,0)),\"\",\"F\")","v":""},6,null,"",0,null,0,null,null,"","00:00:00","--:--","--:--","--:--"]
[null,"",{"$f":"IF(ISERROR(MATCH(A21,[1]FERIADOS!A$2:A$50,0)),\"\",\"F\")","v":""},6,null,"",0,null,0,null,null,"","00:00:00","--:--","--:--","--:--"]
[null,"",{"$f":"IF(ISERROR(MATCH(A22,[1]FERIADOS!A$2:A$50,0)),\"\",\"F\")","v":""},6,null,"",0,null,0,null,null,"","00:00:00","--:--","--:--","--:--"]
[null,"",{"$f":"IF(ISERROR(MATCH(A23,[1]FERIADOS!A$2:A$50,0)),\"\",\"F\")","v":""},6,null,"",0,null,0,null,null,"","00:00:00","--:--","--:--","--:--"]
[null,"",{"$f":"IF(ISERROR(MATCH(A24,[1]FERIADOS!A$2:A$50,0)),\"\",\"F\")","v":""},6,null,"",0,null,0,null,null,"","00:00:00","--:--","--:--","--:--"]
[null,"",{"$f":"IF(ISERROR(MATCH(A25,[1]FERIADOS!A$2:A$50,0)),\"\",\"F\")","v":""},6,null,"",0,null,0,null,null,"","00:00:00","--:--","--:--","--:--"]
[null,"",{"$f":"IF(ISERROR(MATCH(A26,[1]FERIADOS!A$2:A$50,0)),\"\",\"F\")","v":""},6,null,"",0,null,0,null,null,"","00:00:00","--:--","--:--","--:--"]
[null,"",{"$f":"IF(ISERROR(MATCH(A27,[1]FERIADOS!A$2:A$50,0)),\"\",\"F\")","v":""},6,null,"",0,null,0,null,null,"","00:00:00","--:--","--:--","--:--"]
[null,"",{"$f":"IF(ISERROR(MATCH(A28,[1]FERIADOS!A$2:A$50,0)),\"\",\"F\")","v":""},6,null,"",0,null,0,null,null,"","00:00:00","--:--","--:--","--:--"]
[null,"",{"$f":"IF(ISERROR(MATCH(A29,[1]FERIADOS!A$2:A$50,0)),\"\",\"F\")","v":""},6,null,"",0,null,0,null,null,"","00:00:00","--:--","--:--","--:--"]
[null,"",{"$f":"IF(ISERROR(MATCH(A30,[1]FERIADOS!A$2:A$50,0)),\"\",\"F\")","v":""},6,null,"",0,null,0,null,null,"","00:00:00","--:--","--:--","--:--"]
[null,"",{"$f":"IF(ISERROR(MATCH(A31,[1]FERIADOS!A$2:A$50,0)),\"\",\"F\")","v":""},6,null,"",0,null,0,null,null,"","00:00:00","--:--","--:--","--:--"]
[null,"",{"$f":"IF(ISERROR(MATCH(A32,[1]FERIADOS!A$2:A$50,0)),\"\",\"F\")","v":""},6,null,"",0,null,0,null,null,"","00:00:00","--:--","--:--","--:--"]
[null,"",{"$f":"IF(ISERROR(MATCH(A33,[1]FERIADOS!A$2:A$50,0)),\"\",\"F\")","v":""},6,null,"",0,null,0,null,null,"","00:00:00","--:--","--:--","--:--"]
[null,"",{"$f":"IF(ISERROR(MATCH(A34,[1]FERIADOS!A$2:A$50,0)),\"\",\"F\")","v":""},6,null,"",0,null,0,null,null,"","00:00:00","--:--","--:--","--:--"]
[null,"",{"$f":"IF(ISERROR(MATCH(A35,[1]FERIADOS!A$2:A$50,0)),\"\",\"F\")","v":""},6,null,"",0,null,0,null,null,"","00:00:00","--:--","--:--","--:--"]
[null,"",{"$f":"IF(ISERROR(MATCH(A36,[1]FERIADOS!A$2:A$50,0)),\"\",\"F\")","v":""},6,null,"",0,null,0,null,null,"","00:00:00","--:--","--:--","--:--"]
[null,"",{"$f":"IF(ISERROR(MATCH(A37,[1]FERIADOS!A$2:A$50,0)),\"\",\"F\")","v":""},6,null,"",0,null,0,null,null,"","00:00:00","--:--","--:--","--:--"]
[null,"",{"$f":"IF(ISERROR(MATCH(A38,[1]FERIADOS!A$2:A$50,0)),\"\",\"F\")","v":""},6,null,"",0,null,0,null,null,"","00:00:00","--:--","--:--","--:--"]
[null,"",{"$f":"IF(ISERROR(MATCH(A39,[1]FERIADOS!A$2:A$50,0)),\"\",\"F\")","v":""},6,null,"",0,null,0,null,null,"","00:00:00","--:--","--:--","--:--"]
[null,"",{"$f":"IF(ISERROR(MATCH(A40,[1]FERIADOS!A$2:A$50,0)),\"\",\"F\")","v":""},6,null,"",0,null,0,null,null,"","00:00:00","--:--","--:--","--:--"]
{"$rows_left_out":12}