{"text_format":"1","workbook":"xlsx","n_sheets":2,"sheets":["CADASTRO","Pessoal"],"not_rendered":{"charts":0,"images":2,"macros":1,"external_links":0,"defined_names":0,"comments":0,"pivot_tables":0},"unopened":[],"bounds":{"document_bytes":16777216,"sheet_cells":100000,"rows_first":2000,"rows_last":500,"rows_between":2000,"halvings":0,"cell_chars":16384,"cell_head_chars":4096},"cells_cut":0,"cells_raw":0,"read":"whole","date_system":"1900"}

{"sheet":"CADASTRO","index":0,"n_rows":10,"n_cols":14,"rows_kept":10,"cut":false,"hidden":false,"merged":[[4,9,5,9],[4,10,5,10],[4,11,4,13],[49,0,49,13],[4,2,5,2],[4,3,5,3],[4,4,5,4],[4,5,5,5],[4,6,4,8]]}
[null,"CADASTRO GERAL"]
[]
[]
[]
[null,null,null,null,null,null,null,null,null,null,null,"CAGED até dia 07"]
["CÓDIGO","RELAÇÃO DE EMPRESAS",null,null,null,null,null,null,null,null,null,"ADMISSÃO","DEMISSÃO","ENVIADOS"]
[202,"ANE ANE SPORTS INDUSTRIA E COMERCIO DE MATERIAIS ESPORTIVOS LTDA "]
[500,"JOANITA SANTOS SILVA "]
[]
[null,null,"z",null,"z","z","z","z","z","z","z"]

{"sheet":"Pessoal","index":1,"n_rows":49,"n_cols":14,"rows_kept":49,"cut":false,"hidden":false,"merged":[[1,12,1,13],[0,0,4,10],[0,11,0,13],[49,0,49,13],[2,12,2,13],[3,12,3,13],[4,12,4,13]]}
["SETOR PESSOAL",null,null,null,null,null,null,null,null,null,null,"LEGENDA"]
[null,null,null,null,null,null,null,null,null,null,null,0,"0 = Sem movimento"]
[null,null,null,null,null,null,null,null,null,null,null,1,"1 = Não Executado"]
[null,null,null,null,null,null,null,null,null,null,null,2,"2 = Em Andamento"]
[null,null,null,null,null,null,null,null,null,null,null,3,"3 = Concluido"]
["CÓDIGO","RELAÇÃO DE EMPRESAS","JAN","FEV","MAR","ABR","MAI","JUN","JUL","AGO","SET","OUT","NOV","DEZ"]
[{"$f":"IF(CADASTRO!A7=\"\",\"\",CADASTRO!A7)","v":202},{"$f":"IF(A7=\"\",\"\",(VLOOKUP(A7,CADASTRO!$A$7:$C$109,2,0)))","v":"ANE ANE SPORTS INDUSTRIA E COMERCIO DE MATERIAIS ESPORTIVOS LTDA "},0,0,0,0,0,0,0,0,0,0,0,0]
[{"$f":"IF(CADASTRO!A8=\"\",\"\",CADASTRO!A8)","v":500},{"$f":"IF(A8=\"\",\"\",(VLOOKUP(A8,CADASTRO!$A$7:$C$109,2,0)))","v":"JOANITA SANTOS SILVA "},0,0,0,0,0,0,0,0,0,0,0,0]
[{"$f":"IF(CADASTRO!A9=\"\",\"\",CADASTRO!A9)","v":""},{"$f":"IF(A9=\"\",\"\",(VLOOKUP(A9,CADASTRO!$A$7:$C$109,2,0)))","v":""},1,2,3,1,2,3,1,2,3,1,2,3]
[{"$f":"IF(CADASTRO!A10=\"\",\"\",CADASTRO!A10)","v":""},{"$f":"IF(A10=\"\",\"\",(VLOOKUP(A10,CADASTRO!$A$7:$C$109,2,0)))","v":""},0,0,0,0,0,0,0,0,0,0,0,0]
[{"$f":"IF(CADASTRO!A11=\"\",\"\",CADASTRO!A11)","v":""},{"$f":"IF(A11=\"\",\"\",(VLOOKUP(A11,CADASTRO!$A$7:$C$109,2,0)))","v":""},2,1,3,2,1,3,2,1,3,2,1,3]
[{"$f":"IF(CADASTRO!A12=\"\",\"\",CADASTRO!A12)","v":""},{"$f":"IF(A12=\"\",\"\",(VLOOKUP(A12,CADASTRO!$A$7:$C$109,2,0)))","v":""},0,0,0,0,0,0,0,0,0,0,0,0]
[null,null,0,0,0,0,0,0,0,0,0,0,0,0]
[null,null,0,0,0,0,0,0,0,0,0,0,0,0]
[null,null,0,0,0,0,0,0,0,0,0,0,0,0]
[null,null,0,0,0,0,0,0,0,0,0,0,0,0]
[null,null,0,0,0,0,0,0,0,0,0,0,0,0]
[null,null,0,0,0,0,0,0,0,0,0,0,0,0]
[null,null,0,0,0,0,0,0,0,0,0,0,0,0]
[null,null,0,0,0,0,0,0,0,0,0,0,0,0]
[null,null,0,0,0,0,0,0,0,0,0,0,0,0]
[null,null,0,0,0,0,0,0,0,0,0,0,0,0]
[null,null,0,0,0,0,0,0,0,0,0,0,0,0]
[null,null,0,0,0,0,0,0,0,0,0,0,0,0]
[null,null,0,0,0,0,0,0,0,0,0,0,0,0]
[null,null,0,0,0,0,0,0,0,0,0,0,0,0]
[null,null,0,0,0,0,0,0,0,0,0,0,0,0]
[null,null,0,0,0,0,0,0,0,0,0,0,0,0]
[null,null,0,0,0,0,0,0,0,0,0,0,0,0]
[null,null,0,0,0,0,0,0,0,0,0,0,0,0]
[null,null,0,0,0,0,0,0,0,0,0,0,0,0]
[null,null,0,0,0,0,0,0,0,0,0,0,0,0]
[null,null,0,0,0,0,0,0,0,0,0,0,0,0]
[null,null,0,0,0,0,0,0,0,0,0,0,0,0]
[null,null,0,0,0,0,0,0,0,0,0,0,0,0]
[null,null,0,0,0,0,0,0,0,0,0,0,0,0]
[null,null,0,0,0,0,0,0,0,0,0,0,0,0]
[null,null,0,0,0,0,0,0,0,0,0,0,0,0]
[null,null,0,0,0,0,0,0,0,0,0,0,0,0]
[null,null,0,0,0,0,0,0,0,0,0,0,0,0]
[null,null,0,0,0,0,0,0,0,0,0,0,0,0]
[null,null,0,0,0,0,0,0,0,0,0,0,0,0]
[null,null,0,0,0,0,0,0,0,0,0,0,0,0]
[null,null,0,0,0,0,0,0,0,0,0,0,0,0]
[null,null,0,0,0,0,0,0,0,0,0,0,0,0]
[null,null,0,0,0,0,0,0,0,0,0,0,0,0]
[null,null,0,0,0,0,0,0,0,0,0,0,0,0]
[null,null,0,0,0,0,0,0,0,0,0,0,0,0]
[null,null,0,0,0,0,0,0,0,0,0,0,0,0]