{"text_format":"1","workbook":"xlsx","n_sheets":4,"sheets":["RESUMO","02-10-24","03-10-24","04-10-24"],"not_rendered":{"charts":0,"images":0,"macros":0,"external_links":0,"defined_names":1,"comments":1,"pivot_tables":0},"unopened":[],"bounds":{"document_bytes":16777216,"sheet_cells":100000,"rows_first":2000,"rows_last":500,"rows_between":2000,"halvings":0,"cell_chars":16384,"cell_head_chars":4096},"cells_cut":0,"cells_raw":0,"read":"whole","date_system":"1900"}

{"sheet":"RESUMO","index":0,"n_rows":102,"n_cols":19,"rows_kept":102,"cut":false,"hidden":false,"merged":[]}
["PRODUTO","Quant. Vendida Quente","Quant. Vendida Gelada","UNID. VENDIDAS","VALOR UNID.","01/10/2024",null,null,null,"PLANILHAS",null,null,null,"GUIAS",null,null,null,"PRODUTO","PREÇO"]
[{"$f":"_xlfn._xlws.SORT(_xlfn.UNIQUE(R2:R102))","v":"AGUA 20 LITROS"},{"$f":"SUMPRODUCT(SUMIF(INDIRECT(\"'\"&$J$2:$J$4&\"'!A:A\"),A2,INDIRECT(\"'\"&$J$2:$J$4&\"'!B:B\")))","v":0},{"$f":"SUMPRODUCT(SUMIF(INDIRECT(\"'\"&$J$2:$J$4&\"'!A:A\"),A2,INDIRECT(\"'\"&$J$2:$J$4&\"'!c:c\")))","v":1},{"$f":"SUM(B2:C2)","v":1},{"$f":"IFERROR(VLOOKUP(A2,$R$2:$S$102,2,0),\"0\")","v":6},{"$f":"D2*E2","v":6},null,null,null,"02-10-24",null,null,1,{"$f":"IFERROR(INDEX(GUIAS,M2),\"\")","v":""},null,null,null,"Cerveja Skol 1 litro",{"$f":"VLOOKUP(R2,'02-10-24'!$A$1:$D$200,4,0)","v":6.916666666666667}]
["AGUA COM GÁS 510ML",{"$f":"SUMPRODUCT(SUMIF(INDIRECT(\"'\"&$J$2:$J$4&\"'!A:A\"),A3,INDIRECT(\"'\"&$J$2:$J$4&\"'!B:B\")))","v":0},{"$f":"SUMPRODUCT(SUMIF(INDIRECT(\"'\"&$J$2:$J$4&\"'!A:A\"),A3,INDIRECT(\"'\"&$J$2:$J$4&\"'!c:c\")))","v":1},{"$f":"SUM(B3:C3)","v":1},{"$f":"IFERROR(VLOOKUP(A3,$R$2:$S$102,2,0),\"0\")","v":1.1666666666666667},{"$f":"D3*E3","v":1.1666666666666667},null,null,null,"03-10-24",null,null,2,{"$f":"IFERROR(INDEX(GUIAS,M3),\"\")","v":""},null,null,null,"Cerveja Brahma 1 litro",{"$f":"VLOOKUP(R3,'02-10-24'!$A$1:$D$200,4,0)","v":6.541666666666667}]
["Agua Mamba Water 350ml",{"$f":"SUMPRODUCT(SUMIF(INDIRECT(\"'\"&$J$2:$J$4&\"'!A:A\"),A4,INDIRECT(\"'\"&$J$2:$J$4&\"'!B:B\")))","v":0},{"$f":"SUMPRODUCT(SUMIF(INDIRECT(\"'\"&$J$2:$J$4&\"'!A:A\"),A4,INDIRECT(\"'\"&$J$2:$J$4&\"'!c:c\")))","v":0},0,2.17,0,null,null,null,"04-10-24",null,null,3,{"$f":"IFERROR(INDEX(GUIAS,M4),\"\")","v":""},null,null,null,"Cerveja Brahma 1 litro",{"$f":"VLOOKUP(R4,'02-10-24'!$A$1:$D$200,4,0)","v":6.541666666666667}]
["AGUA SEM GÁS 510ML",{"$f":"SUMPRODUCT(SUMIF(INDIRECT(\"'\"&$J$2:$J$4&\"'!A:A\"),A5,INDIRECT(\"'\"&$J$2:$J$4&\"'!B:B\")))","v":0},{"$f":"SUMPRODUCT(SUMIF(INDIRECT(\"'\"&$J$2:$J$4&\"'!A:A\"),A5,INDIRECT(\"'\"&$J$2:$J$4&\"'!c:c\")))","v":0},0,0.83333333333333337,0,null,null,null,null,null,null,4,{"$f":"IFERROR(INDEX(GUIAS,M5),\"\")","v":""},null,null,null,"Cerveja Brahma 300ml",{"$f":"VLOOKUP(R5,'02-10-24'!$A$1:$D$200,4,0)","v":2.1513043478260867}]
["Bala Halls",{"$f":"SUMPRODUCT(SUMIF(INDIRECT(\"'\"&$J$2:$J$4&\"'!A:A\"),A6,INDIRECT(\"'\"&$J$2:$J$4&\"'!B:B\")))","v":0},{"$f":"SUMPRODUCT(SUMIF(INDIRECT(\"'\"&$J$2:$J$4&\"'!A:A\"),A6,INDIRECT(\"'\"&$J$2:$J$4&\"'!c:c\")))","v":0},0,1.1971000000000001,0,null,null,null,null,null,null,5,null,null,null,null,"Cerveja Antartica 1 litro",{"$f":"VLOOKUP(R6,'02-10-24'!$A$1:$D$200,4,0)","v":6.916666666666667}]
["Biscoito Piraque",{"$f":"SUMPRODUCT(SUMIF(INDIRECT(\"'\"&$J$2:$J$4&\"'!A:A\"),A7,INDIRECT(\"'\"&$J$2:$J$4&\"'!B:B\")))","v":0},{"$f":"SUMPRODUCT(SUMIF(INDIRECT(\"'\"&$J$2:$J$4&\"'!A:A\"),A7,INDIRECT(\"'\"&$J$2:$J$4&\"'!c:c\")))","v":0},0,2.5,0,null,null,null,null,null,null,6,null,null,null,null,"Cerveja Antartica 1 litro",{"$f":"VLOOKUP(R7,'02-10-24'!$A$1:$D$200,4,0)","v":6.916666666666667}]
["BONO",{"$f":"SUMPRODUCT(SUMIF(INDIRECT(\"'\"&$J$2:$J$4&\"'!A:A\"),A8,INDIRECT(\"'\"&$J$2:$J$4&\"'!B:B\")))","v":0},{"$f":"SUMPRODUCT(SUMIF(INDIRECT(\"'\"&$J$2:$J$4&\"'!A:A\"),A8,INDIRECT(\"'\"&$J$2:$J$4&\"'!c:c\")))","v":0},0,2.17,0,null,null,null,null,null,null,7,null,null,null,null,"Cerveja Budweiser 1 litro",{"$f":"VLOOKUP(R8,'02-10-24'!$A$1:$D$200,4,0)","v":6.541666666666667}]
["Brahma Duplo Malte",{"$f":"SUMPRODUCT(SUMIF(INDIRECT(\"'\"&$J$2:$J$4&\"'!A:A\"),A9,INDIRECT(\"'\"&$J$2:$J$4&\"'!B:B\")))","v":0},{"$f":"SUMPRODUCT(SUMIF(INDIRECT(\"'\"&$J$2:$J$4&\"'!A:A\"),A9,INDIRECT(\"'\"&$J$2:$J$4&\"'!c:c\")))","v":0},0,3.4249999999999998,0,null,null,null,null,null,null,8,null,null,null,null,"Cerveja Budweiser 1 litro",{"$f":"VLOOKUP(R9,'02-10-24'!$A$1:$D$200,4,0)","v":6.541666666666667}]
["Cachaça 200ml",{"$f":"SUMPRODUCT(SUMIF(INDIRECT(\"'\"&$J$2:$J$4&\"'!A:A\"),A10,INDIRECT(\"'\"&$J$2:$J$4&\"'!B:B\")))","v":0},{"$f":"SUMPRODUCT(SUMIF(INDIRECT(\"'\"&$J$2:$J$4&\"'!A:A\"),A10,INDIRECT(\"'\"&$J$2:$J$4&\"'!c:c\")))","v":2},2,1.5,3,null,null,null,null,null,null,9,null,null,null,null,"Cerveja Budweiser Long Neck",{"$f":"VLOOKUP(R10,'02-10-24'!$A$1:$D$200,4,0)","v":4}]
["Cachaça 300ml",{"$f":"SUMPRODUCT(SUMIF(INDIRECT(\"'\"&$J$2:$J$4&\"'!A:A\"),A11,INDIRECT(\"'\"&$J$2:$J$4&\"'!B:B\")))","v":0},{"$f":"SUMPRODUCT(SUMIF(INDIRECT(\"'\"&$J$2:$J$4&\"'!A:A\"),A11,INDIRECT(\"'\"&$J$2:$J$4&\"'!c:c\")))","v":0},0,2.4,0,null,null,null,null,null,null,10,null,null,null,null,"Cerveja Antartica 300ml",{"$f":"VLOOKUP(R11,'02-10-24'!$A$1:$D$200,4,0)","v":2.3252173913043479}]
["Cachaça 500ml",{"$f":"SUMPRODUCT(SUMIF(INDIRECT(\"'\"&$J$2:$J$4&\"'!A:A\"),A12,INDIRECT(\"'\"&$J$2:$J$4&\"'!B:B\")))","v":0},{"$f":"SUMPRODUCT(SUMIF(INDIRECT(\"'\"&$J$2:$J$4&\"'!A:A\"),A12,INDIRECT(\"'\"&$J$2:$J$4&\"'!c:c\")))","v":0},0,4,0,null,null,null,null,null,null,null,null,null,null,null,"Cerveja original 300ml",{"$f":"VLOOKUP(R12,'02-10-24'!$A$1:$D$200,4,0)","v":2.5652173913043477}]
["Cachaça Seleta 1 litro",{"$f":"SUMPRODUCT(SUMIF(INDIRECT(\"'\"&$J$2:$J$4&\"'!A:A\"),A13,INDIRECT(\"'\"&$J$2:$J$4&\"'!B:B\")))","v":0},{"$f":"SUMPRODUCT(SUMIF(INDIRECT(\"'\"&$J$2:$J$4&\"'!A:A\"),A13,INDIRECT(\"'\"&$J$2:$J$4&\"'!c:c\")))","v":0},0,29.9,0,null,null,null,null,null,null,null,null,null,null,null,"Cerveja Stella 600ml",{"$f":"VLOOKUP(R13,'02-10-24'!$A$1:$D$200,4,0)","v":7.55}]
["Carvão Roytec 2,5kg",{"$f":"SUMPRODUCT(SUMIF(INDIRECT(\"'\"&$J$2:$J$4&\"'!A:A\"),A14,INDIRECT(\"'\"&$J$2:$J$4&\"'!B:B\")))","v":0},{"$f":"SUMPRODUCT(SUMIF(INDIRECT(\"'\"&$J$2:$J$4&\"'!A:A\"),A14,INDIRECT(\"'\"&$J$2:$J$4&\"'!c:c\")))","v":0},0,8.5,0,null,null,null,null,null,null,null,null,null,null,null,"Cerveja original 1 Litro",{"$f":"VLOOKUP(R14,'02-10-24'!$A$1:$D$200,4,0)","v":7.4916666666666671}]
["Cerveja Amstel 1 litro",{"$f":"SUMPRODUCT(SUMIF(INDIRECT(\"'\"&$J$2:$J$4&\"'!A:A\"),A15,INDIRECT(\"'\"&$J$2:$J$4&\"'!B:B\")))","v":12},{"$f":"SUMPRODUCT(SUMIF(INDIRECT(\"'\"&$J$2:$J$4&\"'!A:A\"),A15,INDIRECT(\"'\"&$J$2:$J$4&\"'!c:c\")))","v":29},41,6.2458333333333336,256.07916666666665,null,null,null,null,null,null,null,null,null,null,null,"Cerveja original 473 ml",{"$f":"VLOOKUP(R15,'02-10-24'!$A$1:$D$200,4,0)","v":4.41}]
["Cerveja Amstel 473ml",{"$f":"SUMPRODUCT(SUMIF(INDIRECT(\"'\"&$J$2:$J$4&\"'!A:A\"),A16,INDIRECT(\"'\"&$J$2:$J$4&\"'!B:B\")))","v":552},{"$f":"SUMPRODUCT(SUMIF(INDIRECT(\"'\"&$J$2:$J$4&\"'!A:A\"),A16,INDIRECT(\"'\"&$J$2:$J$4&\"'!c:c\")))","v":34},586,3.4583333333333335,2026.5833333333335,null,null,null,null,null,null,null,null,null,null,null,"Vodka Orloff 1 litro",{"$f":"VLOOKUP(R16,'02-10-24'!$A$1:$D$200,4,0)","v":28.4}]
["Cerveja Antartica 1 litro",{"$f":"SUMPRODUCT(SUMIF(INDIRECT(\"'\"&$J$2:$J$4&\"'!A:A\"),A17,INDIRECT(\"'\"&$J$2:$J$4&\"'!B:B\")))","v":300},{"$f":"SUMPRODUCT(SUMIF(INDIRECT(\"'\"&$J$2:$J$4&\"'!A:A\"),A17,INDIRECT(\"'\"&$J$2:$J$4&\"'!c:c\")))","v":112},412,6.916666666666667,2849.666666666667,null,null,null,null,null,null,null,null,null,null,null,"Vodka Smirnoff 998ml",{"$f":"VLOOKUP(R17,'02-10-24'!$A$1:$D$200,4,0)","v":33.729999999999997}]
["Cerveja Antartica 300ml",{"$f":"SUMPRODUCT(SUMIF(INDIRECT(\"'\"&$J$2:$J$4&\"'!A:A\"),A18,INDIRECT(\"'\"&$J$2:$J$4&\"'!B:B\")))","v":0},{"$f":"SUMPRODUCT(SUMIF(INDIRECT(\"'\"&$J$2:$J$4&\"'!A:A\"),A18,INDIRECT(\"'\"&$J$2:$J$4&\"'!c:c\")))","v":0},0,2.3252173913043479,0,null,null,null,null,null,null,null,null,null,null,null,"Cerveja Sparten Lata 473ml",{"$f":"VLOOKUP(R18,'02-10-24'!$A$1:$D$200,4,0)","v":4.1583333333333332}]
["Cerveja Antartica lata 473ml",{"$f":"SUMPRODUCT(SUMIF(INDIRECT(\"'\"&$J$2:$J$4&\"'!A:A\"),A19,INDIRECT(\"'\"&$J$2:$J$4&\"'!B:B\")))","v":3036},{"$f":"SUMPRODUCT(SUMIF(INDIRECT(\"'\"&$J$2:$J$4&\"'!A:A\"),A19,INDIRECT(\"'\"&$J$2:$J$4&\"'!c:c\")))","v":33},3069,3.4166666666666665,10485.75,null,null,null,null,null,null,null,null,null,null,null,"Cerveja corona LongNeck",{"$f":"VLOOKUP(R19,'02-10-24'!$A$1:$D$200,4,0)","v":5.291666666666667}]
["Cerveja BADEN 350ml",{"$f":"SUMPRODUCT(SUMIF(INDIRECT(\"'\"&$J$2:$J$4&\"'!A:A\"),A20,INDIRECT(\"'\"&$J$2:$J$4&\"'!B:B\")))","v":0},{"$f":"SUMPRODUCT(SUMIF(INDIRECT(\"'\"&$J$2:$J$4&\"'!A:A\"),A20,INDIRECT(\"'\"&$J$2:$J$4&\"'!c:c\")))","v":0},0,4.34,0,null,null,null,null,null,null,null,null,null,null,null,"Cachaça Seleta 1 litro",{"$f":"VLOOKUP(R20,'02-10-24'!$A$1:$D$200,4,0)","v":29.9}]
["Cerveja Brahma 1 litro",{"$f":"SUMPRODUCT(SUMIF(INDIRECT(\"'\"&$J$2:$J$4&\"'!A:A\"),A21,INDIRECT(\"'\"&$J$2:$J$4&\"'!B:B\")))","v":12},{"$f":"SUMPRODUCT(SUMIF(INDIRECT(\"'\"&$J$2:$J$4&\"'!A:A\"),A21,INDIRECT(\"'\"&$J$2:$J$4&\"'!c:c\")))","v":7},19,6.541666666666667,124.29166666666667,null,null,null,null,null,null,null,null,null,null,null,"Wisky Red Label",{"$f":"VLOOKUP(R21,'02-10-24'!$A$1:$D$200,4,0)","v":74.900000000000006}]
["Cerveja Brahma 300ml",{"$f":"SUMPRODUCT(SUMIF(INDIRECT(\"'\"&$J$2:$J$4&\"'!A:A\"),A22,INDIRECT(\"'\"&$J$2:$J$4&\"'!B:B\")))","v":0},{"$f":"SUMPRODUCT(SUMIF(INDIRECT(\"'\"&$J$2:$J$4&\"'!A:A\"),A22,INDIRECT(\"'\"&$J$2:$J$4&\"'!c:c\")))","v":0},0,2.1513043478260867,0,null,null,null,null,null,null,null,null,null,null,null,"Wisky Cavalo Branco",{"$f":"VLOOKUP(R22,'02-10-24'!$A$1:$D$200,4,0)","v":62.9}]
["Cerveja Brahma 473ml",{"$f":"SUMPRODUCT(SUMIF(INDIRECT(\"'\"&$J$2:$J$4&\"'!A:A\"),A23,INDIRECT(\"'\"&$J$2:$J$4&\"'!B:B\")))","v":360},{"$f":"SUMPRODUCT(SUMIF(INDIRECT(\"'\"&$J$2:$J$4&\"'!A:A\"),A23,INDIRECT(\"'\"&$J$2:$J$4&\"'!c:c\")))","v":0},360,3.25,1170,null,null,null,null,null,null,null,null,null,null,null,"Refrigerante Pepsi 2 litros",{"$f":"VLOOKUP(R23,'02-10-24'!$A$1:$D$200,4,0)","v":6.04}]
["Cerveja Budweiser 1 litro",{"$f":"SUMPRODUCT(SUMIF(INDIRECT(\"'\"&$J$2:$J$4&\"'!A:A\"),A24,INDIRECT(\"'\"&$J$2:$J$4&\"'!B:B\")))","v":0},{"$f":"SUMPRODUCT(SUMIF(INDIRECT(\"'\"&$J$2:$J$4&\"'!A:A\"),A24,INDIRECT(\"'\"&$J$2:$J$4&\"'!c:c\")))","v":0},0,6.541666666666667,0,null,null,null,null,null,null,null,null,null,null,null,"Refrigerante Pepsi 200ml",{"$f":"VLOOKUP(R24,'02-10-24'!$A$1:$D$200,4,0)","v":1.25}]
["Cerveja Budweiser Latão",{"$f":"SUMPRODUCT(SUMIF(INDIRECT(\"'\"&$J$2:$J$4&\"'!A:A\"),A25,INDIRECT(\"'\"&$J$2:$J$4&\"'!B:B\")))","v":0},{"$f":"SUMPRODUCT(SUMIF(INDIRECT(\"'\"&$J$2:$J$4&\"'!A:A\"),A25,INDIRECT(\"'\"&$J$2:$J$4&\"'!c:c\")))","v":0},0,3.8533333333333335,0,null,null,null,null,null,null,null,null,null,null,null,"Refrigerante Antarctica 2 litros",{"$f":"VLOOKUP(R25,'02-10-24'!$A$1:$D$200,4,0)","v":6.63}]
["Cerveja Budweiser Long Neck",{"$f":"SUMPRODUCT(SUMIF(INDIRECT(\"'\"&$J$2:$J$4&\"'!A:A\"),A26,INDIRECT(\"'\"&$J$2:$J$4&\"'!B:B\")))","v":0},{"$f":"SUMPRODUCT(SUMIF(INDIRECT(\"'\"&$J$2:$J$4&\"'!A:A\"),A26,INDIRECT(\"'\"&$J$2:$J$4&\"'!c:c\")))","v":0},0,4,0,null,null,null,null,null,null,null,null,null,null,null,"Refrigerante Antarctica 200ml",{"$f":"VLOOKUP(R26,'02-10-24'!$A$1:$D$200,4,0)","v":1.25}]
["Cerveja Budweiser LongNeck",{"$f":"SUMPRODUCT(SUMIF(INDIRECT(\"'\"&$J$2:$J$4&\"'!A:A\"),A27,INDIRECT(\"'\"&$J$2:$J$4&\"'!B:B\")))","v":0},{"$f":"SUMPRODUCT(SUMIF(INDIRECT(\"'\"&$J$2:$J$4&\"'!A:A\"),A27,INDIRECT(\"'\"&$J$2:$J$4&\"'!c:c\")))","v":0},0,3.9916666666666667,0,null,null,null,null,null,null,null,null,null,null,null,"Refrigerante Antarctica 350ml",{"$f":"VLOOKUP(R27,'02-10-24'!$A$1:$D$200,4,0)","v":0.96666666666666667}]
["Cerveja corona LongNeck",{"$f":"SUMPRODUCT(SUMIF(INDIRECT(\"'\"&$J$2:$J$4&\"'!A:A\"),A28,INDIRECT(\"'\"&$J$2:$J$4&\"'!B:B\")))","v":0},{"$f":"SUMPRODUCT(SUMIF(INDIRECT(\"'\"&$J$2:$J$4&\"'!A:A\"),A28,INDIRECT(\"'\"&$J$2:$J$4&\"'!c:c\")))","v":0},0,5.291666666666667,0,null,null,null,null,null,null,null,null,null,null,null,"Refrigerante Sukita 2 litros",{"$f":"VLOOKUP(R28,'02-10-24'!$A$1:$D$200,4,0)","v":4.791666666666667}]
["Cerveja Heineken 350ml",{"$f":"SUMPRODUCT(SUMIF(INDIRECT(\"'\"&$J$2:$J$4&\"'!A:A\"),A29,INDIRECT(\"'\"&$J$2:$J$4&\"'!B:B\")))","v":0},{"$f":"SUMPRODUCT(SUMIF(INDIRECT(\"'\"&$J$2:$J$4&\"'!A:A\"),A29,INDIRECT(\"'\"&$J$2:$J$4&\"'!c:c\")))","v":0},0,4.1574999999999998,0,null,null,null,null,null,null,null,null,null,null,null,"Refrigerante Sukita Laranja 200ml",{"$f":"VLOOKUP(R29,'02-10-24'!$A$1:$D$200,4,0)","v":1.39}]
["Cerveja Heineken 473ml",{"$f":"SUMPRODUCT(SUMIF(INDIRECT(\"'\"&$J$2:$J$4&\"'!A:A\"),A30,INDIRECT(\"'\"&$J$2:$J$4&\"'!B:B\")))","v":288},{"$f":"SUMPRODUCT(SUMIF(INDIRECT(\"'\"&$J$2:$J$4&\"'!A:A\"),A30,INDIRECT(\"'\"&$J$2:$J$4&\"'!c:c\")))","v":38},326,4.75,1548.5,null,null,null,null,null,null,null,null,null,null,null,"Energetico Red Bull 250ml",{"$f":"VLOOKUP(R30,'02-10-24'!$A$1:$D$200,4,0)","v":7.29}]
["Cerveja Heineken 600ml",{"$f":"SUMPRODUCT(SUMIF(INDIRECT(\"'\"&$J$2:$J$4&\"'!A:A\"),A31,INDIRECT(\"'\"&$J$2:$J$4&\"'!B:B\")))","v":0},{"$f":"SUMPRODUCT(SUMIF(INDIRECT(\"'\"&$J$2:$J$4&\"'!A:A\"),A31,INDIRECT(\"'\"&$J$2:$J$4&\"'!c:c\")))","v":0},0,8.2899999999999991,0,null,null,null,null,null,null,null,null,null,null,null,"H2OH 1,5 litro limoneto",{"$f":"VLOOKUP(R31,'02-10-24'!$A$1:$D$200,4,0)","v":6.6000000000000005}]
["Cerveja Itaipava Latão",{"$f":"SUMPRODUCT(SUMIF(INDIRECT(\"'\"&$J$2:$J$4&\"'!A:A\"),A32,INDIRECT(\"'\"&$J$2:$J$4&\"'!B:B\")))","v":0},{"$f":"SUMPRODUCT(SUMIF(INDIRECT(\"'\"&$J$2:$J$4&\"'!A:A\"),A32,INDIRECT(\"'\"&$J$2:$J$4&\"'!c:c\")))","v":0},0,2.5124999999999997,0,null,null,null,null,null,null,null,null,null,null,null,"Bala Halls",{"$f":"VLOOKUP(R32,'02-10-24'!$A$1:$D$200,4,0)","v":1.1971000000000001}]
["Cerveja Lagunitas 350ml",{"$f":"SUMPRODUCT(SUMIF(INDIRECT(\"'\"&$J$2:$J$4&\"'!A:A\"),A33,INDIRECT(\"'\"&$J$2:$J$4&\"'!B:B\")))","v":0},{"$f":"SUMPRODUCT(SUMIF(INDIRECT(\"'\"&$J$2:$J$4&\"'!A:A\"),A33,INDIRECT(\"'\"&$J$2:$J$4&\"'!c:c\")))","v":0},0,4,0,null,null,null,null,null,null,null,null,null,null,null,"Skol Beats",{"$f":"VLOOKUP(R33,'02-10-24'!$A$1:$D$200,4,0)","v":4.8}]
["Cerveja Lokal latão",{"$f":"SUMPRODUCT(SUMIF(INDIRECT(\"'\"&$J$2:$J$4&\"'!A:A\"),A34,INDIRECT(\"'\"&$J$2:$J$4&\"'!B:B\")))","v":0},{"$f":"SUMPRODUCT(SUMIF(INDIRECT(\"'\"&$J$2:$J$4&\"'!A:A\"),A34,INDIRECT(\"'\"&$J$2:$J$4&\"'!c:c\")))","v":0},0,2.2833333333333332,0,null,null,null,null,null,null,null,null,null,null,null,"Biscoito Piraque",{"$f":"VLOOKUP(R34,'02-10-24'!$A$1:$D$200,4,0)","v":2.5}]
["Cerveja original 1 Litro",{"$f":"SUMPRODUCT(SUMIF(INDIRECT(\"'\"&$J$2:$J$4&\"'!A:A\"),A35,INDIRECT(\"'\"&$J$2:$J$4&\"'!B:B\")))","v":0},{"$f":"SUMPRODUCT(SUMIF(INDIRECT(\"'\"&$J$2:$J$4&\"'!A:A\"),A35,INDIRECT(\"'\"&$J$2:$J$4&\"'!c:c\")))","v":0},0,7.4916666666666671,0,null,null,null,null,null,null,null,null,null,null,null,"Cerveja Heineken 600ml",{"$f":"VLOOKUP(R35,'02-10-24'!$A$1:$D$200,4,0)","v":8.2899999999999991}]
["Cerveja original 300ml",{"$f":"SUMPRODUCT(SUMIF(INDIRECT(\"'\"&$J$2:$J$4&\"'!A:A\"),A36,INDIRECT(\"'\"&$J$2:$J$4&\"'!B:B\")))","v":0},{"$f":"SUMPRODUCT(SUMIF(INDIRECT(\"'\"&$J$2:$J$4&\"'!A:A\"),A36,INDIRECT(\"'\"&$J$2:$J$4&\"'!c:c\")))","v":0},0,2.5652173913043477,0,null,null,null,null,null,null,null,null,null,null,null,"Agua Mamba Water 350ml",{"$f":"VLOOKUP(R36,'02-10-24'!$A$1:$D$200,4,0)","v":2.17}]
["Cerveja original 473 ml",{"$f":"SUMPRODUCT(SUMIF(INDIRECT(\"'\"&$J$2:$J$4&\"'!A:A\"),A37,INDIRECT(\"'\"&$J$2:$J$4&\"'!B:B\")))","v":0},{"$f":"SUMPRODUCT(SUMIF(INDIRECT(\"'\"&$J$2:$J$4&\"'!A:A\"),A37,INDIRECT(\"'\"&$J$2:$J$4&\"'!c:c\")))","v":0},0,4.41,0,null,null,null,null,null,null,null,null,null,null,null,"Cerveja Lagunitas 350ml",{"$f":"VLOOKUP(R37,'02-10-24'!$A$1:$D$200,4,0)","v":4}]
["Cerveja Skol 1 litro",{"$f":"SUMPRODUCT(SUMIF(INDIRECT(\"'\"&$J$2:$J$4&\"'!A:A\"),A38,INDIRECT(\"'\"&$J$2:$J$4&\"'!B:B\")))","v":12},{"$f":"SUMPRODUCT(SUMIF(INDIRECT(\"'\"&$J$2:$J$4&\"'!A:A\"),A38,INDIRECT(\"'\"&$J$2:$J$4&\"'!c:c\")))","v":4},16,6.916666666666667,110.66666666666667,null,null,null,null,null,null,null,null,null,null,null,"Cerveja Amstel 1 litro",{"$f":"VLOOKUP(R38,'02-10-24'!$A$1:$D$200,4,0)","v":6.2458333333333336}]
["Cerveja Skol Beats Lata 269ml",{"$f":"SUMPRODUCT(SUMIF(INDIRECT(\"'\"&$J$2:$J$4&\"'!A:A\"),A39,INDIRECT(\"'\"&$J$2:$J$4&\"'!B:B\")))","v":0},{"$f":"SUMPRODUCT(SUMIF(INDIRECT(\"'\"&$J$2:$J$4&\"'!A:A\"),A39,INDIRECT(\"'\"&$J$2:$J$4&\"'!c:c\")))","v":0},0,5.14,0,null,null,null,null,null,null,null,null,null,null,null,"Cerveja BADEN 350ml",{"$f":"VLOOKUP(R39,'02-10-24'!$A$1:$D$200,4,0)","v":4.34}]
["Cerveja Skol Lata 473ml",{"$f":"SUMPRODUCT(SUMIF(INDIRECT(\"'\"&$J$2:$J$4&\"'!A:A\"),A40,INDIRECT(\"'\"&$J$2:$J$4&\"'!B:B\")))","v":0},{"$f":"SUMPRODUCT(SUMIF(INDIRECT(\"'\"&$J$2:$J$4&\"'!A:A\"),A40,INDIRECT(\"'\"&$J$2:$J$4&\"'!c:c\")))","v":0},0,3.4916666666666667,0,null,null,null,null,null,null,null,null,null,null,null,"Refrigerante ItaUp sabores",{"$f":"VLOOKUP(R40,'02-10-24'!$A$1:$D$200,4,0)","v":3.15}]
{"$rows_left_out":63}
{"sheet":"02-10-24","index":1,"n_rows":145,"n_cols":12,"rows_kept":145,"cut":false,"hidden":false,"merged":[]}
["Produto","Quantidade Vendida Quente","Quantidade Vendida Gelada","Preço Custo"]
["AMBEV"]
["Coluna1","Coluna2","Coluna3","Coluna4","Coluna5","Coluna6","Coluna7","Coluna8","Coluna9","Coluna10","Coluna11"]
["Cerveja Skol 1 litro",null,null,{"$f":"83/12","v":6.916666666666667}]
["Cerveja Brahma 1 litro",null,6,{"$f":"78.5/12","v":6.541666666666667}]
["Cerveja Brahma 1 litro",null,null,{"$f":"78.5/12","v":6.541666666666667}]
["Cerveja Brahma 300ml",null,null,{"$f":"49.48/23","v":2.1513043478260867}]
["Cerveja Antartica 1 litro",24,19,{"$f":"83/12","v":6.916666666666667}]
["Cerveja Antartica 1 litro",null,null,{"$f":"83/12","v":6.916666666666667}]
["Cerveja Budweiser 1 litro",null,null,{"$f":"78.5/12","v":6.541666666666667}]
["Cerveja Budweiser 1 litro",null,null,{"$f":"78.5/12","v":6.541666666666667}]
["Cerveja Budweiser Long Neck",null,null,4]
["Cerveja Antartica 300ml",null,null,{"$f":"53.48/23","v":2.3252173913043479}]
["Cerveja original 300ml",null,null,{"$f":"59/23","v":2.5652173913043477}]
["Cerveja Stella 600ml",null,null,{"$f":"181.2/24","v":7.55}]
["Cerveja original 1 Litro",null,null,{"$f":"89.9/12","v":7.4916666666666671}]
["Cerveja original 473 ml",null,null,{"$f":"4.41","v":4.41}]
["Vodka Orloff 1 litro",null,null,28.4]
["Vodka Smirnoff 998ml",null,null,33.729999999999997]
["Cerveja Sparten Lata 473ml",null,null,{"$f":"49.9/12","v":4.1583333333333332}]
["Cerveja corona LongNeck",null,null,{"$f":"127/24","v":5.291666666666667}]
["Cachaça Seleta 1 litro",null,null,29.9]
["Wisky Red Label",null,null,74.900000000000006]
["Wisky Cavalo Branco",null,null,62.9]
["Refrigerante Pepsi 2 litros",null,1,{"$f":"36.24/6","v":6.04}]
["Refrigerante Pepsi 200ml",null,null,{"$f":"15/12","v":1.25}]
["Refrigerante Antarctica 2 litros",null,2,{"$f":"39.78/6","v":6.63}]
["Refrigerante Antarctica 200ml",null,null,{"$f":"15/12","v":1.25}]
["Refrigerante Antarctica 350ml",null,null,{"$f":"11.6/12","v":0.96666666666666667}]
["Refrigerante Sukita 2 litros",null,null,{"$f":"28.75/6","v":4.791666666666667}]
["Refrigerante Sukita Laranja 200ml",null,null,{"$f":"16.68/12","v":1.39}]
["Energetico Red Bull 250ml",null,null,7.29]
["H2OH 1,5 litro limoneto",null,null,{"$f":"39.6/6","v":6.6000000000000005}]
["Bala Halls",null,null,1.1971000000000001]
["Skol Beats",null,null,{"$f":"38.4/8","v":4.8}]
["Biscoito Piraque",null,null,2.5]
[null,null,"Venda Custo"]
["HEINEKEN"]
["Cerveja Heineken 600ml",null,null,8.2899999999999991]
["Agua Mamba Water 350ml",null,null,2.17]
{"$rows_left_out":106}
{"sheet":"03-10-24","index":2,"n_rows":145,"n_cols":12,"rows_kept":145,"cut":false,"hidden":false,"merged":[]}
["Produto","Quantidade Vendida Quente","Quantidade Vendida Gelada","Preço Custo"]
["AMBEV"]
["Coluna1","Coluna2","Coluna3","Coluna4","Coluna5","Coluna6","Coluna7","Coluna8","Coluna9","Coluna10","Coluna11"]
["Cerveja Skol 1 litro",null,2,{"$f":"83/12","v":6.916666666666667}]
["Cerveja Brahma 1 litro",null,null,{"$f":"78.5/12","v":6.541666666666667}]
["Cerveja Brahma 1 litro",null,null,{"$f":"78.5/12","v":6.541666666666667}]
["Cerveja Brahma 300ml",null,null,{"$f":"49.48/23","v":2.1513043478260867}]
["Cerveja Antartica 1 litro",{"$f":"6*12","v":72},15,{"$f":"83/12","v":6.916666666666667}]
["Cerveja Antartica 1 litro",null,null,{"$f":"83/12","v":6.916666666666667}]
["Cerveja Budweiser 1 litro",null,null,{"$f":"78.5/12","v":6.541666666666667}]
["Cerveja Budweiser 1 litro",null,null,{"$f":"78.5/12","v":6.541666666666667}]
["Cerveja Budweiser Long Neck",null,null,4]
["Cerveja Antartica 300ml",null,null,{"$f":"53.48/23","v":2.3252173913043479}]
["Cerveja original 300ml",null,null,{"$f":"59/23","v":2.5652173913043477}]
["Cerveja Stella 600ml",null,null,{"$f":"181.2/24","v":7.55}]
["Cerveja original 1 Litro",null,null,{"$f":"89.9/12","v":7.4916666666666671}]
["Cerveja original 473 ml",null,null,{"$f":"4.41","v":4.41}]
["Vodka Orloff 1 litro",null,null,28.4]
["Vodka Smirnoff 998ml",null,null,33.729999999999997]
["Cerveja Sparten Lata 473ml",null,null,{"$f":"49.9/12","v":4.1583333333333332}]
["Cerveja corona LongNeck",null,null,{"$f":"127/24","v":5.291666666666667}]
["Cachaça Seleta 1 litro",null,null,29.9]
["Wisky Red Label",null,null,74.900000000000006]
["Wisky Cavalo Branco",null,null,62.9]
["Refrigerante Pepsi 2 litros",null,1,6]
["Refrigerante Pepsi 200ml",null,null,{"$f":"15/12","v":1.25}]
["Refrigerante Antarctica 2 litros",6,null,{"$f":"39.78/6","v":6.63}]
["Refrigerante Antarctica 200ml",null,null,{"$f":"15/12","v":1.25}]
["Refrigerante Antarctica 350ml",null,null,{"$f":"11.6/12","v":0.96666666666666667}]
["Refrigerante Sukita 2 litros",null,null,{"$f":"28.75/6","v":4.791666666666667}]
["Refrigerante Sukita Laranja 200ml",null,null,{"$f":"16.68/12","v":1.39}]
["Energetico Red Bull 250ml",null,null,7.29]
["H2OH 1,5 litro limoneto",null,null,{"$f":"39.6/6","v":6.6000000000000005}]
["Bala Halls",null,null,1.1971000000000001]
["Skol Beats",null,null,{"$f":"38.4/8","v":4.8}]
["Biscoito Piraque",null,null,2.5]
[null,null,"Venda Custo"]
["HEINEKEN"]
["Cerveja Heineken 600ml",null,null,8.2899999999999991]
["Agua Mamba Water 350ml",null,null,2.17]
{"$rows_left_out":106}
{"sheet":"04-10-24","index":3,"n_rows":145,"n_cols":12,"rows_kept":145,"cut":false,"hidden":false,"merged":[]}
["Produto","Quantidade Vendida Quente","Quantidade Vendida Gelada","Preço Custo"]
["AMBEV"]
["Coluna1","Coluna2","Coluna3","Coluna4","Coluna5","Coluna6","Coluna7","Coluna8","Coluna9","Coluna10","Coluna11"]
["Cerveja Skol 1 litro",12,2,{"$f":"83/12","v":6.916666666666667}]
["Cerveja Brahma 1 litro",12,1,{"$f":"78.5/12","v":6.541666666666667}]
["Cerveja Brahma 1 litro",null,null,{"$f":"78.5/12","v":6.541666666666667}]
["Cerveja Brahma 300ml",null,null,{"$f":"49.48/23","v":2.1513043478260867}]
["Cerveja Antartica 1 litro",{"$f":"17*12","v":204},78,{"$f":"83/12","v":6.916666666666667}]
["Cerveja Antartica 1 litro",null,null,{"$f":"83/12","v":6.916666666666667}]
["Cerveja Budweiser 1 litro",null,null,{"$f":"78.5/12","v":6.541666666666667}]
["Cerveja Budweiser 1 litro",null,null,{"$f":"78.5/12","v":6.541666666666667}]
["Cerveja Budweiser Long Neck",null,null,4]
["Cerveja Antartica 300ml",null,null,{"$f":"53.48/23","v":2.3252173913043479}]
["Cerveja original 300ml",null,null,{"$f":"59/23","v":2.5652173913043477}]
["Cerveja Stella 600ml",null,null,{"$f":"181.2/24","v":7.55}]
["Cerveja original 1 Litro",null,null,{"$f":"89.9/12","v":7.4916666666666671}]
["Cerveja original 473 ml",null,null,{"$f":"4.41","v":4.41}]
["Vodka Orloff 1 litro",null,null,28.4]
["Vodka Smirnoff 998ml",null,null,33.729999999999997]
["Cerveja Sparten Lata 473ml",null,null,{"$f":"49.9/12","v":4.1583333333333332}]
["Cerveja corona LongNeck",null,null,{"$f":"127/24","v":5.291666666666667}]
["Cachaça Seleta 1 litro",null,null,29.9]
["Wisky Red Label",null,null,74.900000000000006]
["Wisky Cavalo Branco",null,null,62.9]
["Refrigerante Pepsi 2 litros",null,null,6]
["Refrigerante Pepsi 200ml",null,null,{"$f":"15/12","v":1.25}]
["Refrigerante Antarctica 2 litros",null,1,{"$f":"39.78/6","v":6.63}]
["Refrigerante Antarctica 200ml",null,null,{"$f":"15/12","v":1.25}]
["Refrigerante Antarctica 350ml",null,null,{"$f":"11.6/12","v":0.96666666666666667}]
["Refrigerante Sukita 2 litros",null,2,{"$f":"28.75/6","v":4.791666666666667}]
["Refrigerante Sukita Laranja 200ml",null,null,{"$f":"16.68/12","v":1.39}]
["Energetico Red Bull 250ml",null,null,7.29]
["H2OH 1,5 litro limoneto",null,null,{"$f":"39.6/6","v":6.6000000000000005}]
["Bala Halls",null,null,1.1971000000000001]
["Skol Beats",null,null,{"$f":"38.4/8","v":4.8}]
["Biscoito Piraque",null,null,2.5]
[null,null,"Venda Custo"]
["HEINEKEN"]
["Cerveja Heineken 600ml",null,null,8.2899999999999991]
["Agua Mamba Water 350ml",null,null,2.17]
{"$rows_left_out":105}