{"text_format":"1","workbook":"xlsx","n_sheets":4,"sheets":["Menu","Cadastro","Detalhado ","Lote"],"not_rendered":{"charts":0,"images":1,"macros":1,"external_links":0,"defined_names":3,"comments":0,"pivot_tables":0},"unopened":[],"bounds":{"document_bytes":16777216,"sheet_cells":100000,"rows_first":2000,"rows_last":500,"rows_between":2000,"halvings":0,"cell_chars":16384,"cell_head_chars":4096},"cells_cut":0,"cells_raw":0,"read":"whole","date_system":"1900"}

{"sheet":"Menu","index":0,"n_rows":0,"n_cols":0,"rows_kept":0,"cut":false,"hidden":false,"merged":[[1,0,1,10]]}

{"sheet":"Cadastro","index":1,"n_rows":259,"n_cols":9,"rows_kept":259,"cut":false,"hidden":false,"merged":[]}
["CodigoInterno","CodigoProduto","NomeProduto","LinhaProduto","EstoqueMinimo","Estoquemaximo"]
[120,"PRD00022","AGUA OX NC 20VOL 1L","TINTURAS",2,50,null,"",""]
[124,"PRD00026","AGUA OX NC 30V MATIZAD 1L","TINTURAS",2,15,null,"",""]
[121,"PRD00023","AGUA OX NC 30VOL 1L","TINTURAS",2,15,null,"",""]
[125,"PRD00027","AGUA OX NC 40V MATIZAD 1L","TINTURAS",2,15,null,null,""]
[122,"PRD00024","AGUA OX NC 40VOL 1L","TINTURAS",2,15,null,"",""]
[301,"PRD00204","BALM CONTROLTOX PR 1L","SHOCK3",2,15,null,"",""]
[305,"PRD00248","BALS COND DAY BY DAY PROF SER 2,5L","DAYBYDAY",2,15,null,"",""]
[113,"PRD00014","BLINDAGEM NANO REDUT PR 1L","SHOCK3",2,15,null,"",""]
[252,"PRD00154","BRUMA STYLING SP LUM 240ML","LUMMEM",2,15,null,"",""]
[300,"PRD00203","COMP DISC CONTROLTOX PR 1KG","SHOCK3",2,15,null,"",""]
[289,"PRD00191","COMP FINAL SHOCK3 60G","SHOCK3",2,15,null,"",""]
[224,"PRD00126","COMP HID KAIKEN UNI 500ML","KAIKEN",2,15,null,"",""]
[226,"PRD00128","COMP HID KAIKEN UNIQUE 2KG","KAIKEN",2,15,null,"",""]
[313,"PRD00256","COMP REC MANTEIG KARITE ET 1KG","ELEMENTOS DA TERRA",2,15,null,"",""]
[314,"PRD00257","COMP REC OLEO DE ARGAN ET 1KG","ELEMENTOS DA TERRA",2,15,null,"",""]
[315,"PRD00258","COMP REC OLEO DE OLIVA ET 1KG","ELEMENTOS DA TERRA",2,15,null,"",""]
[316,"PRD00259","COMP REC OLEO DE TUTANO ET 1KG","ELEMENTOS DA TERRA",2,15,null,"",""]
[317,"PRD00260","COMP REC OLEO MACADAMIA ET 1KG","ELEMENTOS DA TERRA",2,15,null,"",""]
[318,"PRD00261","COMP REC QUERATINA ET 1KG","ELEMENTOS DA TERRA",2,15,null,"",""]
[270,"PRD00172","COMPOSTO OL OJON M PLU 1L","MAISON",2,15,null,"",""]
[259,"PRD00161","COND ALECRIM E MENTA M 5L","MAISON",2,15,null,"",""]
[260,"PRD00162","COND BRILHO PEROLA E MAIS 5L","MAISON",2,15,null,"",""]
[322,"PRD00265","COND DAM LARANJ ET 250ML","ELEMENTOS DA TERRA",2,15,null,"",""]
[261,"PRD00163","COND ERVA DOCE MAISON 5L","MAISON",2,15,null,"",""]
[334,"PRD00277","COND EXT MANDIOC ET 250ML","ELEMENTOS DA TERRA",2,15,null,"",""]
[339,"PRD00282","COND MACADÂMIA SOS 1LT ET","ELEMENTOS DA TERRA",2,15,null,"",""]
[262,"PRD00164","COND MANT KARITE MAISON 5L","MAISON",2,15,null,"",""]
[263,"PRD00165","COND MARACUJA MEL MAISO 5L","MAISON",2,15,null,"",""]
[328,"PRD00271","COND OLEO DE ARGAN ET 250ML","ELEMENTOS DA TERRA",2,15,null,"",""]
[331,"PRD00274","COND OLEO DE COCO ET 250ML","ELEMENTOS DA TERRA",2,15,null,"",""]
[325,"PRD00268","COND PHYS BAUN ET 250ML","ELEMENTOS DA TERRA",2,15,null,"",""]
[338,"PRD00281","COND QUERATINA SOS 1LT ET","ELEMENTOS DA TERRA",2,15,null,"",""]
[126,"PRD00028","CORRETOR AMARELO NC 60G","TINTURAS",2,15,null,"",""]
[127,"PRD00029","CORRETOR AZUL NC 60G","TINTURAS",2,15,null,"",""]
[128,"PRD00030","CORRETOR CINZA","TINTURAS",2,15,null,"",""]
[129,"PRD00031","CORRETOR VERMELHO NC 60G","TINTURAS",2,15,null,"",""]
[355,"PRD00298","CR ALISANTE SODIO OSMIUM 1KG","OSMIIUM",2,15,null,"",""]
[235,"PRD00137","CR ALISANTE SODIO OSMIUM 2KG","OSMIIUM",2,15,null,"",""]
[236,"PRD00138","CR BASE CALCIO OSMIUM 1KG","OSMIIUM",2,15,null,"",""]
{"$rows_left_out":220}
{"sheet":"Detalhado ","index":2,"n_rows":259,"n_cols":10,"rows_kept":259,"cut":false,"hidden":false,"merged":[]}
["CodigoInterno","CodigoProduto","NomeProduto","LinhaProduto","Estoque","Saldo Disponivel","Venda","Venda","Quarentena","Retrabalho"]
[101,"PRD00001","KERATIN BALM CROMAT 500ML","CROMATIC",{"$f":"VLOOKUP(B2,Cadastro!#REF!,6,FALSE)","v":{"$error":"#REF!"}},{"$f":"SUM(G2:J2)","v":60},null,{"$f":"SUMIF(Lote!$A:$M,$H$1&\"-\"&$B2,Lote!$M:$M)","v":60},{"$f":"SUMIF(Lote!$A:$M,$I$1&\"-\"&$B2,Lote!$M:$M)","v":0},{"$f":"SUMIF(Lote!$A:$M,$J$1&\"-\"&$B2,Lote!$M:$M)","v":0}]
[102,"PRD00002","KERATIN SEALING CROMATIC 500ML","CROMATIC",{"$f":"VLOOKUP(B3,Cadastro!#REF!,6,FALSE)","v":{"$error":"#REF!"}},{"$f":"SUM(G3:J3)","v":75},null,{"$f":"SUMIF(Lote!$A:$M,$H$1&\"-\"&$B3,Lote!$M:$M)","v":75},{"$f":"SUMIF(Lote!$A:$M,$I$1&\"-\"&$B3,Lote!$M:$M)","v":0},{"$f":"SUMIF(Lote!$A:$M,$J$1&\"-\"&$B3,Lote!$M:$M)","v":0}]
[103,"PRD00003","KERATIN SH CROMATIC 500ML","CROMATIC",{"$f":"VLOOKUP(B4,Cadastro!#REF!,6,FALSE)","v":{"$error":"#REF!"}},20,null,{"$f":"SUMIF(Lote!$A:$M,$H$1&\"-\"&$B4,Lote!$M:$M)","v":20},{"$f":"SUMIF(Lote!$A:$M,$I$1&\"-\"&$B4,Lote!$M:$M)","v":0},{"$f":"SUMIF(Lote!$A:$M,$J$1&\"-\"&$B4,Lote!$M:$M)","v":0}]
[104,"PRD00004","SH DAYBYDAY CAMOMILA 500ML","DAYBYDAY",{"$f":"VLOOKUP(B5,Cadastro!#REF!,6,FALSE)","v":{"$error":"#REF!"}},121,null,{"$f":"SUMIF(Lote!$A:$M,$H$1&\"-\"&$B5,Lote!$M:$M)","v":121},{"$f":"SUMIF(Lote!$A:$M,$I$1&\"-\"&$B5,Lote!$M:$M)","v":0},{"$f":"SUMIF(Lote!$A:$M,$J$1&\"-\"&$B5,Lote!$M:$M)","v":0}]
[105,"PRD00005","MASC REG DAYBYDAY CAMOM 500G","DAYBYDAY",{"$f":"VLOOKUP(B6,Cadastro!#REF!,6,FALSE)","v":{"$error":"#REF!"}},76,null,{"$f":"SUMIF(Lote!$A:$M,$H$1&\"-\"&$B6,Lote!$M:$M)","v":76},{"$f":"SUMIF(Lote!$A:$M,$I$1&\"-\"&$B6,Lote!$M:$M)","v":0},{"$f":"SUMIF(Lote!$A:$M,$J$1&\"-\"&$B6,Lote!$M:$M)","v":0}]
[106,"PRD00006","SH DAYBYDAY CEN 500ML","DAYBYDAY",{"$f":"VLOOKUP(B7,Cadastro!#REF!,6,FALSE)","v":{"$error":"#REF!"}},12,null,{"$f":"SUMIF(Lote!$A:$M,$H$1&\"-\"&$B7,Lote!$M:$M)","v":12},{"$f":"SUMIF(Lote!$A:$M,$I$1&\"-\"&$B7,Lote!$M:$M)","v":0},{"$f":"SUMIF(Lote!$A:$M,$J$1&\"-\"&$B7,Lote!$M:$M)","v":0}]
[107,"PRD00007","MASC REVIT DAYBYDAY CEN 500G","DAYBYDAY",{"$f":"VLOOKUP(B8,Cadastro!#REF!,6,FALSE)","v":{"$error":"#REF!"}},462,null,{"$f":"SUMIF(Lote!$A:$M,$H$1&\"-\"&$B8,Lote!$M:$M)","v":462},{"$f":"SUMIF(Lote!$A:$M,$I$1&\"-\"&$B8,Lote!$M:$M)","v":0},{"$f":"SUMIF(Lote!$A:$M,$J$1&\"-\"&$B8,Lote!$M:$M)","v":0}]
[108,"PRD00008","SH DAYBYDAY ABAC 500ML","DAYBYDAY",{"$f":"VLOOKUP(B9,Cadastro!#REF!,6,FALSE)","v":{"$error":"#REF!"}},204,null,{"$f":"SUMIF(Lote!$A:$M,$H$1&\"-\"&$B9,Lote!$M:$M)","v":2},{"$f":"SUMIF(Lote!$A:$M,$I$1&\"-\"&$B9,Lote!$M:$M)","v":202},{"$f":"SUMIF(Lote!$A:$M,$J$1&\"-\"&$B9,Lote!$M:$M)","v":0}]
[109,"PRD00009","MASC COND DAYBYDAY ABAC 500G","DAYBYDAY",{"$f":"VLOOKUP(B10,Cadastro!#REF!,6,FALSE)","v":{"$error":"#REF!"}},146,null,{"$f":"SUMIF(Lote!$A:$M,$H$1&\"-\"&$B10,Lote!$M:$M)","v":146},{"$f":"SUMIF(Lote!$A:$M,$I$1&\"-\"&$B10,Lote!$M:$M)","v":0},{"$f":"SUMIF(Lote!$A:$M,$J$1&\"-\"&$B10,Lote!$M:$M)","v":0}]
[110,"PRD00010","SH DAYBYDAY PROF SERV 2,5L","DAYBYDAY",{"$f":"VLOOKUP(B11,Cadastro!#REF!,6,FALSE)","v":{"$error":"#REF!"}},27,null,{"$f":"SUMIF(Lote!$A:$M,$H$1&\"-\"&$B11,Lote!$M:$M)","v":27},{"$f":"SUMIF(Lote!$A:$M,$I$1&\"-\"&$B11,Lote!$M:$M)","v":0},{"$f":"SUMIF(Lote!$A:$M,$J$1&\"-\"&$B11,Lote!$M:$M)","v":0}]
[111,"PRD00012","GOLDEN MASK NUTRAHAI 200GR","GOLDEN MASK",{"$f":"VLOOKUP(B12,Cadastro!#REF!,6,FALSE)","v":{"$error":"#REF!"}},0,null,{"$f":"SUMIF(Lote!$A:$M,$H$1&\"-\"&$B12,Lote!$M:$M)","v":0},{"$f":"SUMIF(Lote!$A:$M,$I$1&\"-\"&$B12,Lote!$M:$M)","v":0},{"$f":"SUMIF(Lote!$A:$M,$J$1&\"-\"&$B12,Lote!$M:$M)","v":0}]
[112,"PRD00013","KIT FIBER VIT NH","FIBER VIT",{"$f":"VLOOKUP(B13,Cadastro!#REF!,6,FALSE)","v":{"$error":"#REF!"}},54,null,{"$f":"SUMIF(Lote!$A:$M,$H$1&\"-\"&$B13,Lote!$M:$M)","v":54},{"$f":"SUMIF(Lote!$A:$M,$I$1&\"-\"&$B13,Lote!$M:$M)","v":0},{"$f":"SUMIF(Lote!$A:$M,$J$1&\"-\"&$B13,Lote!$M:$M)","v":0}]
[113,"PRD00014","BLINDAGEM NANO REDUT PR 1L","SHOCK3",{"$f":"VLOOKUP(B14,Cadastro!#REF!,6,FALSE)","v":{"$error":"#REF!"}},82,null,{"$f":"SUMIF(Lote!$A:$M,$H$1&\"-\"&$B14,Lote!$M:$M)","v":82},{"$f":"SUMIF(Lote!$A:$M,$I$1&\"-\"&$B14,Lote!$M:$M)","v":0},{"$f":"SUMIF(Lote!$A:$M,$J$1&\"-\"&$B14,Lote!$M:$M)","v":0}]
[114,"PRD00015","SH ULTRA GLOSS PR 1L","SHOCK3",{"$f":"VLOOKUP(B15,Cadastro!#REF!,6,FALSE)","v":{"$error":"#REF!"}},22,null,{"$f":"SUMIF(Lote!$A:$M,$H$1&\"-\"&$B15,Lote!$M:$M)","v":22},{"$f":"SUMIF(Lote!$A:$M,$I$1&\"-\"&$B15,Lote!$M:$M)","v":0},{"$f":"SUMIF(Lote!$A:$M,$J$1&\"-\"&$B15,Lote!$M:$M)","v":0}]
[115,"PRD00016","MASCARA TONALIZANTE ABSOLUT BLACK 260G","TONALIZANTE",{"$f":"VLOOKUP(B16,Cadastro!#REF!,6,FALSE)","v":{"$error":"#REF!"}},0,null,{"$f":"SUMIF(Lote!$A:$M,$H$1&\"-\"&$B16,Lote!$M:$M)","v":0},{"$f":"SUMIF(Lote!$A:$M,$I$1&\"-\"&$B16,Lote!$M:$M)","v":0},{"$f":"SUMIF(Lote!$A:$M,$J$1&\"-\"&$B16,Lote!$M:$M)","v":0}]
[116,"PRD00017","MASCARA TONALIZANTE GRAND MARSALA 260G","TONALIZANTE",{"$f":"VLOOKUP(B17,Cadastro!#REF!,6,FALSE)","v":{"$error":"#REF!"}},0,null,{"$f":"SUMIF(Lote!$A:$M,$H$1&\"-\"&$B17,Lote!$M:$M)","v":0},{"$f":"SUMIF(Lote!$A:$M,$I$1&\"-\"&$B17,Lote!$M:$M)","v":0},{"$f":"SUMIF(Lote!$A:$M,$J$1&\"-\"&$B17,Lote!$M:$M)","v":0}]
[117,"PRD00018","MASCARA TONALIZANTE LUX BROWN 260G","TONALIZANTE",{"$f":"VLOOKUP(B18,Cadastro!#REF!,6,FALSE)","v":{"$error":"#REF!"}},0,null,{"$f":"SUMIF(Lote!$A:$M,$H$1&\"-\"&$B18,Lote!$M:$M)","v":0},{"$f":"SUMIF(Lote!$A:$M,$I$1&\"-\"&$B18,Lote!$M:$M)","v":0},{"$f":"SUMIF(Lote!$A:$M,$J$1&\"-\"&$B18,Lote!$M:$M)","v":0}]
[118,"PRD00019","MASCARA TONALIZANTE ROYAL RED 260G","TONALIZANTE",{"$f":"VLOOKUP(B19,Cadastro!#REF!,6,FALSE)","v":{"$error":"#REF!"}},0,null,{"$f":"SUMIF(Lote!$A:$M,$H$1&\"-\"&$B19,Lote!$M:$M)","v":0},{"$f":"SUMIF(Lote!$A:$M,$I$1&\"-\"&$B19,Lote!$M:$M)","v":0},{"$f":"SUMIF(Lote!$A:$M,$J$1&\"-\"&$B19,Lote!$M:$M)","v":0}]
[119,"PRD00020","SH MATIZADOR NC 300ML","MATIZADORES",{"$f":"VLOOKUP(B20,Cadastro!#REF!,6,FALSE)","v":{"$error":"#REF!"}},267,null,{"$f":"SUMIF(Lote!$A:$M,$H$1&\"-\"&$B20,Lote!$M:$M)","v":267},{"$f":"SUMIF(Lote!$A:$M,$I$1&\"-\"&$B20,Lote!$M:$M)","v":0},{"$f":"SUMIF(Lote!$A:$M,$J$1&\"-\"&$B20,Lote!$M:$M)","v":0}]
[120,"PRD00022","AGUA OX NC 20VOL 1L","TINTURAS",{"$f":"VLOOKUP(B21,Cadastro!#REF!,6,FALSE)","v":{"$error":"#REF!"}},0,null,{"$f":"SUMIF(Lote!$A:$M,$H$1&\"-\"&$B21,Lote!$M:$M)","v":0},{"$f":"SUMIF(Lote!$A:$M,$I$1&\"-\"&$B21,Lote!$M:$M)","v":0},{"$f":"SUMIF(Lote!$A:$M,$J$1&\"-\"&$B21,Lote!$M:$M)","v":0}]
[121,"PRD00023","AGUA OX NC 30VOL 1L","TINTURAS",{"$f":"VLOOKUP(B22,Cadastro!#REF!,6,FALSE)","v":{"$error":"#REF!"}},0,null,{"$f":"SUMIF(Lote!$A:$M,$H$1&\"-\"&$B22,Lote!$M:$M)","v":0},{"$f":"SUMIF(Lote!$A:$M,$I$1&\"-\"&$B22,Lote!$M:$M)","v":0},{"$f":"SUMIF(Lote!$A:$M,$J$1&\"-\"&$B22,Lote!$M:$M)","v":0}]
[122,"PRD00024","AGUA OX NC 40VOL 1L","TINTURAS",{"$f":"VLOOKUP(B23,Cadastro!#REF!,6,FALSE)","v":{"$error":"#REF!"}},0,null,{"$f":"SUMIF(Lote!$A:$M,$H$1&\"-\"&$B23,Lote!$M:$M)","v":0},{"$f":"SUMIF(Lote!$A:$M,$I$1&\"-\"&$B23,Lote!$M:$M)","v":0},{"$f":"SUMIF(Lote!$A:$M,$J$1&\"-\"&$B23,Lote!$M:$M)","v":0}]
[123,"PRD00025","EMULSAO NC 8VOL 1L","TINTURAS",{"$f":"VLOOKUP(B24,Cadastro!#REF!,6,FALSE)","v":{"$error":"#REF!"}},0,null,{"$f":"SUMIF(Lote!$A:$M,$H$1&\"-\"&$B24,Lote!$M:$M)","v":0},{"$f":"SUMIF(Lote!$A:$M,$I$1&\"-\"&$B24,Lote!$M:$M)","v":0},{"$f":"SUMIF(Lote!$A:$M,$J$1&\"-\"&$B24,Lote!$M:$M)","v":0}]
[124,"PRD00026","AGUA OX NC 30V MATIZAD 1L","TINTURAS",{"$f":"VLOOKUP(B25,Cadastro!#REF!,6,FALSE)","v":{"$error":"#REF!"}},0,null,{"$f":"SUMIF(Lote!$A:$M,$H$1&\"-\"&$B25,Lote!$M:$M)","v":0},{"$f":"SUMIF(Lote!$A:$M,$I$1&\"-\"&$B25,Lote!$M:$M)","v":0},{"$f":"SUMIF(Lote!$A:$M,$J$1&\"-\"&$B25,Lote!$M:$M)","v":0}]
[125,"PRD00027","AGUA OX NC 40V MATIZAD 1L","TINTURAS",{"$f":"VLOOKUP(B26,Cadastro!#REF!,6,FALSE)","v":{"$error":"#REF!"}},0,null,{"$f":"SUMIF(Lote!$A:$M,$H$1&\"-\"&$B26,Lote!$M:$M)","v":0},{"$f":"SUMIF(Lote!$A:$M,$I$1&\"-\"&$B26,Lote!$M:$M)","v":0},{"$f":"SUMIF(Lote!$A:$M,$J$1&\"-\"&$B26,Lote!$M:$M)","v":0}]
[126,"PRD00028","CORRETOR AMARELO NC 60G","TINTURAS",{"$f":"VLOOKUP(B27,Cadastro!#REF!,6,FALSE)","v":{"$error":"#REF!"}},0,null,{"$f":"SUMIF(Lote!$A:$M,$H$1&\"-\"&$B27,Lote!$M:$M)","v":0},{"$f":"SUMIF(Lote!$A:$M,$I$1&\"-\"&$B27,Lote!$M:$M)","v":0},{"$f":"SUMIF(Lote!$A:$M,$J$1&\"-\"&$B27,Lote!$M:$M)","v":0}]
[127,"PRD00029","CORRETOR AZUL NC 60G","TINTURAS",{"$f":"VLOOKUP(B28,Cadastro!#REF!,6,FALSE)","v":{"$error":"#REF!"}},0,null,{"$f":"SUMIF(Lote!$A:$M,$H$1&\"-\"&$B28,Lote!$M:$M)","v":0},{"$f":"SUMIF(Lote!$A:$M,$I$1&\"-\"&$B28,Lote!$M:$M)","v":0},{"$f":"SUMIF(Lote!$A:$M,$J$1&\"-\"&$B28,Lote!$M:$M)","v":0}]
[128,"PRD00030","CORRETOR CINZA","TINTURAS",{"$f":"VLOOKUP(B29,Cadastro!#REF!,6,FALSE)","v":{"$error":"#REF!"}},0,null,{"$f":"SUMIF(Lote!$A:$M,$H$1&\"-\"&$B29,Lote!$M:$M)","v":0},{"$f":"SUMIF(Lote!$A:$M,$I$1&\"-\"&$B29,Lote!$M:$M)","v":0},{"$f":"SUMIF(Lote!$A:$M,$J$1&\"-\"&$B29,Lote!$M:$M)","v":0}]
[129,"PRD00031","CORRETOR VERMELHO NC 60G","TINTURAS",{"$f":"VLOOKUP(B30,Cadastro!#REF!,6,FALSE)","v":{"$error":"#REF!"}},0,null,{"$f":"SUMIF(Lote!$A:$M,$H$1&\"-\"&$B30,Lote!$M:$M)","v":0},{"$f":"SUMIF(Lote!$A:$M,$I$1&\"-\"&$B30,Lote!$M:$M)","v":0},{"$f":"SUMIF(Lote!$A:$M,$J$1&\"-\"&$B30,Lote!$M:$M)","v":0}]
[130,"PRD00032","DESC NC AZUL 500G","TINTURAS",{"$f":"VLOOKUP(B31,Cadastro!#REF!,6,FALSE)","v":{"$error":"#REF!"}},0,null,{"$f":"SUMIF(Lote!$A:$M,$H$1&\"-\"&$B31,Lote!$M:$M)","v":0},{"$f":"SUMIF(Lote!$A:$M,$I$1&\"-\"&$B31,Lote!$M:$M)","v":0},{"$f":"SUMIF(Lote!$A:$M,$J$1&\"-\"&$B31,Lote!$M:$M)","v":0}]
[131,"PRD00033","DESC NC BRANCO 500G","TINTURAS",{"$f":"VLOOKUP(B32,Cadastro!#REF!,6,FALSE)","v":{"$error":"#REF!"}},0,null,{"$f":"SUMIF(Lote!$A:$M,$H$1&\"-\"&$B32,Lote!$M:$M)","v":0},{"$f":"SUMIF(Lote!$A:$M,$I$1&\"-\"&$B32,Lote!$M:$M)","v":0},{"$f":"SUMIF(Lote!$A:$M,$J$1&\"-\"&$B32,Lote!$M:$M)","v":0}]
[132,"PRD00034","KIT ULTRAPLEX NUTRA COLOR","ULTRAPLEX",{"$f":"VLOOKUP(B33,Cadastro!#REF!,6,FALSE)","v":{"$error":"#REF!"}},220,null,{"$f":"SUMIF(Lote!$A:$M,$H$1&\"-\"&$B33,Lote!$M:$M)","v":220},{"$f":"SUMIF(Lote!$A:$M,$I$1&\"-\"&$B33,Lote!$M:$M)","v":0},{"$f":"SUMIF(Lote!$A:$M,$J$1&\"-\"&$B33,Lote!$M:$M)","v":0}]
[133,"PRD00035","T NC 0.00 INTENS CLAREAMEN 60G","TINTURAS",{"$f":"VLOOKUP(B34,Cadastro!#REF!,6,FALSE)","v":{"$error":"#REF!"}},0,null,{"$f":"SUMIF(Lote!$A:$M,$H$1&\"-\"&$B34,Lote!$M:$M)","v":0},{"$f":"SUMIF(Lote!$A:$M,$I$1&\"-\"&$B34,Lote!$M:$M)","v":0},{"$f":"SUMIF(Lote!$A:$M,$J$1&\"-\"&$B34,Lote!$M:$M)","v":0}]
[134,"PRD00036","T NC 1.0 PRETO ESSENCE 60G","TINTURAS",{"$f":"VLOOKUP(B35,Cadastro!#REF!,6,FALSE)","v":{"$error":"#REF!"}},0,null,{"$f":"SUMIF(Lote!$A:$M,$H$1&\"-\"&$B35,Lote!$M:$M)","v":0},{"$f":"SUMIF(Lote!$A:$M,$I$1&\"-\"&$B35,Lote!$M:$M)","v":0},{"$f":"SUMIF(Lote!$A:$M,$J$1&\"-\"&$B35,Lote!$M:$M)","v":0}]
[135,"PRD00037","T NC 10.0 L CLARIS 60G","TINTURAS",{"$f":"VLOOKUP(B36,Cadastro!#REF!,6,FALSE)","v":{"$error":"#REF!"}},0,null,{"$f":"SUMIF(Lote!$A:$M,$H$1&\"-\"&$B36,Lote!$M:$M)","v":0},{"$f":"SUMIF(Lote!$A:$M,$I$1&\"-\"&$B36,Lote!$M:$M)","v":0},{"$f":"SUMIF(Lote!$A:$M,$J$1&\"-\"&$B36,Lote!$M:$M)","v":0}]
[136,"PRD00038","T NC 10.1 L CLARIS ACZ 60G","TINTURAS",{"$f":"VLOOKUP(B37,Cadastro!#REF!,6,FALSE)","v":{"$error":"#REF!"}},0,null,{"$f":"SUMIF(Lote!$A:$M,$H$1&\"-\"&$B37,Lote!$M:$M)","v":0},{"$f":"SUMIF(Lote!$A:$M,$I$1&\"-\"&$B37,Lote!$M:$M)","v":0},{"$f":"SUMIF(Lote!$A:$M,$J$1&\"-\"&$B37,Lote!$M:$M)","v":0}]
[137,"PRD00039","T NC 10.89 L CLARIS PEROLA 60G","TINTURAS",{"$f":"VLOOKUP(B38,Cadastro!#REF!,6,FALSE)","v":{"$error":"#REF!"}},0,null,{"$f":"SUMIF(Lote!$A:$M,$H$1&\"-\"&$B38,Lote!$M:$M)","v":0},{"$f":"SUMIF(Lote!$A:$M,$I$1&\"-\"&$B38,Lote!$M:$M)","v":0},{"$f":"SUMIF(Lote!$A:$M,$J$1&\"-\"&$B38,Lote!$M:$M)","v":0}]
[138,"PRD00040","T NC 11.11 L CLARIS PL INT 60G","TINTURAS",{"$f":"VLOOKUP(B39,Cadastro!#REF!,6,FALSE)","v":{"$error":"#REF!"}},179,null,{"$f":"SUMIF(Lote!$A:$M,$H$1&\"-\"&$B39,Lote!$M:$M)","v":0},{"$f":"SUMIF(Lote!$A:$M,$I$1&\"-\"&$B39,Lote!$M:$M)","v":0},{"$f":"SUMIF(Lote!$A:$M,$J$1&\"-\"&$B39,Lote!$M:$M)","v":179}]
[139,"PRD00041","T NC 12.0 L ULTRA CL 60G","TINTURAS",{"$f":"VLOOKUP(B40,Cadastro!#REF!,6,FALSE)","v":{"$error":"#REF!"}},0,null,{"$f":"SUMIF(Lote!$A:$M,$H$1&\"-\"&$B40,Lote!$M:$M)","v":0},{"$f":"SUMIF(Lote!$A:$M,$I$1&\"-\"&$B40,Lote!$M:$M)","v":0},{"$f":"SUMIF(Lote!$A:$M,$J$1&\"-\"&$B40,Lote!$M:$M)","v":0}]
{"$rows_left_out":220}
{"sheet":"Lote","index":3,"n_rows":278,"n_cols":14,"rows_kept":278,"cut":false,"hidden":false,"merged":[]}
["unificar","CodSeq","Data","LocalEstoque","CodigoInterno","CodigoProduto","NomeProduto","LinhaProduto","CodigoLote","LoteProduto","DataValidade","ValidadeMesAno","EstoqueProduto","StatusValidade"]
["Venda-PRD00201",375,"21/04/2025","Venda",299,"PRD00201","SH SHOCK3 PRO REPAIR 500ML","SHOCK3",277,"0901250002","31/01/2028","01/28",214,""]
["Venda-PRD00193",374,"21/04/2025","Venda",291,"PRD00193","REGEN NUT SHOCK3 OMEG 500G","SHOCK3",276,"0210240002","31/10/2027","10/27",218,""]
["Retrabalho-PRD00102",304,"17/04/2025","Retrabalho",200,"PRD00102","T NC 9.00 L CLARIS NATURAL 60G","TINTURAS",275,"A141818","31/01/2025","01/25",76,""]
["Retrabalho-PRD00110",303,"17/04/2025","Retrabalho",208,"PRD00110","T NC 90.01 PRATA 60G","TINTURAS",274,"13032014","31/03/2023","03/23",48,""]
["Retrabalho-PRD00040",302,"17/04/2025","Retrabalho",138,"PRD00040","T NC 11.11 L CLARIS PL INT 60G","TINTURAS",273,"081120220013","08/11/2024","11/24",179,""]
["Reposição-PRD00053",301,"17/04/2025","Reposição",151,"PRD00053","T NC 5.0 CAST CL ESSENCE 60G","TINTURAS",272,"2006240014","30/06/2027","06/27",216,""]
["Reposição-PRD00047",300,"17/04/2025","Reposição",145,"PRD00047","T NC 3.0 CAST ESC ESSENCE 60G","TINTURAS",271,"0406240005","30/06/2026","06/26",245,""]
["Reposição-PRD00036",299,"17/04/2025","Reposição",134,"PRD00036","T NC 1.0 PRETO ESSENCE 60G","TINTURAS",270,"19122023159","19/12/2026","12/26",100,""]
["Retrabalho-PRD00106",298,"17/04/2025","Retrabalho",204,"PRD00106","T NC 9.1 L MT CL ACZ 60G","TINTURAS",269,"03112022008","03/11/2024","11/24",397,""]
["Retrabalho-PRD00103",297,"17/04/2025","Retrabalho",201,"PRD00103","T NC 9.01 L CLARIS ACZ 60G","TINTURAS",268,"2701210026","31/01/2024","01/24",237,""]
["Retrabalho-PRD00096",296,"17/04/2025","Retrabalho",194,"PRD00096","T NC 8.26 MARSALA 60G","TINTURAS",267,"0911202200116","09/11/2024","11/24",38,""]
["Reposição-PRD00096",295,"17/04/2025","Reposição",194,"PRD00096","T NC 8.26 MARSALA 60G","TINTURAS",266,"23062023052","31/12/2026","12/26",949,""]
["Retrabalho-PRD00095",294,"17/04/2025","Retrabalho",193,"PRD00095","T NC 8.1 L CL ACZ 60G","TINTURAS",265,"071120220011","07/11/2024","11/24",439,""]
["Retrabalho-PRD00089",293,"17/04/2025","Retrabalho",187,"PRD00089","T NC 7.7 CHOCOLATE CL 60G","TINTURAS",264,"081120220014","08/11/2024","11/24",112,""]
["Retrabalho-PRD00081",292,"17/04/2025","Retrabalho",179,"PRD00081","T NC 7.3 L MD DOUR 60G","TINTURAS",263,"01112022006","01/11/2024","11/24",279,""]
["Retrabalho-PRD00075",291,"17/04/2025","Retrabalho",173,"PRD00075","T NC 6.7 CHOCOLATE ESSENCE 60G","TINTURAS",262,"31102023005","31/10/2024","10/24",206,""]
["Retrabalho-PRD00074",290,"17/04/2025","Retrabalho",172,"PRD00074","T NC 6.66 L ESC VERM INT 60G","TINTURAS",261,"111120220020","11/11/2024","11/24",593,""]
["Reposição-PRD00073",289,"17/04/2025","Reposição",171,"PRD00073","T NC 6.64 L ESC VER ACOB 60G","TINTURAS",260,"K141518","31/01/2027","01/27",45,""]
["Retrabalho-PRD00054",288,"17/04/2025","Retrabalho",152,"PRD00054","T NC 5.1 CAST CL ACZ ESSEN 60G","TINTURAS",259,"0911202200115","09/11/2024","11/24",133,""]
["Retrabalho-PRD00050",287,"17/04/2025","Retrabalho",148,"PRD00050","T NC 4.5 CAST MD ACAJU 60G","TINTURAS",258,"3009210047","30/09/2024","09/24",1493,""]
["Venda-PRD00252",286,"17/04/2025","Venda",309,"PRD00252","MASC KAIKEN ONIX ÓLEO DE AVELÃ 1LT","KAIKEN",257,"10072023059","10/07/2026","07/26",31,""]
["Venda-PRD00250",285,"17/04/2025","Venda",307,"PRD00250","MASC KAIKEN ONIX ARGILA VERDE 1LT","KAIKEN",256,"10072023058","10/07/2026","07/26",58,""]
["Venda-PRD00249",284,"17/04/2025","Venda",306,"PRD00249","SH KAIKEN ONIX 1LT","KAIKEN",255,"1204240017","30/04/2027","04/27",12,""]
["Venda-PRD00251",283,"17/04/2025","Venda",308,"PRD00251","MASC KAIKEN ONIX TUTANO E CENOURA 1LT","KAIKEN",254,"10072023060","10/07/2026","07/26",58,""]
["Venda-PRD00034",282,"17/04/2025","Venda",132,"PRD00034","KIT ULTRAPLEX NUTRA COLOR","ULTRAPLEX",253,"15012024177","31/01/2027","01/27",220,""]
["Venda-PRD00194",281,"17/04/2025","Venda",292,"PRD00194","REGEN SHOCK3 OL COCO 300ML","SHOCK3",252,"0305240005","31/05/2027","05/27",48,""]
["Venda-PRD00198",280,"17/04/2025","Venda",296,"PRD00198","SH SHOCK3 OL COCO PR 300ML","SHOCK3",251,"0612240006","31/12/2027","12/27",155,""]
["Venda-PRD00198",279,"17/04/2025","Venda",296,"PRD00198","SH SHOCK3 OL COCO PR 300ML","SHOCK3",250,"0305240006","31/05/2028","05/28",1,""]
["Venda-PRD00203",278,"17/04/2025","Venda",300,"PRD00203","COMP DISC CONTROLTOX PR 1KG","SHOCK3",249,"0402250002","29/02/2028","02/28",45,""]
["Venda-PRD00204",277,"17/04/2025","Venda",301,"PRD00204","BALM CONTROLTOX PR 1L","SHOCK3",248,"05102023116","05/10/2027","10/27",48,""]
["Venda-PRD00144",276,"17/04/2025","Venda",242,"PRD00144","SH INDICADOR OSMIUM FL 1L","OSMIIUM",247,"03052023016","03/05/2026","05/26",115,""]
["Venda-PRD00140",275,"17/04/2025","Venda",238,"PRD00140","CR HID E NEUT OSM FLEX 1KG","OSMIIUM",246,"1111240006","30/11/2027","11/27",33,""]
["Venda-PRD00141",274,"17/04/2025","Venda",239,"PRD00141","CR PROTETOR OSM FLEX 100G","OSMIIUM",245,"0901180028","31/03/2027","03/27",3,""]
["Venda-PRD00145",273,"17/04/2025","Venda",243,"PRD00145","SOS ADVANCED OS FLEX 300ML","OSMIIUM",244,"27042023015","27/04/2026","04/26",55,""]
["Venda-PRD00142",272,"17/04/2025","Venda",240,"PRD00142","LIQUIDO ATIVADOR OSMIUM 1L","OSMIIUM",243,"2003250021","31/03/2028","03/28",27,""]
["Venda-PRD00139",271,"17/04/2025","Venda",237,"PRD00139","CR BASE CALCIO OSMIUM 2KG","OSMIIUM",242,"0602250003","29/02/2028","02/28",31,""]
["Venda-PRD00298",270,"17/04/2025","Venda",355,"PRD00298","CR ALISANTE SODIO OSMIUM 1KG","OSMIIUM",241,"0405240078","31/05/2026","05/26",7,""]
["Venda-PRD00152",269,"17/04/2025","Venda",250,"PRD00152","MASC COND CACHOS OSM 500ML","OSMIIUM",240,"1204240012","30/04/2027","04/27",121,""]
["Venda-PRD00148",268,"17/04/2025","Venda",246,"PRD00148","MASC COND CACHOS OSM 300ML","OSMIIUM",239,"21122023165","26/12/2026","12/26",2,""]
{"$rows_left_out":238}