{"text_format":"1","workbook":"xlsx","n_sheets":8,"sheets":["Assistente","Calcular","Informações","BaseFuncionarios","GerarManualColorido","GerarManualPB","Modelo","CBO"],"not_rendered":{"charts":0,"images":12,"macros":1,"external_links":0,"defined_names":21,"comments":0,"pivot_tables":0},"unopened":[],"bounds":{"document_bytes":16777216,"sheet_cells":100000,"rows_first":2000,"rows_last":500,"rows_between":2000,"halvings":0,"cell_chars":16384,"cell_head_chars":4096},"cells_cut":0,"cells_raw":0,"read":"whole","date_system":"1900"}

{"sheet":"Assistente","index":0,"n_rows":79,"n_cols":19,"rows_kept":79,"cut":false,"hidden":false,"merged":[[0,3,0,16],[36,2,36,3],[36,6,36,7],[36,8,36,10],[36,11,36,12],[37,2,37,3],[37,6,37,7],[37,8,37,10],[37,11,37,12],[29,10,29,12],[30,2,34,6],[30,7,30,9],[30,10,30,12],[31,7,31,9],[31,10,31,12],[32,7,32,12],[33,7,34,9],[33,10,34,12],[24,15,36,15],[24,16,36,16],[25,3,25,5],[25,7,25,9],[25,10,25,12],[26,3,26,5],[26,7,26,9],[26,10,26,12],[27,3,27,5],[27,7,27,9],[27,10,27,12],[28,3,28,5],[28,7,28,9],[28,10,28,12],[29,3,29,5],[29,7,29,9],[24,3,24,5],[24,7,24,9],[24,10,24,12],[21,3,21,5],[21,7,21,9],[21,10,21,12],[22,3,22,5],[22,7,22,9],[22,10,22,12],[15,7,15,9],[15,10,15,12],[16,3,16,5],[16,7,16,9],[16,10,16,12],[2,14,37,14],[3,15,21,15],[4,3,4,5],[4,6,4,12],[19,3,19,5],[19,7,19,9],[19,10,19,12],[20,3,20,5],[20,7,20,9],[20,10,20,12],[17,3,17,5],[17,7,17,9],[17,10,17,12],[18,3,18,5],[18,7,18,9],[18,10,18,12],[23,3,23,5],[23,7,23,9],[23,10,23,12],[14,3,14,5],[14,7,14,9],[66,7,66,9],[66,10,66,12],[67,3,67,5],[67,7,67,9],[67,10,67,12],[40,1,40,17],[65,3,65,5],[65,7,65,9],[4,16,21,16],[5,2,5,12],[6,3,6,5],[7,3,7,5],[7,6,7,12],[8,2,8,12],[9,3,9,5],[9,7,9,9],[9,10,9,12],[10,3,10,5],[10,7,10,9],[10,10,10,12],[14,10,14,12],[15,3,15,5],[2,2,3,5],[2,6,3,12],[11,3,11,5],[11,7,11,9],[11,10,11,12],[12,3,12,5],[12,7,12,9],[12,10,12,12],[13,3,13,5],[13,7,13,9],[13,10,13,12],[65,15,77,15],[65,16,77,16],[66,3,66,5],[78,2,78,3],[78,6,78,7],[78,8,78,10],[78,11,78,12],[70,3,70,5],[70,7,70,9],[70,10,70,12],[71,2,75,6],[71,7,71,9],[71,10,71,12],[74,10,75,12],[77,2,77,3],[77,6,77,7],[77,8,77,10],[77,11,77,12],[72,7,72,9],[72,10,72,12],[73,7,73,12],[74,7,75,9],[68,3,68,5],[68,7,68,9],[69,3,69,5],[69,7,69,9],[69,10,69,12],[62,3,62,5],[62,7,62,9],[62,10,62,12],[63,3,63,5],[63,7,63,9],[63,10,63,12],[64,3,64,5],[64,7,64,9],[64,10,64,12],[65,10,65,12],[68,10,68,12],[45,16,62,16],[46,2,46,12],[47,3,47,5],[48,3,48,5],[48,6,48,12],[49,2,49,12],[50,3,50,5],[50,7,50,9],[50,10,50,12],[51,3,51,5],[52,10,52,12],[53,3,53,5],[53,7,53,9],[59,7,59,9],[59,10,59,12],[60,3,60,5],[60,7,60,9],[60,10,60,12],[45,3,45,5],[53,10,53,12],[54,3,54,5],[54,7,54,9],[54,10,54,12],[55,3,55,5],[43,2,44,5],[43,6,44,12],[43,14,78,14],[44,15,62,15],[45,6,45,12],[51,7,51,9],[51,10,51,12],[52,3,52,5],[52,7,52,9],[57,7,57,9],[57,10,57,12],[58,3,58,5],[58,7,58,9],[58,10,58,12],[59,3,59,5],[55,7,55,9],[55,10,55,12],[61,3,61,5],[61,7,61,9],[61,10,61,12],[56,3,56,5],[56,7,56,9],[56,10,56,12],[57,3,57,5]]}
["Desenvolvido por www.evandrogf.com.br",null,null,"Holerite Fácil. Versão 1.7"]
[]
[null,null,{"$f":"NomeEmpresa","v":"Empresa Fictícia LTDA"},null,null,null,"Recibo de Pagamento de Salário",null,null,null,null,null,null,null,"DECLARO TER RECEBIDO  A I MPOTÂNCIA LÍQUIDA DISCRIMINADA NESTE RECIBO\n"]
[null,null,null,null,null,null,null,null,null,null,null,null,null,null,null,"________________________________"]
[null,null,"CNPJ:",{"$f":"CnpjFormatado","v":"12.345.675/3342-11"},null,null,{"$f":"MesRef&\"/\"&AnoRef","v":"Março/2018"},null,null,null,null,null,null,null,null,null,"ASSINATURA DO FUNCIONÁRIO"]
[]
[null,null,"Código","Nome do Funcionário",null,null,"CBO","Emp.","Local","Depto.","Setor","Seção","Fl."]
[null,null,{"$f":"CodFuncionario","v":1},{"$f":"IF(MAX(BaseFuncionarios!A:A)=0,\"Nenhum funcionário cadastrado\",IFERROR(VLOOKUP(C8,BaseFuncionarios!A:C,2,0),\"Não encontrado\"))","v":"João"},null,null,{"$f":"IFERROR(VLOOKUP(C8,BaseFuncionarios!A:F,3,0)&\" - \"&VLOOKUP(C8,BaseFuncionarios!A:F,4,0),\"\")","v":"3331-05 - Instrutor de cursos livres"}]
[]
[null,null,"Cód.","Descrição",null,null,"Referência","Vencimentos",null,null,"Descontos"]
{"$rows_left_out":70}
{"sheet":"Calcular","index":1,"n_rows":19,"n_cols":15,"rows_kept":19,"cut":false,"hidden":true,"merged":[[18,14,18,16],[0,14,0,16],[12,14,12,16],[13,14,13,16],[14,14,14,16],[15,14,15,16],[16,14,16,16],[17,14,17,16],[6,14,6,16],[7,14,7,16],[8,14,8,16],[9,14,9,16],[10,14,10,16],[11,14,11,16],[5,14,5,16],[0,11,0,13],[1,14,1,16],[2,14,2,16],[3,14,3,16],[4,14,4,16],[1,11,1,13],[2,11,2,13],[3,11,3,13],[4,11,4,13],[5,11,5,13],[6,11,6,13],[18,11,18,13],[7,11,7,13],[8,11,8,13],[9,11,9,13],[10,11,10,13],[11,11,11,13],[12,11,12,13],[13,11,13,13],[14,11,14,13],[15,11,15,13],[16,11,16,13],[17,11,17,13]]}
[null,"SALÁRIO","VENCIMENTOS","SERV. EXTRAORDINARIO 50%","SERV. EXTRAORDINÁRIO 100%","ABONO DE FÉRIAS (1/3)","ADIANTAMENTO DE SALÁRIO","HORAS FALTA","FALTAS EM DIAS","INSS","IRRF","venc",null,null,"desc"]
[{"$f":"Assistente!D12","v":"SALÁRIO"},{"$f":"IF($A2=B$1,Assistente!$C$38,0)","v":1837},{"$f":"IF($A2=C$1,Assistente!$C$38,0)","v":0},{"$f":"IF($A2=D$1,Assistente!$C$38/220*1.5*Assistente!G12,0)","v":0},{"$f":"IF($A2=E$1,Assistente!$C$38/220*2*Assistente!G12,0)","v":0},{"$f":"IF($A2=F$1,Assistente!$C$38/3,0)","v":0},{"$f":"IF($A2=G$1,Assistente!$C$38*Assistente!G12,0)","v":0},{"$f":"-IF($A2=H$1,Assistente!$C$38/220*Assistente!G12,0)","v":0},{"$f":"-IF($A2=I$1,Assistente!$C$38/30*Assistente!G12,0)","v":0},{"$f":"-IF($A2=J$1,Assistente!$C$38*VLOOKUP(Assistente!$C$38,tabINSS,2,1),0)","v":0},{"$f":"-IF($A2=K$1,Assistente!$C$38*VLOOKUP(Assistente!$C$38,tabIRRF,2,1)-VLOOKUP(Assistente!$C$38,tabIRRF,3,1),0)","v":0},{"$f":"IF(SUMIF(B2:K2,\">0\")=0,\"\",SUMIF(B2:K2,\">0\"))","v":1837},null,null,{"$f":"IF(SUMIF(B2:K2,\"<0\")*-1=0,\"\",SUMIF(B2:K2,\"<0\")*-1)","v":""}]
[{"$f":"Assistente!D13","v":"INSS"},{"$f":"IF($A3=B$1,Assistente!$C$38,0)","v":0},{"$f":"IF($A3=C$1,Assistente!$C$38,0)","v":0},{"$f":"IF($A3=D$1,Assistente!$C$38/220*1.5*Assistente!G13,0)","v":0},{"$f":"IF($A3=E$1,Assistente!$C$38/220*2*Assistente!G13,0)","v":0},{"$f":"IF($A3=F$1,Assistente!$C$38/3,0)","v":0},{"$f":"IF($A3=G$1,Assistente!$C$38*Assistente!G13,0)","v":0},{"$f":"-IF($A3=H$1,Assistente!$C$38/220*Assistente!G13,0)","v":0},{"$f":"-IF($A3=I$1,Assistente!$C$38/30*Assistente!G13,0)","v":0},{"$f":"-IF($A3=J$1,Assistente!$C$38*VLOOKUP(Assistente!$C$38,tabINSS,2,1),0)","v":-146.96},{"$f":"-IF($A3=K$1,Assistente!$C$38*VLOOKUP(Assistente!$C$38,tabIRRF,2,1)-VLOOKUP(Assistente!$C$38,tabIRRF,3,1),0)","v":0},{"$f":"IF(SUMIF(B3:K3,\">0\")=0,\"\",SUMIF(B3:K3,\">0\"))","v":""},null,null,{"$f":"IF(SUMIF(B3:K3,\"<0\")*-1=0,\"\",SUMIF(B3:K3,\"<0\")*-1)","v":146.96}]
[{"$f":"Assistente!D14","v":"IRRF"},{"$f":"IF($A4=B$1,Assistente!$C$38,0)","v":0},{"$f":"IF($A4=C$1,Assistente!$C$38,0)","v":0},{"$f":"IF($A4=D$1,Assistente!$C$38/220*1.5*Assistente!G14,0)","v":0},{"$f":"IF($A4=E$1,Assistente!$C$38/220*2*Assistente!G14,0)","v":0},{"$f":"IF($A4=F$1,Assistente!$C$38/3,0)","v":0},{"$f":"IF($A4=G$1,Assistente!$C$38*Assistente!G14,0)","v":0},{"$f":"-IF($A4=H$1,Assistente!$C$38/220*Assistente!G14,0)","v":0},{"$f":"-IF($A4=I$1,Assistente!$C$38/30*Assistente!G14,0)","v":0},{"$f":"-IF($A4=J$1,Assistente!$C$38*VLOOKUP(Assistente!$C$38,tabINSS,2,1),0)","v":0},{"$f":"-IF($A4=K$1,Assistente!$C$38*VLOOKUP(Assistente!$C$38,tabIRRF,2,1)-VLOOKUP(Assistente!$C$38,tabIRRF,3,1),0)","v":0},"",null,null,""]
[{"$f":"Assistente!D15","v":"SERV. EXTRAORDINARIO 50%"},{"$f":"IF($A5=B$1,Assistente!$C$38,0)","v":0},{"$f":"IF($A5=C$1,Assistente!$C$38,0)","v":0},{"$f":"IF($A5=D$1,Assistente!$C$38/220*1.5*Assistente!G15,0)","v":150.29999999999998},{"$f":"IF($A5=E$1,Assistente!$C$38/220*2*Assistente!G15,0)","v":0},{"$f":"IF($A5=F$1,Assistente!$C$38/3,0)","v":0},{"$f":"IF($A5=G$1,Assistente!$C$38*Assistente!G15,0)","v":0},{"$f":"-IF($A5=H$1,Assistente!$C$38/220*Assistente!G15,0)","v":0},{"$f":"-IF($A5=I$1,Assistente!$C$38/30*Assistente!G15,0)","v":0},{"$f":"-IF($A5=J$1,Assistente!$C$38*VLOOKUP(Assistente!$C$38,tabINSS,2,1),0)","v":0},{"$f":"-IF($A5=K$1,Assistente!$C$38*VLOOKUP(Assistente!$C$38,tabIRRF,2,1)-VLOOKUP(Assistente!$C$38,tabIRRF,3,1),0)","v":0},150.29999999999998,null,null,""]
[{"$f":"Assistente!D16","v":"ADIANTAMENTO DE SALÁRIO"},{"$f":"IF($A6=B$1,Assistente!$C$38,0)","v":0},{"$f":"IF($A6=C$1,Assistente!$C$38,0)","v":0},{"$f":"IF($A6=D$1,Assistente!$C$38/220*1.5*Assistente!G16,0)","v":0},{"$f":"IF($A6=E$1,Assistente!$C$38/220*2*Assistente!G16,0)","v":0},{"$f":"IF($A6=F$1,Assistente!$C$38/3,0)","v":0},{"$f":"IF($A6=G$1,Assistente!$C$38*Assistente!G16,0)","v":0},{"$f":"-IF($A6=H$1,Assistente!$C$38/220*Assistente!G16,0)","v":0},{"$f":"-IF($A6=I$1,Assistente!$C$38/30*Assistente!G16,0)","v":0},{"$f":"-IF($A6=J$1,Assistente!$C$38*VLOOKUP(Assistente!$C$38,tabINSS,2,1),0)","v":0},{"$f":"-IF($A6=K$1,Assistente!$C$38*VLOOKUP(Assistente!$C$38,tabIRRF,2,1)-VLOOKUP(Assistente!$C$38,tabIRRF,3,1),0)","v":0},"",null,null,""]
[{"$f":"Assistente!D17","v":"VALE TRANSPORTE"},{"$f":"IF($A7=B$1,Assistente!$C$38,0)","v":0},{"$f":"IF($A7=C$1,Assistente!$C$38,0)","v":0},{"$f":"IF($A7=D$1,Assistente!$C$38/220*1.5*Assistente!G17,0)","v":0},{"$f":"IF($A7=E$1,Assistente!$C$38/220*2*Assistente!G17,0)","v":0},{"$f":"IF($A7=F$1,Assistente!$C$38/3,0)","v":0},{"$f":"IF($A7=G$1,Assistente!$C$38*Assistente!G17,0)","v":0},{"$f":"-IF($A7=H$1,Assistente!$C$38/220*Assistente!G17,0)","v":0},{"$f":"-IF($A7=I$1,Assistente!$C$38/30*Assistente!G17,0)","v":0},{"$f":"-IF($A7=J$1,Assistente!$C$38*VLOOKUP(Assistente!$C$38,tabINSS,2,1),0)","v":0},{"$f":"-IF($A7=K$1,Assistente!$C$38*VLOOKUP(Assistente!$C$38,tabIRRF,2,1)-VLOOKUP(Assistente!$C$38,tabIRRF,3,1),0)","v":0},"",null,null,""]
[{"$f":"Assistente!D18","v":0},{"$f":"IF($A8=B$1,Assistente!$C$38,0)","v":0},{"$f":"IF($A8=C$1,Assistente!$C$38,0)","v":0},{"$f":"IF($A8=D$1,Assistente!$C$38/220*1.5*Assistente!G18,0)","v":0},{"$f":"IF($A8=E$1,Assistente!$C$38/220*2*Assistente!G18,0)","v":0},{"$f":"IF($A8=F$1,Assistente!$C$38/3,0)","v":0},{"$f":"IF($A8=G$1,Assistente!$C$38*Assistente!G18,0)","v":0},{"$f":"-IF($A8=H$1,Assistente!$C$38/220*Assistente!G18,0)","v":0},{"$f":"-IF($A8=I$1,Assistente!$C$38/30*Assistente!G18,0)","v":0},{"$f":"-IF($A8=J$1,Assistente!$C$38*VLOOKUP(Assistente!$C$38,tabINSS,2,1),0)","v":0},{"$f":"-IF($A8=K$1,Assistente!$C$38*VLOOKUP(Assistente!$C$38,tabIRRF,2,1)-VLOOKUP(Assistente!$C$38,tabIRRF,3,1),0)","v":0},"",null,null,""]
[{"$f":"Assistente!D19","v":0},{"$f":"IF($A9=B$1,Assistente!$C$38,0)","v":0},{"$f":"IF($A9=C$1,Assistente!$C$38,0)","v":0},{"$f":"IF($A9=D$1,Assistente!$C$38/220*1.5*Assistente!G19,0)","v":0},{"$f":"IF($A9=E$1,Assistente!$C$38/220*2*Assistente!G19,0)","v":0},{"$f":"IF($A9=F$1,Assistente!$C$38/3,0)","v":0},{"$f":"IF($A9=G$1,Assistente!$C$38*Assistente!G19,0)","v":0},{"$f":"-IF($A9=H$1,Assistente!$C$38/220*Assistente!G19,0)","v":0},{"$f":"-IF($A9=I$1,Assistente!$C$38/30*Assistente!G19,0)","v":0},{"$f":"-IF($A9=J$1,Assistente!$C$38*VLOOKUP(Assistente!$C$38,tabINSS,2,1),0)","v":0},{"$f":"-IF($A9=K$1,Assistente!$C$38*VLOOKUP(Assistente!$C$38,tabIRRF,2,1)-VLOOKUP(Assistente!$C$38,tabIRRF,3,1),0)","v":0},"",null,null,""]
[{"$f":"Assistente!D20","v":0},{"$f":"IF($A10=B$1,Assistente!$C$38,0)","v":0},{"$f":"IF($A10=C$1,Assistente!$C$38,0)","v":0},{"$f":"IF($A10=D$1,Assistente!$C$38/220*1.5*Assistente!G20,0)","v":0},{"$f":"IF($A10=E$1,Assistente!$C$38/220*2*Assistente!G20,0)","v":0},{"$f":"IF($A10=F$1,Assistente!$C$38/3,0)","v":0},{"$f":"IF($A10=G$1,Assistente!$C$38*Assistente!G20,0)","v":0},{"$f":"-IF($A10=H$1,Assistente!$C$38/220*Assistente!G20,0)","v":0},{"$f":"-IF($A10=I$1,Assistente!$C$38/30*Assistente!G20,0)","v":0},{"$f":"-IF($A10=J$1,Assistente!$C$38*VLOOKUP(Assistente!$C$38,tabINSS,2,1),0)","v":0},{"$f":"-IF($A10=K$1,Assistente!$C$38*VLOOKUP(Assistente!$C$38,tabIRRF,2,1)-VLOOKUP(Assistente!$C$38,tabIRRF,3,1),0)","v":0},"",null,null,""]
{"$rows_left_out":10}
{"sheet":"Informações","index":2,"n_rows":33,"n_cols":12,"rows_kept":33,"cut":false,"hidden":true,"merged":[]}
["SALÁRIO DE CONTRIBUIÇÃO (R$)","ALÍQUOTA INSS",null,null,null,null,null,"Base de cálculo (R$)","Alíquota (%)","Parcela a deduzir do IRPF (R$)",null,"Meses"]
["até 1.693,72",0.08,null,0,{"$f":"B2","v":0.08},null,null,0,0,0,1,"Janeiro"]
["de 1.693,73 até 2.822,90",0.09,null,{"$f":"RIGHT(A2,8)","v":"1.693,72"},{"$f":"B3","v":0.09},null,null,1903.98,7.4999999999999997E-2,142.80000000000001,2,"Fevereiro"]
["de 2.822,91 até 5.645,80",0.11,null,{"$f":"RIGHT(A3,8)","v":"2.822,90"},{"$f":"B4","v":0.11},null,null,2826.65,0.15,354.8,3,"Março"]
[null,null,null,null,null,null,null,3751.05,0.22500000000000001,636.13,4,"Abril"]
[null,null,null,null,null,null,null,4664.68,0.27500000000000002,869.36,5,"Maio"]
[null,null,null,null,null,null,null,null,null,null,null,"Junho"]
["DESCRIÇÃO","COD",null,null,null,null,null,"Nome da empresa","Empresa Fictícia LTDA",null,null,"Julho"]
["SALÁRIO",1,null,null,null,null,null,"CNPJ da empresa","12345675334211",null,null,"Agosto"]
["VENCIMENTOS",2,null,null,null,null,null,"Mês Ref","Março",null,null,"Setembro"]
{"$rows_left_out":24}
{"sheet":"BaseFuncionarios","index":3,"n_rows":2,"n_cols":5,"rows_kept":2,"cut":false,"hidden":true,"merged":[]}
["Cod","Nome","CBO","Ocupação","Salário"]
[1,"João","3331-05","Instrutor de cursos livres",1837]

{"sheet":"GerarManualColorido","index":4,"n_rows":85,"n_cols":17,"rows_kept":85,"cut":false,"hidden":false,"merged":[[17,10,17,12],[18,3,18,5],[18,7,18,9],[18,10,18,12],[19,3,19,5],[19,7,19,9],[19,10,19,12],[10,16,27,16],[11,2,11,12],[12,3,12,5],[13,3,13,5],[13,6,13,12],[14,2,14,12],[15,3,15,5],[15,7,15,9],[15,10,15,12],[16,3,16,5],[8,14,43,14],[9,15,27,15],[10,6,10,12],[16,7,16,9],[16,10,16,12],[17,3,17,5],[17,7,17,9],[22,3,22,5],[22,7,22,9],[22,10,22,12],[23,3,23,5],[23,7,23,9],[23,10,23,12],[20,3,20,5],[20,7,20,9],[20,10,20,12],[21,3,21,5],[21,7,21,9],[21,10,21,12],[26,3,26,5],[26,7,26,9],[26,10,26,12],[27,3,27,5],[27,7,27,9],[27,10,27,12],[24,3,24,5],[24,7,24,9],[24,10,24,12],[25,3,25,5],[25,7,25,9],[25,10,25,12],[30,15,42,15],[30,16,42,16],[31,3,31,5],[31,7,31,9],[31,10,31,12],[32,3,32,5],[32,7,32,9],[28,3,28,5],[28,7,28,9],[28,10,28,12],[29,3,29,5],[29,7,29,9],[29,10,29,12],[32,10,32,12],[33,3,33,5],[33,7,33,9],[33,10,33,12],[34,3,34,5],[34,7,34,9],[34,10,34,12],[30,3,30,5],[30,7,30,9],[30,10,30,12],[35,3,35,5],[35,7,35,9],[35,10,35,12],[36,2,40,6],[36,7,36,9],[36,10,36,12],[37,7,37,9],[37,10,37,12],[38,7,38,12],[39,7,40,9],[39,10,40,12],[42,2,42,3],[42,6,42,7],[42,8,42,10],[42,11,42,12],[43,2,43,3],[43,6,43,7],[43,8,43,10],[43,11,43,12],[54,3,54,5],[54,6,54,12],[55,2,55,12],[56,3,56,5],[56,7,56,9],[56,10,56,12],[46,1,46,17],[49,2,50,5],[49,6,50,12],[49,14,84,14],[50,15,68,15],[51,2,51,5],[51,6,51,12],[51,16,68,16],[52,2,52,12],[53,3,53,5],[59,3,59,5],[59,7,59,9],[59,10,59,12],[60,3,60,5],[60,7,60,9],[60,10,60,12],[57,3,57,5],[57,7,57,9],[57,10,57,12],[58,3,58,5],[58,7,58,9],[58,10,58,12],[63,3,63,5],[63,7,63,9],[63,10,63,12],[64,3,64,5],[64,7,64,9],[64,10,64,12],[61,3,61,5],[61,7,61,9],[61,10,61,12],[62,3,62,5],[62,7,62,9],[62,10,62,12],[68,3,68,5],[68,7,68,9],[68,10,68,12],[65,3,65,5],[65,7,65,9],[65,10,65,12],[66,3,66,5],[66,7,66,9],[66,10,66,12],[67,3,67,5],[67,7,67,9],[67,10,67,12],[71,15,83,15],[71,16,83,16],[72,3,72,5],[72,7,72,9],[72,10,72,12],[73,3,73,5],[73,7,73,9],[69,3,69,5],[69,7,69,9],[69,10,69,12],[70,3,70,5],[70,7,70,9],[70,10,70,12],[73,10,73,12],[74,3,74,5],[74,7,74,9],[74,10,74,12],[75,3,75,5],[75,7,75,9],[75,10,75,12],[71,3,71,5],[71,7,71,9],[71,10,71,12],[76,3,76,5],[1,11,1,15],[2,11,2,15],[10,3,10,5],[4,7,4,10],[4,11,4,15],[1,4,1,5],[2,4,2,5],[3,4,3,5],[4,4,4,5],[5,4,5,5],[1,7,1,10],[2,7,2,10],[1,1,1,3],[2,1,2,3],[3,1,3,3],[4,1,4,3],[5,1,5,3],[8,2,9,5],[8,6,9,12],[83,2,83,3],[83,6,83,7],[83,8,83,10],[83,11,83,12],[84,2,84,3],[84,6,84,7],[84,8,84,10],[84,11,84,12],[76,7,76,9],[76,10,76,12],[77,2,81,6],[77,7,77,9],[77,10,77,12],[78,7,78,9],[78,10,78,12],[79,7,79,12],[80,7,81,9],[80,10,81,12]]}
[]
[null,"Nome da empresa",null,null,"Nome fantasia LTDA",null,null,"Cargo do funcionário",null,null,null,"Instrutor"]
[null,"CNPJ",null,null,123456789000189,null,null,"Salário do funcionário",null,null,null,1844]
[null,"Código do funcionário",null,null,105]
[null,"Nome do funcionário",null,null,"Evandro Gomes Ferreira",null,null,"Referente à",null,null,null,"Junho/2018"]
[null,"Código CBO",null,null,"2332-25"]
[]
[]
[null,null,"00.0067 - Compuclass Informática LTDA",null,null,null,"Recibo de Pagamento de Salário",null,null,null,null,null,null,null,"DECLARO TER RECEBIDO  A I MPOTÂNCIA LÍQUIDA DISCRIMINADA NESTE RECIBO\n"]
[null,null,null,null,null,null,null,null,null,null,null,null,null,null,null,"________________________________"]
{"$rows_left_out":76}
{"sheet":"GerarManualPB","index":5,"n_rows":85,"n_cols":17,"rows_kept":85,"cut":false,"hidden":false,"merged":[[3,1,3,3],[3,4,3,5],[4,1,4,3],[4,4,4,5],[4,7,4,10],[4,11,4,15],[1,1,1,3],[1,4,1,5],[1,7,1,10],[1,11,1,15],[2,1,2,3],[2,4,2,5],[2,7,2,10],[2,11,2,15],[5,1,5,3],[5,4,5,5],[8,2,9,5],[8,6,9,12],[8,14,43,14],[9,15,27,15],[10,3,10,5],[10,6,10,12],[16,7,16,9],[16,10,16,12],[17,3,17,5],[17,7,17,9],[17,10,17,12],[18,3,18,5],[18,7,18,9],[18,10,18,12],[25,10,25,12],[26,3,26,5],[26,7,26,9],[26,10,26,12],[23,3,23,5],[23,7,23,9],[23,10,23,12],[24,3,24,5],[10,16,27,16],[11,2,11,12],[12,3,12,5],[13,3,13,5],[13,6,13,12],[14,2,14,12],[15,3,15,5],[15,7,15,9],[15,10,15,12],[16,3,16,5],[21,3,21,5],[21,7,21,9],[21,10,21,12],[22,3,22,5],[22,7,22,9],[22,10,22,12],[19,3,19,5],[19,7,19,9],[19,10,19,12],[20,3,20,5],[20,7,20,9],[20,10,20,12],[25,3,25,5],[25,7,25,9],[24,7,24,9],[24,10,24,12],[29,3,29,5],[29,7,29,9],[29,10,29,12],[30,3,30,5],[30,7,30,9],[30,10,30,12],[27,3,27,5],[27,7,27,9],[27,10,27,12],[28,3,28,5],[28,7,28,9],[28,10,28,12],[33,10,33,12],[34,3,34,5],[34,7,34,9],[34,10,34,12],[35,3,35,5],[35,7,35,9],[35,10,35,12],[30,15,42,15],[30,16,42,16],[31,3,31,5],[31,7,31,9],[31,10,31,12],[32,3,32,5],[32,7,32,9],[32,10,32,12],[33,3,33,5],[33,7,33,9],[42,2,42,3],[42,6,42,7],[42,8,42,10],[42,11,42,12],[43,2,43,3],[43,6,43,7],[43,8,43,10],[43,11,43,12],[36,2,40,6],[36,7,36,9],[36,10,36,12],[37,7,37,9],[37,10,37,12],[38,7,38,12],[39,7,40,9],[39,10,40,12],[46,1,46,17],[49,2,50,5],[49,6,50,12],[49,14,84,14],[50,15,68,15],[51,6,51,12],[51,16,68,16],[52,2,52,12],[53,3,53,5],[57,3,57,5],[57,7,57,9],[57,10,57,12],[58,3,58,5],[58,7,58,9],[58,10,58,12],[54,3,54,5],[54,6,54,12],[55,2,55,12],[56,3,56,5],[56,7,56,9],[56,10,56,12],[61,3,61,5],[61,7,61,9],[61,10,61,12],[62,3,62,5],[62,7,62,9],[62,10,62,12],[59,3,59,5],[59,7,59,9],[59,10,59,12],[60,3,60,5],[60,7,60,9],[60,10,60,12],[65,3,65,5],[65,7,65,9],[65,10,65,12],[66,3,66,5],[66,7,66,9],[66,10,66,12],[63,3,63,5],[63,7,63,9],[63,10,63,12],[64,3,64,5],[64,7,64,9],[64,10,64,12],[69,3,69,5],[69,7,69,9],[69,10,69,12],[70,3,70,5],[70,7,70,9],[70,10,70,12],[67,3,67,5],[67,7,67,9],[67,10,67,12],[68,3,68,5],[68,7,68,9],[68,10,68,12],[75,3,75,5],[75,7,75,9],[75,10,75,12],[71,3,71,5],[71,7,71,9],[71,10,71,12],[71,15,83,15],[71,16,83,16],[72,3,72,5],[72,7,72,9],[72,10,72,12],[73,3,73,5],[73,7,73,9],[51,3,51,5],[80,10,81,12],[83,2,83,3],[83,6,83,7],[83,8,83,10],[83,11,83,12],[84,2,84,3],[84,6,84,7],[84,8,84,10],[84,11,84,12],[76,3,76,5],[76,7,76,9],[76,10,76,12],[77,2,81,6],[77,7,77,9],[77,10,77,12],[78,7,78,9],[78,10,78,12],[79,7,79,12],[80,7,81,9],[73,10,73,12],[74,3,74,5],[74,7,74,9],[74,10,74,12]]}
[]
[null,"Nome da empresa",null,null,"Nome fantasia LTDA",null,null,"Cargo do funcionário",null,null,null,"Padeiro"]
[null,"CNPJ",null,null,123456789000189,null,null,"Salário do funcionário",null,null,null,1200]
[null,"Código do funcionário",null,null,105]
[null,"Nome do funcionário",null,null,"João de Jesus",null,null,"Referente à",null,null,null,"Abril/2018"]
[null,"Código CBO",null,null,"7232-40"]
[]
[]
[null,null,{"$f":"E2","v":"Nome fantasia LTDA"},null,null,null,"Recibo de Pagamento de Salário",null,null,null,null,null,null,null,"DECLARO TER RECEBIDO  A I MPOTÂNCIA LÍQUIDA DISCRIMINADA NESTE RECIBO\n"]
[null,null,null,null,null,null,null,null,null,null,null,null,null,null,null,"________________________________"]
{"$rows_left_out":76}
{"sheet":"Modelo","index":6,"n_rows":79,"n_cols":17,"rows_kept":79,"cut":false,"hidden":true,"merged":[[2,2,3,5],[2,6,3,12],[2,14,37,14],[3,15,21,15],[4,3,4,5],[4,6,4,12],[10,7,10,9],[10,10,10,12],[11,3,11,5],[11,7,11,9],[11,10,11,12],[12,3,12,5],[12,7,12,9],[12,10,12,12],[19,10,19,12],[20,3,20,5],[20,7,20,9],[20,10,20,12],[17,3,17,5],[17,7,17,9],[17,10,17,12],[18,3,18,5],[18,7,18,9],[18,10,18,12],[4,16,21,16],[5,2,5,12],[6,3,6,5],[7,3,7,5],[7,6,7,12],[8,2,8,12],[9,3,9,5],[9,7,9,9],[9,10,9,12],[10,3,10,5],[15,3,15,5],[15,7,15,9],[15,10,15,12],[16,3,16,5],[16,7,16,9],[16,10,16,12],[13,3,13,5],[13,7,13,9],[13,10,13,12],[14,3,14,5],[14,7,14,9],[14,10,14,12],[19,3,19,5],[19,7,19,9],[23,3,23,5],[23,7,23,9],[23,10,23,12],[24,3,24,5],[24,7,24,9],[24,10,24,12],[21,3,21,5],[21,7,21,9],[21,10,21,12],[22,3,22,5],[22,7,22,9],[22,10,22,12],[27,10,27,12],[28,3,28,5],[28,7,28,9],[28,10,28,12],[29,3,29,5],[29,7,29,9],[29,10,29,12],[24,15,36,15],[24,16,36,16],[25,3,25,5],[25,7,25,9],[25,10,25,12],[26,3,26,5],[26,7,26,9],[26,10,26,12],[27,3,27,5],[27,7,27,9],[36,2,36,3],[36,6,36,7],[36,8,36,10],[36,11,36,12],[37,2,37,3],[37,6,37,7],[37,8,37,10],[37,11,37,12],[30,2,34,6],[30,7,30,9],[30,10,30,12],[31,7,31,9],[31,10,31,12],[32,7,32,12],[33,7,34,9],[33,10,34,12],[48,3,48,5],[48,6,48,12],[49,2,49,12],[50,3,50,5],[50,7,50,9],[50,10,50,12],[40,1,40,17],[43,2,44,5],[43,6,44,12],[43,14,78,14],[44,15,62,15],[45,3,45,5],[45,6,45,12],[45,16,62,16],[46,2,46,12],[47,3,47,5],[53,3,53,5],[53,7,53,9],[53,10,53,12],[54,3,54,5],[54,7,54,9],[54,10,54,12],[51,3,51,5],[51,7,51,9],[51,10,51,12],[52,3,52,5],[52,7,52,9],[52,10,52,12],[57,3,57,5],[57,7,57,9],[57,10,57,12],[58,3,58,5],[58,7,58,9],[58,10,58,12],[55,3,55,5],[55,7,55,9],[55,10,55,12],[56,3,56,5],[56,7,56,9],[56,10,56,12],[61,3,61,5],[61,7,61,9],[61,10,61,12],[62,3,62,5],[62,7,62,9],[62,10,62,12],[59,3,59,5],[59,7,59,9],[59,10,59,12],[60,3,60,5],[60,7,60,9],[60,10,60,12],[65,15,77,15],[65,16,77,16],[66,3,66,5],[66,7,66,9],[66,10,66,12],[67,3,67,5],[67,7,67,9],[63,3,63,5],[63,7,63,9],[63,10,63,12],[64,3,64,5],[64,7,64,9],[64,10,64,12],[67,10,67,12],[68,3,68,5],[68,7,68,9],[68,10,68,12],[69,3,69,5],[69,7,69,9],[69,10,69,12],[65,3,65,5],[65,7,65,9],[65,10,65,12],[70,3,70,5],[77,2,77,3],[77,6,77,7],[77,8,77,10],[77,11,77,12],[78,2,78,3],[78,6,78,7],[78,8,78,10],[78,11,78,12],[70,7,70,9],[70,10,70,12],[71,2,75,6],[71,7,71,9],[71,10,71,12],[72,7,72,9],[72,10,72,12],[73,7,73,12],[74,7,75,9],[74,10,75,12]]}
[]
[]
[null,null,null,null,null,null,"Recibo de Pagamento de Salário",null,null,null,null,null,null,null,"DECLARO TER RECEBIDO  A I MPOTÂNCIA LÍQUIDA DISCRIMINADA NESTE RECIBO\n"]
[null,null,null,null,null,null,null,null,null,null,null,null,null,null,null,"________________________________"]
[null,null,null,null,null,null,null,null,null,null,null,null,null,null,null,null,"ASSINATURA DO FUNCIONÁRIO"]
[]
[null,null,"Código","Nome do Funcionário",null,null,"CBO","Emp.","Local","Depto.","Setor","Seção","Fl."]
[]
[]
[null,null,"Cód.","Descrição",null,null,"Referência","Vencimentos",null,null,"Descontos"]
{"$rows_left_out":70}
{"sheet":"CBO","index":7,"n_rows":2627,"n_cols":8,"rows_kept":2627,"cut":false,"hidden":true,"merged":[]}
["CBO","Letra","TITULO",null,"LETRA","I",{"$f":"VLOOKUP(F1,B2:C2627,2,0)","v":"Identificador florestal"},"Instrutor de cursos livres"]
["8485-05",{"$f":"LEFT(C2,1)","v":"A"},"Abatedor",null,null,null,{"$f":"INDIRECT(\"A\"&MATCH(escolha,cbo,0))","v":"3331-05"}]
["7643-05",{"$f":"LEFT(C3,1)","v":"A"},"Acabador de calçados"]
["7663-05","A","Acabador de embalagens (flexíveis e cartotécnicas)"]
["7161-05","A","Acabador de superfícies de concreto"]
["8485-10","A","Açougueiro"]
["3762-05","A","Acrobata"]
["6230-05","A","Adestrador de animais"]
["2521-05","A","Administrador"]
["2123-05","A","Administrador de banco de dados"]
{"$rows_left_out":2617}